<?xml version="1.0" encoding="utf-8" standalone="no"?>
<!DOCTYPE svg PUBLIC "-//W3C//DTD SVG 1.1//EN"
  "http://www.w3.org/Graphics/SVG/1.1/DTD/svg11.dtd">
<svg xmlns:xlink="http://www.w3.org/1999/xlink" width="1080pt" height="1080pt" viewBox="0 0 1080 1080" xmlns="http://www.w3.org/2000/svg" version="1.1">
 <metadata>
  <rdf:RDF xmlns:dc="http://purl.org/dc/elements/1.1/" xmlns:cc="http://creativecommons.org/ns#" xmlns:rdf="http://www.w3.org/1999/02/22-rdf-syntax-ns#">
   <cc:Work>
    <dc:type rdf:resource="http://purl.org/dc/dcmitype/StillImage"/>
    <dc:date>2023-12-18T17:28:59.491609</dc:date>
    <dc:format>image/svg+xml</dc:format>
    <dc:creator>
     <cc:Agent>
      <dc:title>Matplotlib v3.8.0, https://matplotlib.org/</dc:title>
     </cc:Agent>
    </dc:creator>
   </cc:Work>
  </rdf:RDF>
 </metadata>
 <defs>
  <style type="text/css">*{stroke-linejoin: round; stroke-linecap: butt}</style>
 </defs>
 <g id="figure_1">
  <g id="patch_1">
   <path d="M 0 1080 
L 1080 1080 
L 1080 0 
L 0 0 
z
" style="fill: #ffffff"/>
  </g>
  <g id="axes_1">
   <g id="patch_2">
    <path d="M 57.17 253.22 
L 534.6 253.22 
L 534.6 26.88 
L 57.17 26.88 
z
" style="fill: #ffffff"/>
   </g>
   <g id="matplotlib.axis_1">
    <g id="text_1">
     <!-- Time Increasing -->
     <g transform="translate(256.249062 264.818437) scale(0.1 -0.1)">
      <defs>
       <path id="DejaVuSans-54" d="M -19 4666 
L 3928 4666 
L 3928 4134 
L 2272 4134 
L 2272 0 
L 1638 0 
L 1638 4134 
L -19 4134 
L -19 4666 
z
" transform="scale(0.015625)"/>
       <path id="DejaVuSans-69" d="M 603 3500 
L 1178 3500 
L 1178 0 
L 603 0 
L 603 3500 
z
M 603 4863 
L 1178 4863 
L 1178 4134 
L 603 4134 
L 603 4863 
z
" transform="scale(0.015625)"/>
       <path id="DejaVuSans-6d" d="M 3328 2828 
Q 3544 3216 3844 3400 
Q 4144 3584 4550 3584 
Q 5097 3584 5394 3201 
Q 5691 2819 5691 2113 
L 5691 0 
L 5113 0 
L 5113 2094 
Q 5113 2597 4934 2840 
Q 4756 3084 4391 3084 
Q 3944 3084 3684 2787 
Q 3425 2491 3425 1978 
L 3425 0 
L 2847 0 
L 2847 2094 
Q 2847 2600 2669 2842 
Q 2491 3084 2119 3084 
Q 1678 3084 1418 2786 
Q 1159 2488 1159 1978 
L 1159 0 
L 581 0 
L 581 3500 
L 1159 3500 
L 1159 2956 
Q 1356 3278 1631 3431 
Q 1906 3584 2284 3584 
Q 2666 3584 2933 3390 
Q 3200 3197 3328 2828 
z
" transform="scale(0.015625)"/>
       <path id="DejaVuSans-65" d="M 3597 1894 
L 3597 1613 
L 953 1613 
Q 991 1019 1311 708 
Q 1631 397 2203 397 
Q 2534 397 2845 478 
Q 3156 559 3463 722 
L 3463 178 
Q 3153 47 2828 -22 
Q 2503 -91 2169 -91 
Q 1331 -91 842 396 
Q 353 884 353 1716 
Q 353 2575 817 3079 
Q 1281 3584 2069 3584 
Q 2775 3584 3186 3129 
Q 3597 2675 3597 1894 
z
M 3022 2063 
Q 3016 2534 2758 2815 
Q 2500 3097 2075 3097 
Q 1594 3097 1305 2825 
Q 1016 2553 972 2059 
L 3022 2063 
z
" transform="scale(0.015625)"/>
       <path id="DejaVuSans-20" transform="scale(0.015625)"/>
       <path id="DejaVuSans-49" d="M 628 4666 
L 1259 4666 
L 1259 0 
L 628 0 
L 628 4666 
z
" transform="scale(0.015625)"/>
       <path id="DejaVuSans-6e" d="M 3513 2113 
L 3513 0 
L 2938 0 
L 2938 2094 
Q 2938 2591 2744 2837 
Q 2550 3084 2163 3084 
Q 1697 3084 1428 2787 
Q 1159 2491 1159 1978 
L 1159 0 
L 581 0 
L 581 3500 
L 1159 3500 
L 1159 2956 
Q 1366 3272 1645 3428 
Q 1925 3584 2291 3584 
Q 2894 3584 3203 3211 
Q 3513 2838 3513 2113 
z
" transform="scale(0.015625)"/>
       <path id="DejaVuSans-63" d="M 3122 3366 
L 3122 2828 
Q 2878 2963 2633 3030 
Q 2388 3097 2138 3097 
Q 1578 3097 1268 2742 
Q 959 2388 959 1747 
Q 959 1106 1268 751 
Q 1578 397 2138 397 
Q 2388 397 2633 464 
Q 2878 531 3122 666 
L 3122 134 
Q 2881 22 2623 -34 
Q 2366 -91 2075 -91 
Q 1284 -91 818 406 
Q 353 903 353 1747 
Q 353 2603 823 3093 
Q 1294 3584 2113 3584 
Q 2378 3584 2631 3529 
Q 2884 3475 3122 3366 
z
" transform="scale(0.015625)"/>
       <path id="DejaVuSans-72" d="M 2631 2963 
Q 2534 3019 2420 3045 
Q 2306 3072 2169 3072 
Q 1681 3072 1420 2755 
Q 1159 2438 1159 1844 
L 1159 0 
L 581 0 
L 581 3500 
L 1159 3500 
L 1159 2956 
Q 1341 3275 1631 3429 
Q 1922 3584 2338 3584 
Q 2397 3584 2469 3576 
Q 2541 3569 2628 3553 
L 2631 2963 
z
" transform="scale(0.015625)"/>
       <path id="DejaVuSans-61" d="M 2194 1759 
Q 1497 1759 1228 1600 
Q 959 1441 959 1056 
Q 959 750 1161 570 
Q 1363 391 1709 391 
Q 2188 391 2477 730 
Q 2766 1069 2766 1631 
L 2766 1759 
L 2194 1759 
z
M 3341 1997 
L 3341 0 
L 2766 0 
L 2766 531 
Q 2569 213 2275 61 
Q 1981 -91 1556 -91 
Q 1019 -91 701 211 
Q 384 513 384 1019 
Q 384 1609 779 1909 
Q 1175 2209 1959 2209 
L 2766 2209 
L 2766 2266 
Q 2766 2663 2505 2880 
Q 2244 3097 1772 3097 
Q 1472 3097 1187 3025 
Q 903 2953 641 2809 
L 641 3341 
Q 956 3463 1253 3523 
Q 1550 3584 1831 3584 
Q 2591 3584 2966 3190 
Q 3341 2797 3341 1997 
z
" transform="scale(0.015625)"/>
       <path id="DejaVuSans-73" d="M 2834 3397 
L 2834 2853 
Q 2591 2978 2328 3040 
Q 2066 3103 1784 3103 
Q 1356 3103 1142 2972 
Q 928 2841 928 2578 
Q 928 2378 1081 2264 
Q 1234 2150 1697 2047 
L 1894 2003 
Q 2506 1872 2764 1633 
Q 3022 1394 3022 966 
Q 3022 478 2636 193 
Q 2250 -91 1575 -91 
Q 1294 -91 989 -36 
Q 684 19 347 128 
L 347 722 
Q 666 556 975 473 
Q 1284 391 1588 391 
Q 1994 391 2212 530 
Q 2431 669 2431 922 
Q 2431 1156 2273 1281 
Q 2116 1406 1581 1522 
L 1381 1569 
Q 847 1681 609 1914 
Q 372 2147 372 2553 
Q 372 3047 722 3315 
Q 1072 3584 1716 3584 
Q 2034 3584 2315 3537 
Q 2597 3491 2834 3397 
z
" transform="scale(0.015625)"/>
       <path id="DejaVuSans-67" d="M 2906 1791 
Q 2906 2416 2648 2759 
Q 2391 3103 1925 3103 
Q 1463 3103 1205 2759 
Q 947 2416 947 1791 
Q 947 1169 1205 825 
Q 1463 481 1925 481 
Q 2391 481 2648 825 
Q 2906 1169 2906 1791 
z
M 3481 434 
Q 3481 -459 3084 -895 
Q 2688 -1331 1869 -1331 
Q 1566 -1331 1297 -1286 
Q 1028 -1241 775 -1147 
L 775 -588 
Q 1028 -725 1275 -790 
Q 1522 -856 1778 -856 
Q 2344 -856 2625 -561 
Q 2906 -266 2906 331 
L 2906 616 
Q 2728 306 2450 153 
Q 2172 0 1784 0 
Q 1141 0 747 490 
Q 353 981 353 1791 
Q 353 2603 747 3093 
Q 1141 3584 1784 3584 
Q 2172 3584 2450 3431 
Q 2728 3278 2906 2969 
L 2906 3500 
L 3481 3500 
L 3481 434 
z
" transform="scale(0.015625)"/>
      </defs>
      <use xlink:href="#DejaVuSans-54"/>
      <use xlink:href="#DejaVuSans-69" x="57.958984"/>
      <use xlink:href="#DejaVuSans-6d" x="85.742188"/>
      <use xlink:href="#DejaVuSans-65" x="183.154297"/>
      <use xlink:href="#DejaVuSans-20" x="244.677734"/>
      <use xlink:href="#DejaVuSans-49" x="276.464844"/>
      <use xlink:href="#DejaVuSans-6e" x="305.957031"/>
      <use xlink:href="#DejaVuSans-63" x="369.335938"/>
      <use xlink:href="#DejaVuSans-72" x="424.316406"/>
      <use xlink:href="#DejaVuSans-65" x="463.179688"/>
      <use xlink:href="#DejaVuSans-61" x="524.703125"/>
      <use xlink:href="#DejaVuSans-73" x="585.982422"/>
      <use xlink:href="#DejaVuSans-69" x="638.082031"/>
      <use xlink:href="#DejaVuSans-6e" x="665.865234"/>
      <use xlink:href="#DejaVuSans-67" x="729.244141"/>
     </g>
    </g>
   </g>
   <g id="matplotlib.axis_2">
    <g id="ytick_1">
     <g id="line2d_1">
      <path d="M 57.17 242.931818 
L 534.6 242.931818 
" clip-path="url(#p81bc65bdee)" style="fill: none; stroke: #b0b0b0; stroke-width: 0.8; stroke-linecap: square"/>
     </g>
     <g id="line2d_2">
      <defs>
       <path id="m1e97e0aef0" d="M 0 0 
L -3.5 0 
" style="stroke: #000000; stroke-width: 0.8"/>
      </defs>
      <g>
       <use xlink:href="#m1e97e0aef0" x="57.17" y="242.931818" style="stroke: #000000; stroke-width: 0.8"/>
      </g>
     </g>
     <g id="text_2">
      <!-- 0 -->
      <g transform="translate(43.8075 246.731037) scale(0.1 -0.1)">
       <defs>
        <path id="DejaVuSans-30" d="M 2034 4250 
Q 1547 4250 1301 3770 
Q 1056 3291 1056 2328 
Q 1056 1369 1301 889 
Q 1547 409 2034 409 
Q 2525 409 2770 889 
Q 3016 1369 3016 2328 
Q 3016 3291 2770 3770 
Q 2525 4250 2034 4250 
z
M 2034 4750 
Q 2819 4750 3233 4129 
Q 3647 3509 3647 2328 
Q 3647 1150 3233 529 
Q 2819 -91 2034 -91 
Q 1250 -91 836 529 
Q 422 1150 422 2328 
Q 422 3509 836 4129 
Q 1250 4750 2034 4750 
z
" transform="scale(0.015625)"/>
       </defs>
       <use xlink:href="#DejaVuSans-30"/>
      </g>
     </g>
    </g>
    <g id="ytick_2">
     <g id="line2d_3">
      <path d="M 57.17 193.407115 
L 534.6 193.407115 
" clip-path="url(#p81bc65bdee)" style="fill: none; stroke: #b0b0b0; stroke-width: 0.8; stroke-linecap: square"/>
     </g>
     <g id="line2d_4">
      <g>
       <use xlink:href="#m1e97e0aef0" x="57.17" y="193.407115" style="stroke: #000000; stroke-width: 0.8"/>
      </g>
     </g>
     <g id="text_3">
      <!-- 500 -->
      <g transform="translate(31.0825 197.206334) scale(0.1 -0.1)">
       <defs>
        <path id="DejaVuSans-35" d="M 691 4666 
L 3169 4666 
L 3169 4134 
L 1269 4134 
L 1269 2991 
Q 1406 3038 1543 3061 
Q 1681 3084 1819 3084 
Q 2600 3084 3056 2656 
Q 3513 2228 3513 1497 
Q 3513 744 3044 326 
Q 2575 -91 1722 -91 
Q 1428 -91 1123 -41 
Q 819 9 494 109 
L 494 744 
Q 775 591 1075 516 
Q 1375 441 1709 441 
Q 2250 441 2565 725 
Q 2881 1009 2881 1497 
Q 2881 1984 2565 2268 
Q 2250 2553 1709 2553 
Q 1456 2553 1204 2497 
Q 953 2441 691 2322 
L 691 4666 
z
" transform="scale(0.015625)"/>
       </defs>
       <use xlink:href="#DejaVuSans-35"/>
       <use xlink:href="#DejaVuSans-30" x="63.623047"/>
       <use xlink:href="#DejaVuSans-30" x="127.246094"/>
      </g>
     </g>
    </g>
    <g id="ytick_3">
     <g id="line2d_5">
      <path d="M 57.17 143.882412 
L 534.6 143.882412 
" clip-path="url(#p81bc65bdee)" style="fill: none; stroke: #b0b0b0; stroke-width: 0.8; stroke-linecap: square"/>
     </g>
     <g id="line2d_6">
      <g>
       <use xlink:href="#m1e97e0aef0" x="57.17" y="143.882412" style="stroke: #000000; stroke-width: 0.8"/>
      </g>
     </g>
     <g id="text_4">
      <!-- 1000 -->
      <g transform="translate(24.72 147.681631) scale(0.1 -0.1)">
       <defs>
        <path id="DejaVuSans-31" d="M 794 531 
L 1825 531 
L 1825 4091 
L 703 3866 
L 703 4441 
L 1819 4666 
L 2450 4666 
L 2450 531 
L 3481 531 
L 3481 0 
L 794 0 
L 794 531 
z
" transform="scale(0.015625)"/>
       </defs>
       <use xlink:href="#DejaVuSans-31"/>
       <use xlink:href="#DejaVuSans-30" x="63.623047"/>
       <use xlink:href="#DejaVuSans-30" x="127.246094"/>
       <use xlink:href="#DejaVuSans-30" x="190.869141"/>
      </g>
     </g>
    </g>
    <g id="ytick_4">
     <g id="line2d_7">
      <path d="M 57.17 94.357709 
L 534.6 94.357709 
" clip-path="url(#p81bc65bdee)" style="fill: none; stroke: #b0b0b0; stroke-width: 0.8; stroke-linecap: square"/>
     </g>
     <g id="line2d_8">
      <g>
       <use xlink:href="#m1e97e0aef0" x="57.17" y="94.357709" style="stroke: #000000; stroke-width: 0.8"/>
      </g>
     </g>
     <g id="text_5">
      <!-- 1500 -->
      <g transform="translate(24.72 98.156928) scale(0.1 -0.1)">
       <use xlink:href="#DejaVuSans-31"/>
       <use xlink:href="#DejaVuSans-35" x="63.623047"/>
       <use xlink:href="#DejaVuSans-30" x="127.246094"/>
       <use xlink:href="#DejaVuSans-30" x="190.869141"/>
      </g>
     </g>
    </g>
    <g id="ytick_5">
     <g id="line2d_9">
      <path d="M 57.17 44.833006 
L 534.6 44.833006 
" clip-path="url(#p81bc65bdee)" style="fill: none; stroke: #b0b0b0; stroke-width: 0.8; stroke-linecap: square"/>
     </g>
     <g id="line2d_10">
      <g>
       <use xlink:href="#m1e97e0aef0" x="57.17" y="44.833006" style="stroke: #000000; stroke-width: 0.8"/>
      </g>
     </g>
     <g id="text_6">
      <!-- 2000 -->
      <g transform="translate(24.72 48.632225) scale(0.1 -0.1)">
       <defs>
        <path id="DejaVuSans-32" d="M 1228 531 
L 3431 531 
L 3431 0 
L 469 0 
L 469 531 
Q 828 903 1448 1529 
Q 2069 2156 2228 2338 
Q 2531 2678 2651 2914 
Q 2772 3150 2772 3378 
Q 2772 3750 2511 3984 
Q 2250 4219 1831 4219 
Q 1534 4219 1204 4116 
Q 875 4013 500 3803 
L 500 4441 
Q 881 4594 1212 4672 
Q 1544 4750 1819 4750 
Q 2544 4750 2975 4387 
Q 3406 4025 3406 3419 
Q 3406 3131 3298 2873 
Q 3191 2616 2906 2266 
Q 2828 2175 2409 1742 
Q 1991 1309 1228 531 
z
" transform="scale(0.015625)"/>
       </defs>
       <use xlink:href="#DejaVuSans-32"/>
       <use xlink:href="#DejaVuSans-30" x="63.623047"/>
       <use xlink:href="#DejaVuSans-30" x="127.246094"/>
       <use xlink:href="#DejaVuSans-30" x="190.869141"/>
      </g>
     </g>
    </g>
    <g id="text_7">
     <!-- PNL -->
     <g transform="translate(18.640313 149.591406) rotate(-90) scale(0.1 -0.1)">
      <defs>
       <path id="DejaVuSans-50" d="M 1259 4147 
L 1259 2394 
L 2053 2394 
Q 2494 2394 2734 2622 
Q 2975 2850 2975 3272 
Q 2975 3691 2734 3919 
Q 2494 4147 2053 4147 
L 1259 4147 
z
M 628 4666 
L 2053 4666 
Q 2838 4666 3239 4311 
Q 3641 3956 3641 3272 
Q 3641 2581 3239 2228 
Q 2838 1875 2053 1875 
L 1259 1875 
L 1259 0 
L 628 0 
L 628 4666 
z
" transform="scale(0.015625)"/>
       <path id="DejaVuSans-4e" d="M 628 4666 
L 1478 4666 
L 3547 763 
L 3547 4666 
L 4159 4666 
L 4159 0 
L 3309 0 
L 1241 3903 
L 1241 0 
L 628 0 
L 628 4666 
z
" transform="scale(0.015625)"/>
       <path id="DejaVuSans-4c" d="M 628 4666 
L 1259 4666 
L 1259 531 
L 3531 531 
L 3531 0 
L 628 0 
L 628 4666 
z
" transform="scale(0.015625)"/>
      </defs>
      <use xlink:href="#DejaVuSans-50"/>
      <use xlink:href="#DejaVuSans-4e" x="60.302734"/>
      <use xlink:href="#DejaVuSans-4c" x="135.107422"/>
     </g>
    </g>
   </g>
   <g id="line2d_11">
    <path d="M 78.871364 242.931818 
L 84.875693 242.931818 
L 85.733455 242.448766 
L 93.453308 242.448766 
L 94.311069 240.644452 
L 98.599876 240.644452 
L 99.457637 240.425128 
L 101.17316 240.425128 
L 102.030922 240.204803 
L 119.18615 240.204803 
L 120.043911 239.260078 
L 125.19048 239.260078 
L 126.048241 231.048306 
L 128.621525 231.048306 
L 129.479287 228.958088 
L 146.634515 228.958088 
L 147.492276 213.283957 
L 148.350038 213.283957 
L 149.207799 212.960822 
L 171.509596 212.960822 
L 172.367357 207.64449 
L 256.427975 207.64449 
L 257.285737 207.482905 
L 271.009919 207.482905 
L 271.867681 206.448251 
L 275.298726 206.448251 
L 276.156488 205.660177 
L 317.329035 205.579837 
L 318.186797 204.125294 
L 319.902319 204.125294 
L 320.760081 203.62988 
L 324.191126 203.62988 
L 325.048888 203.294319 
L 343.061877 203.294319 
L 343.919639 202.644107 
L 344.7774 185.18386 
L 345.635162 185.18386 
L 346.492923 185.026605 
L 347.350685 185.026605 
L 348.208446 182.723905 
L 351.639492 182.723905 
L 352.497253 181.299325 
L 355.070537 181.299325 
L 355.928299 178.552976 
L 366.221436 178.552976 
L 367.079197 177.860029 
L 375.656811 177.860029 
L 376.514572 177.221995 
L 379.087857 177.221995 
L 379.945618 166.580057 
L 382.518902 166.580057 
L 383.376664 166.174985 
L 384.234425 143.613294 
L 385.092186 135.837909 
L 385.949948 135.837909 
L 386.807709 135.41221 
L 388.523232 135.41221 
L 389.380994 134.965898 
L 390.238755 134.965898 
L 391.096516 133.173677 
L 391.954278 132.300787 
L 402.247415 132.300787 
L 403.105176 131.510472 
L 410.825029 131.510472 
L 411.68279 37.168182 
L 512.898636 37.168182 
L 512.898636 37.168182 
" clip-path="url(#p81bc65bdee)" style="fill: none; stroke: #1f77b4; stroke-width: 1.5; stroke-linecap: square"/>
   </g>
   <g id="patch_3">
    <path d="M 57.17 253.22 
L 57.17 26.88 
" style="fill: none; stroke: #000000; stroke-width: 0.8; stroke-linejoin: miter; stroke-linecap: square"/>
   </g>
   <g id="patch_4">
    <path d="M 534.6 253.22 
L 534.6 26.88 
" style="fill: none; stroke: #000000; stroke-width: 0.8; stroke-linejoin: miter; stroke-linecap: square"/>
   </g>
   <g id="patch_5">
    <path d="M 57.17 253.22 
L 534.6 253.22 
" style="fill: none; stroke: #000000; stroke-width: 0.8; stroke-linejoin: miter; stroke-linecap: square"/>
   </g>
   <g id="patch_6">
    <path d="M 57.17 26.88 
L 534.6 26.88 
" style="fill: none; stroke: #000000; stroke-width: 0.8; stroke-linejoin: miter; stroke-linecap: square"/>
   </g>
   <g id="text_8">
    <g id="patch_7">
     <path d="M 414.837875 63.192125 
L 514.7285 63.192125 
L 514.7285 45.514 
L 414.837875 45.514 
z
" style="fill: #ffffff; opacity: 0.7; stroke: #000000; stroke-linejoin: miter"/>
    </g>
    <!-- Final PnL: 2077.38 -->
    <g transform="translate(418.837875 57.112437) scale(0.1 -0.1)">
     <defs>
      <path id="DejaVuSans-46" d="M 628 4666 
L 3309 4666 
L 3309 4134 
L 1259 4134 
L 1259 2759 
L 3109 2759 
L 3109 2228 
L 1259 2228 
L 1259 0 
L 628 0 
L 628 4666 
z
" transform="scale(0.015625)"/>
      <path id="DejaVuSans-6c" d="M 603 4863 
L 1178 4863 
L 1178 0 
L 603 0 
L 603 4863 
z
" transform="scale(0.015625)"/>
      <path id="DejaVuSans-3a" d="M 750 794 
L 1409 794 
L 1409 0 
L 750 0 
L 750 794 
z
M 750 3309 
L 1409 3309 
L 1409 2516 
L 750 2516 
L 750 3309 
z
" transform="scale(0.015625)"/>
      <path id="DejaVuSans-37" d="M 525 4666 
L 3525 4666 
L 3525 4397 
L 1831 0 
L 1172 0 
L 2766 4134 
L 525 4134 
L 525 4666 
z
" transform="scale(0.015625)"/>
      <path id="DejaVuSans-2e" d="M 684 794 
L 1344 794 
L 1344 0 
L 684 0 
L 684 794 
z
" transform="scale(0.015625)"/>
      <path id="DejaVuSans-33" d="M 2597 2516 
Q 3050 2419 3304 2112 
Q 3559 1806 3559 1356 
Q 3559 666 3084 287 
Q 2609 -91 1734 -91 
Q 1441 -91 1130 -33 
Q 819 25 488 141 
L 488 750 
Q 750 597 1062 519 
Q 1375 441 1716 441 
Q 2309 441 2620 675 
Q 2931 909 2931 1356 
Q 2931 1769 2642 2001 
Q 2353 2234 1838 2234 
L 1294 2234 
L 1294 2753 
L 1863 2753 
Q 2328 2753 2575 2939 
Q 2822 3125 2822 3475 
Q 2822 3834 2567 4026 
Q 2313 4219 1838 4219 
Q 1578 4219 1281 4162 
Q 984 4106 628 3988 
L 628 4550 
Q 988 4650 1302 4700 
Q 1616 4750 1894 4750 
Q 2613 4750 3031 4423 
Q 3450 4097 3450 3541 
Q 3450 3153 3228 2886 
Q 3006 2619 2597 2516 
z
" transform="scale(0.015625)"/>
      <path id="DejaVuSans-38" d="M 2034 2216 
Q 1584 2216 1326 1975 
Q 1069 1734 1069 1313 
Q 1069 891 1326 650 
Q 1584 409 2034 409 
Q 2484 409 2743 651 
Q 3003 894 3003 1313 
Q 3003 1734 2745 1975 
Q 2488 2216 2034 2216 
z
M 1403 2484 
Q 997 2584 770 2862 
Q 544 3141 544 3541 
Q 544 4100 942 4425 
Q 1341 4750 2034 4750 
Q 2731 4750 3128 4425 
Q 3525 4100 3525 3541 
Q 3525 3141 3298 2862 
Q 3072 2584 2669 2484 
Q 3125 2378 3379 2068 
Q 3634 1759 3634 1313 
Q 3634 634 3220 271 
Q 2806 -91 2034 -91 
Q 1263 -91 848 271 
Q 434 634 434 1313 
Q 434 1759 690 2068 
Q 947 2378 1403 2484 
z
M 1172 3481 
Q 1172 3119 1398 2916 
Q 1625 2713 2034 2713 
Q 2441 2713 2670 2916 
Q 2900 3119 2900 3481 
Q 2900 3844 2670 4047 
Q 2441 4250 2034 4250 
Q 1625 4250 1398 4047 
Q 1172 3844 1172 3481 
z
" transform="scale(0.015625)"/>
     </defs>
     <use xlink:href="#DejaVuSans-46"/>
     <use xlink:href="#DejaVuSans-69" x="50.269531"/>
     <use xlink:href="#DejaVuSans-6e" x="78.052734"/>
     <use xlink:href="#DejaVuSans-61" x="141.431641"/>
     <use xlink:href="#DejaVuSans-6c" x="202.710938"/>
     <use xlink:href="#DejaVuSans-20" x="230.494141"/>
     <use xlink:href="#DejaVuSans-50" x="262.28125"/>
     <use xlink:href="#DejaVuSans-6e" x="320.833984"/>
     <use xlink:href="#DejaVuSans-4c" x="384.212891"/>
     <use xlink:href="#DejaVuSans-3a" x="439.925781"/>
     <use xlink:href="#DejaVuSans-20" x="473.617188"/>
     <use xlink:href="#DejaVuSans-32" x="505.404297"/>
     <use xlink:href="#DejaVuSans-30" x="569.027344"/>
     <use xlink:href="#DejaVuSans-37" x="632.650391"/>
     <use xlink:href="#DejaVuSans-37" x="696.273438"/>
     <use xlink:href="#DejaVuSans-2e" x="759.896484"/>
     <use xlink:href="#DejaVuSans-33" x="791.683594"/>
     <use xlink:href="#DejaVuSans-38" x="855.306641"/>
    </g>
   </g>
   <g id="text_9">
    <!-- PnL for SPY 12-28-2018 -->
    <g transform="translate(225.43 20.88) scale(0.12 -0.12)">
     <defs>
      <path id="DejaVuSans-66" d="M 2375 4863 
L 2375 4384 
L 1825 4384 
Q 1516 4384 1395 4259 
Q 1275 4134 1275 3809 
L 1275 3500 
L 2222 3500 
L 2222 3053 
L 1275 3053 
L 1275 0 
L 697 0 
L 697 3053 
L 147 3053 
L 147 3500 
L 697 3500 
L 697 3744 
Q 697 4328 969 4595 
Q 1241 4863 1831 4863 
L 2375 4863 
z
" transform="scale(0.015625)"/>
      <path id="DejaVuSans-6f" d="M 1959 3097 
Q 1497 3097 1228 2736 
Q 959 2375 959 1747 
Q 959 1119 1226 758 
Q 1494 397 1959 397 
Q 2419 397 2687 759 
Q 2956 1122 2956 1747 
Q 2956 2369 2687 2733 
Q 2419 3097 1959 3097 
z
M 1959 3584 
Q 2709 3584 3137 3096 
Q 3566 2609 3566 1747 
Q 3566 888 3137 398 
Q 2709 -91 1959 -91 
Q 1206 -91 779 398 
Q 353 888 353 1747 
Q 353 2609 779 3096 
Q 1206 3584 1959 3584 
z
" transform="scale(0.015625)"/>
      <path id="DejaVuSans-53" d="M 3425 4513 
L 3425 3897 
Q 3066 4069 2747 4153 
Q 2428 4238 2131 4238 
Q 1616 4238 1336 4038 
Q 1056 3838 1056 3469 
Q 1056 3159 1242 3001 
Q 1428 2844 1947 2747 
L 2328 2669 
Q 3034 2534 3370 2195 
Q 3706 1856 3706 1288 
Q 3706 609 3251 259 
Q 2797 -91 1919 -91 
Q 1588 -91 1214 -16 
Q 841 59 441 206 
L 441 856 
Q 825 641 1194 531 
Q 1563 422 1919 422 
Q 2459 422 2753 634 
Q 3047 847 3047 1241 
Q 3047 1584 2836 1778 
Q 2625 1972 2144 2069 
L 1759 2144 
Q 1053 2284 737 2584 
Q 422 2884 422 3419 
Q 422 4038 858 4394 
Q 1294 4750 2059 4750 
Q 2388 4750 2728 4690 
Q 3069 4631 3425 4513 
z
" transform="scale(0.015625)"/>
      <path id="DejaVuSans-59" d="M -13 4666 
L 666 4666 
L 1959 2747 
L 3244 4666 
L 3922 4666 
L 2272 2222 
L 2272 0 
L 1638 0 
L 1638 2222 
L -13 4666 
z
" transform="scale(0.015625)"/>
      <path id="DejaVuSans-2d" d="M 313 2009 
L 1997 2009 
L 1997 1497 
L 313 1497 
L 313 2009 
z
" transform="scale(0.015625)"/>
     </defs>
     <use xlink:href="#DejaVuSans-50"/>
     <use xlink:href="#DejaVuSans-6e" x="58.552734"/>
     <use xlink:href="#DejaVuSans-4c" x="121.931641"/>
     <use xlink:href="#DejaVuSans-20" x="177.644531"/>
     <use xlink:href="#DejaVuSans-66" x="209.431641"/>
     <use xlink:href="#DejaVuSans-6f" x="244.636719"/>
     <use xlink:href="#DejaVuSans-72" x="305.818359"/>
     <use xlink:href="#DejaVuSans-20" x="346.931641"/>
     <use xlink:href="#DejaVuSans-53" x="378.71875"/>
     <use xlink:href="#DejaVuSans-50" x="442.195312"/>
     <use xlink:href="#DejaVuSans-59" x="500.248047"/>
     <use xlink:href="#DejaVuSans-20" x="561.332031"/>
     <use xlink:href="#DejaVuSans-31" x="593.119141"/>
     <use xlink:href="#DejaVuSans-32" x="656.742188"/>
     <use xlink:href="#DejaVuSans-2d" x="720.365234"/>
     <use xlink:href="#DejaVuSans-32" x="756.449219"/>
     <use xlink:href="#DejaVuSans-38" x="820.072266"/>
     <use xlink:href="#DejaVuSans-2d" x="883.695312"/>
     <use xlink:href="#DejaVuSans-32" x="919.779297"/>
     <use xlink:href="#DejaVuSans-30" x="983.402344"/>
     <use xlink:href="#DejaVuSans-31" x="1047.025391"/>
     <use xlink:href="#DejaVuSans-38" x="1110.648438"/>
    </g>
   </g>
  </g>
  <g id="axes_2">
   <g id="patch_8">
    <path d="M 591.77 253.22 
L 1069.2 253.22 
L 1069.2 26.88 
L 591.77 26.88 
z
" style="fill: #ffffff"/>
   </g>
   <g id="matplotlib.axis_3">
    <g id="text_10">
     <!-- Time Increasing -->
     <g transform="translate(790.849063 264.818437) scale(0.1 -0.1)">
      <use xlink:href="#DejaVuSans-54"/>
      <use xlink:href="#DejaVuSans-69" x="57.958984"/>
      <use xlink:href="#DejaVuSans-6d" x="85.742188"/>
      <use xlink:href="#DejaVuSans-65" x="183.154297"/>
      <use xlink:href="#DejaVuSans-20" x="244.677734"/>
      <use xlink:href="#DejaVuSans-49" x="276.464844"/>
      <use xlink:href="#DejaVuSans-6e" x="305.957031"/>
      <use xlink:href="#DejaVuSans-63" x="369.335938"/>
      <use xlink:href="#DejaVuSans-72" x="424.316406"/>
      <use xlink:href="#DejaVuSans-65" x="463.179688"/>
      <use xlink:href="#DejaVuSans-61" x="524.703125"/>
      <use xlink:href="#DejaVuSans-73" x="585.982422"/>
      <use xlink:href="#DejaVuSans-69" x="638.082031"/>
      <use xlink:href="#DejaVuSans-6e" x="665.865234"/>
      <use xlink:href="#DejaVuSans-67" x="729.244141"/>
     </g>
    </g>
   </g>
   <g id="matplotlib.axis_4">
    <g id="ytick_6">
     <g id="line2d_12">
      <path d="M 591.77 242.931818 
L 1069.2 242.931818 
" clip-path="url(#p03367c154b)" style="fill: none; stroke: #b0b0b0; stroke-width: 0.8; stroke-linecap: square"/>
     </g>
     <g id="line2d_13">
      <g>
       <use xlink:href="#m1e97e0aef0" x="591.77" y="242.931818" style="stroke: #000000; stroke-width: 0.8"/>
      </g>
     </g>
     <g id="text_11">
      <!-- 0 -->
      <g transform="translate(578.4075 246.731037) scale(0.1 -0.1)">
       <use xlink:href="#DejaVuSans-30"/>
      </g>
     </g>
    </g>
    <g id="ytick_7">
     <g id="line2d_14">
      <path d="M 591.77 208.447029 
L 1069.2 208.447029 
" clip-path="url(#p03367c154b)" style="fill: none; stroke: #b0b0b0; stroke-width: 0.8; stroke-linecap: square"/>
     </g>
     <g id="line2d_15">
      <g>
       <use xlink:href="#m1e97e0aef0" x="591.77" y="208.447029" style="stroke: #000000; stroke-width: 0.8"/>
      </g>
     </g>
     <g id="text_12">
      <!-- 100 -->
      <g transform="translate(565.6825 212.246247) scale(0.1 -0.1)">
       <use xlink:href="#DejaVuSans-31"/>
       <use xlink:href="#DejaVuSans-30" x="63.623047"/>
       <use xlink:href="#DejaVuSans-30" x="127.246094"/>
      </g>
     </g>
    </g>
    <g id="ytick_8">
     <g id="line2d_16">
      <path d="M 591.77 173.962239 
L 1069.2 173.962239 
" clip-path="url(#p03367c154b)" style="fill: none; stroke: #b0b0b0; stroke-width: 0.8; stroke-linecap: square"/>
     </g>
     <g id="line2d_17">
      <g>
       <use xlink:href="#m1e97e0aef0" x="591.77" y="173.962239" style="stroke: #000000; stroke-width: 0.8"/>
      </g>
     </g>
     <g id="text_13">
      <!-- 200 -->
      <g transform="translate(565.6825 177.761458) scale(0.1 -0.1)">
       <use xlink:href="#DejaVuSans-32"/>
       <use xlink:href="#DejaVuSans-30" x="63.623047"/>
       <use xlink:href="#DejaVuSans-30" x="127.246094"/>
      </g>
     </g>
    </g>
    <g id="ytick_9">
     <g id="line2d_18">
      <path d="M 591.77 139.477449 
L 1069.2 139.477449 
" clip-path="url(#p03367c154b)" style="fill: none; stroke: #b0b0b0; stroke-width: 0.8; stroke-linecap: square"/>
     </g>
     <g id="line2d_19">
      <g>
       <use xlink:href="#m1e97e0aef0" x="591.77" y="139.477449" style="stroke: #000000; stroke-width: 0.8"/>
      </g>
     </g>
     <g id="text_14">
      <!-- 300 -->
      <g transform="translate(565.6825 143.276668) scale(0.1 -0.1)">
       <use xlink:href="#DejaVuSans-33"/>
       <use xlink:href="#DejaVuSans-30" x="63.623047"/>
       <use xlink:href="#DejaVuSans-30" x="127.246094"/>
      </g>
     </g>
    </g>
    <g id="ytick_10">
     <g id="line2d_20">
      <path d="M 591.77 104.99266 
L 1069.2 104.99266 
" clip-path="url(#p03367c154b)" style="fill: none; stroke: #b0b0b0; stroke-width: 0.8; stroke-linecap: square"/>
     </g>
     <g id="line2d_21">
      <g>
       <use xlink:href="#m1e97e0aef0" x="591.77" y="104.99266" style="stroke: #000000; stroke-width: 0.8"/>
      </g>
     </g>
     <g id="text_15">
      <!-- 400 -->
      <g transform="translate(565.6825 108.791878) scale(0.1 -0.1)">
       <defs>
        <path id="DejaVuSans-34" d="M 2419 4116 
L 825 1625 
L 2419 1625 
L 2419 4116 
z
M 2253 4666 
L 3047 4666 
L 3047 1625 
L 3713 1625 
L 3713 1100 
L 3047 1100 
L 3047 0 
L 2419 0 
L 2419 1100 
L 313 1100 
L 313 1709 
L 2253 4666 
z
" transform="scale(0.015625)"/>
       </defs>
       <use xlink:href="#DejaVuSans-34"/>
       <use xlink:href="#DejaVuSans-30" x="63.623047"/>
       <use xlink:href="#DejaVuSans-30" x="127.246094"/>
      </g>
     </g>
    </g>
    <g id="ytick_11">
     <g id="line2d_22">
      <path d="M 591.77 70.50787 
L 1069.2 70.50787 
" clip-path="url(#p03367c154b)" style="fill: none; stroke: #b0b0b0; stroke-width: 0.8; stroke-linecap: square"/>
     </g>
     <g id="line2d_23">
      <g>
       <use xlink:href="#m1e97e0aef0" x="591.77" y="70.50787" style="stroke: #000000; stroke-width: 0.8"/>
      </g>
     </g>
     <g id="text_16">
      <!-- 500 -->
      <g transform="translate(565.6825 74.307089) scale(0.1 -0.1)">
       <use xlink:href="#DejaVuSans-35"/>
       <use xlink:href="#DejaVuSans-30" x="63.623047"/>
       <use xlink:href="#DejaVuSans-30" x="127.246094"/>
      </g>
     </g>
    </g>
    <g id="ytick_12">
     <g id="line2d_24">
      <path d="M 591.77 36.02308 
L 1069.2 36.02308 
" clip-path="url(#p03367c154b)" style="fill: none; stroke: #b0b0b0; stroke-width: 0.8; stroke-linecap: square"/>
     </g>
     <g id="line2d_25">
      <g>
       <use xlink:href="#m1e97e0aef0" x="591.77" y="36.02308" style="stroke: #000000; stroke-width: 0.8"/>
      </g>
     </g>
     <g id="text_17">
      <!-- 600 -->
      <g transform="translate(565.6825 39.822299) scale(0.1 -0.1)">
       <defs>
        <path id="DejaVuSans-36" d="M 2113 2584 
Q 1688 2584 1439 2293 
Q 1191 2003 1191 1497 
Q 1191 994 1439 701 
Q 1688 409 2113 409 
Q 2538 409 2786 701 
Q 3034 994 3034 1497 
Q 3034 2003 2786 2293 
Q 2538 2584 2113 2584 
z
M 3366 4563 
L 3366 3988 
Q 3128 4100 2886 4159 
Q 2644 4219 2406 4219 
Q 1781 4219 1451 3797 
Q 1122 3375 1075 2522 
Q 1259 2794 1537 2939 
Q 1816 3084 2150 3084 
Q 2853 3084 3261 2657 
Q 3669 2231 3669 1497 
Q 3669 778 3244 343 
Q 2819 -91 2113 -91 
Q 1303 -91 875 529 
Q 447 1150 447 2328 
Q 447 3434 972 4092 
Q 1497 4750 2381 4750 
Q 2619 4750 2861 4703 
Q 3103 4656 3366 4563 
z
" transform="scale(0.015625)"/>
       </defs>
       <use xlink:href="#DejaVuSans-36"/>
       <use xlink:href="#DejaVuSans-30" x="63.623047"/>
       <use xlink:href="#DejaVuSans-30" x="127.246094"/>
      </g>
     </g>
    </g>
    <g id="text_18">
     <!-- PNL -->
     <g transform="translate(559.602813 149.591406) rotate(-90) scale(0.1 -0.1)">
      <use xlink:href="#DejaVuSans-50"/>
      <use xlink:href="#DejaVuSans-4e" x="60.302734"/>
      <use xlink:href="#DejaVuSans-4c" x="135.107422"/>
     </g>
    </g>
   </g>
   <g id="line2d_26">
    <path d="M 613.471364 242.931818 
L 644.152602 242.931818 
L 644.900925 238.721454 
L 680.820423 238.721454 
L 681.568746 227.121379 
L 690.548621 227.121379 
L 691.296944 225.067281 
L 814.021897 225.067281 
L 815.518542 165.010478 
L 820.00848 165.010478 
L 820.756803 164.060448 
L 821.505125 164.060448 
L 822.253448 163.332749 
L 823.001771 161.042767 
L 825.24674 161.042767 
L 825.995063 127.155607 
L 828.988354 127.155607 
L 829.736677 126.268877 
L 830.485 126.268877 
L 831.233323 123.400259 
L 831.981646 121.912244 
L 842.458166 121.912244 
L 843.206489 116.760907 
L 853.683009 116.760907 
L 854.431332 114.895778 
L 855.927978 114.895778 
L 856.676301 110.616951 
L 858.92127 110.616951 
L 859.669592 110.452798 
L 868.649467 110.452798 
L 869.39779 61.427091 
L 880.622633 61.427091 
L 881.370956 59.781807 
L 882.119279 58.45097 
L 882.867602 56.344105 
L 883.615925 56.344105 
L 884.364248 55.789049 
L 891.099154 55.789049 
L 891.847476 51.951167 
L 900.079028 51.951167 
L 900.827351 37.168182 
L 1047.498636 37.168182 
L 1047.498636 37.168182 
" clip-path="url(#p03367c154b)" style="fill: none; stroke: #1f77b4; stroke-width: 1.5; stroke-linecap: square"/>
   </g>
   <g id="patch_9">
    <path d="M 591.77 253.22 
L 591.77 26.88 
" style="fill: none; stroke: #000000; stroke-width: 0.8; stroke-linejoin: miter; stroke-linecap: square"/>
   </g>
   <g id="patch_10">
    <path d="M 1069.2 253.22 
L 1069.2 26.88 
" style="fill: none; stroke: #000000; stroke-width: 0.8; stroke-linejoin: miter; stroke-linecap: square"/>
   </g>
   <g id="patch_11">
    <path d="M 591.77 253.22 
L 1069.2 253.22 
" style="fill: none; stroke: #000000; stroke-width: 0.8; stroke-linejoin: miter; stroke-linecap: square"/>
   </g>
   <g id="patch_12">
    <path d="M 591.77 26.88 
L 1069.2 26.88 
" style="fill: none; stroke: #000000; stroke-width: 0.8; stroke-linejoin: miter; stroke-linecap: square"/>
   </g>
   <g id="text_19">
    <g id="patch_13">
     <path d="M 955.800375 63.192125 
L 1049.3285 63.192125 
L 1049.3285 45.514 
L 955.800375 45.514 
z
" style="fill: #ffffff; opacity: 0.7; stroke: #000000; stroke-linejoin: miter"/>
    </g>
    <!-- Final PnL: 596.68 -->
    <g transform="translate(959.800375 57.112437) scale(0.1 -0.1)">
     <defs>
      <path id="DejaVuSans-39" d="M 703 97 
L 703 672 
Q 941 559 1184 500 
Q 1428 441 1663 441 
Q 2288 441 2617 861 
Q 2947 1281 2994 2138 
Q 2813 1869 2534 1725 
Q 2256 1581 1919 1581 
Q 1219 1581 811 2004 
Q 403 2428 403 3163 
Q 403 3881 828 4315 
Q 1253 4750 1959 4750 
Q 2769 4750 3195 4129 
Q 3622 3509 3622 2328 
Q 3622 1225 3098 567 
Q 2575 -91 1691 -91 
Q 1453 -91 1209 -44 
Q 966 3 703 97 
z
M 1959 2075 
Q 2384 2075 2632 2365 
Q 2881 2656 2881 3163 
Q 2881 3666 2632 3958 
Q 2384 4250 1959 4250 
Q 1534 4250 1286 3958 
Q 1038 3666 1038 3163 
Q 1038 2656 1286 2365 
Q 1534 2075 1959 2075 
z
" transform="scale(0.015625)"/>
     </defs>
     <use xlink:href="#DejaVuSans-46"/>
     <use xlink:href="#DejaVuSans-69" x="50.269531"/>
     <use xlink:href="#DejaVuSans-6e" x="78.052734"/>
     <use xlink:href="#DejaVuSans-61" x="141.431641"/>
     <use xlink:href="#DejaVuSans-6c" x="202.710938"/>
     <use xlink:href="#DejaVuSans-20" x="230.494141"/>
     <use xlink:href="#DejaVuSans-50" x="262.28125"/>
     <use xlink:href="#DejaVuSans-6e" x="320.833984"/>
     <use xlink:href="#DejaVuSans-4c" x="384.212891"/>
     <use xlink:href="#DejaVuSans-3a" x="439.925781"/>
     <use xlink:href="#DejaVuSans-20" x="473.617188"/>
     <use xlink:href="#DejaVuSans-35" x="505.404297"/>
     <use xlink:href="#DejaVuSans-39" x="569.027344"/>
     <use xlink:href="#DejaVuSans-36" x="632.650391"/>
     <use xlink:href="#DejaVuSans-2e" x="696.273438"/>
     <use xlink:href="#DejaVuSans-36" x="728.060547"/>
     <use xlink:href="#DejaVuSans-38" x="791.683594"/>
    </g>
   </g>
   <g id="text_20">
    <!-- PnL for SPY 01-30-2019 -->
    <g transform="translate(760.03 20.88) scale(0.12 -0.12)">
     <use xlink:href="#DejaVuSans-50"/>
     <use xlink:href="#DejaVuSans-6e" x="58.552734"/>
     <use xlink:href="#DejaVuSans-4c" x="121.931641"/>
     <use xlink:href="#DejaVuSans-20" x="177.644531"/>
     <use xlink:href="#DejaVuSans-66" x="209.431641"/>
     <use xlink:href="#DejaVuSans-6f" x="244.636719"/>
     <use xlink:href="#DejaVuSans-72" x="305.818359"/>
     <use xlink:href="#DejaVuSans-20" x="346.931641"/>
     <use xlink:href="#DejaVuSans-53" x="378.71875"/>
     <use xlink:href="#DejaVuSans-50" x="442.195312"/>
     <use xlink:href="#DejaVuSans-59" x="500.248047"/>
     <use xlink:href="#DejaVuSans-20" x="561.332031"/>
     <use xlink:href="#DejaVuSans-30" x="593.119141"/>
     <use xlink:href="#DejaVuSans-31" x="656.742188"/>
     <use xlink:href="#DejaVuSans-2d" x="720.365234"/>
     <use xlink:href="#DejaVuSans-33" x="756.449219"/>
     <use xlink:href="#DejaVuSans-30" x="820.072266"/>
     <use xlink:href="#DejaVuSans-2d" x="883.695312"/>
     <use xlink:href="#DejaVuSans-32" x="919.779297"/>
     <use xlink:href="#DejaVuSans-30" x="983.402344"/>
     <use xlink:href="#DejaVuSans-31" x="1047.025391"/>
     <use xlink:href="#DejaVuSans-39" x="1110.648438"/>
    </g>
   </g>
  </g>
  <g id="axes_3">
   <g id="patch_14">
    <path d="M 57.17 520.52 
L 534.6 520.52 
L 534.6 294.18 
L 57.17 294.18 
z
" style="fill: #ffffff"/>
   </g>
   <g id="matplotlib.axis_5">
    <g id="text_21">
     <!-- Time Increasing -->
     <g transform="translate(256.249062 532.118438) scale(0.1 -0.1)">
      <use xlink:href="#DejaVuSans-54"/>
      <use xlink:href="#DejaVuSans-69" x="57.958984"/>
      <use xlink:href="#DejaVuSans-6d" x="85.742188"/>
      <use xlink:href="#DejaVuSans-65" x="183.154297"/>
      <use xlink:href="#DejaVuSans-20" x="244.677734"/>
      <use xlink:href="#DejaVuSans-49" x="276.464844"/>
      <use xlink:href="#DejaVuSans-6e" x="305.957031"/>
      <use xlink:href="#DejaVuSans-63" x="369.335938"/>
      <use xlink:href="#DejaVuSans-72" x="424.316406"/>
      <use xlink:href="#DejaVuSans-65" x="463.179688"/>
      <use xlink:href="#DejaVuSans-61" x="524.703125"/>
      <use xlink:href="#DejaVuSans-73" x="585.982422"/>
      <use xlink:href="#DejaVuSans-69" x="638.082031"/>
      <use xlink:href="#DejaVuSans-6e" x="665.865234"/>
      <use xlink:href="#DejaVuSans-67" x="729.244141"/>
     </g>
    </g>
   </g>
   <g id="matplotlib.axis_6">
    <g id="ytick_13">
     <g id="line2d_27">
      <path d="M 57.17 510.231818 
L 534.6 510.231818 
" clip-path="url(#pcc28da3448)" style="fill: none; stroke: #b0b0b0; stroke-width: 0.8; stroke-linecap: square"/>
     </g>
     <g id="line2d_28">
      <g>
       <use xlink:href="#m1e97e0aef0" x="57.17" y="510.231818" style="stroke: #000000; stroke-width: 0.8"/>
      </g>
     </g>
     <g id="text_22">
      <!-- 0 -->
      <g transform="translate(43.8075 514.031037) scale(0.1 -0.1)">
       <use xlink:href="#DejaVuSans-30"/>
      </g>
     </g>
    </g>
    <g id="ytick_14">
     <g id="line2d_29">
      <path d="M 57.17 480.129498 
L 534.6 480.129498 
" clip-path="url(#pcc28da3448)" style="fill: none; stroke: #b0b0b0; stroke-width: 0.8; stroke-linecap: square"/>
     </g>
     <g id="line2d_30">
      <g>
       <use xlink:href="#m1e97e0aef0" x="57.17" y="480.129498" style="stroke: #000000; stroke-width: 0.8"/>
      </g>
     </g>
     <g id="text_23">
      <!-- 200 -->
      <g transform="translate(31.0825 483.928717) scale(0.1 -0.1)">
       <use xlink:href="#DejaVuSans-32"/>
       <use xlink:href="#DejaVuSans-30" x="63.623047"/>
       <use xlink:href="#DejaVuSans-30" x="127.246094"/>
      </g>
     </g>
    </g>
    <g id="ytick_15">
     <g id="line2d_31">
      <path d="M 57.17 450.027178 
L 534.6 450.027178 
" clip-path="url(#pcc28da3448)" style="fill: none; stroke: #b0b0b0; stroke-width: 0.8; stroke-linecap: square"/>
     </g>
     <g id="line2d_32">
      <g>
       <use xlink:href="#m1e97e0aef0" x="57.17" y="450.027178" style="stroke: #000000; stroke-width: 0.8"/>
      </g>
     </g>
     <g id="text_24">
      <!-- 400 -->
      <g transform="translate(31.0825 453.826396) scale(0.1 -0.1)">
       <use xlink:href="#DejaVuSans-34"/>
       <use xlink:href="#DejaVuSans-30" x="63.623047"/>
       <use xlink:href="#DejaVuSans-30" x="127.246094"/>
      </g>
     </g>
    </g>
    <g id="ytick_16">
     <g id="line2d_33">
      <path d="M 57.17 419.924857 
L 534.6 419.924857 
" clip-path="url(#pcc28da3448)" style="fill: none; stroke: #b0b0b0; stroke-width: 0.8; stroke-linecap: square"/>
     </g>
     <g id="line2d_34">
      <g>
       <use xlink:href="#m1e97e0aef0" x="57.17" y="419.924857" style="stroke: #000000; stroke-width: 0.8"/>
      </g>
     </g>
     <g id="text_25">
      <!-- 600 -->
      <g transform="translate(31.0825 423.724076) scale(0.1 -0.1)">
       <use xlink:href="#DejaVuSans-36"/>
       <use xlink:href="#DejaVuSans-30" x="63.623047"/>
       <use xlink:href="#DejaVuSans-30" x="127.246094"/>
      </g>
     </g>
    </g>
    <g id="ytick_17">
     <g id="line2d_35">
      <path d="M 57.17 389.822537 
L 534.6 389.822537 
" clip-path="url(#pcc28da3448)" style="fill: none; stroke: #b0b0b0; stroke-width: 0.8; stroke-linecap: square"/>
     </g>
     <g id="line2d_36">
      <g>
       <use xlink:href="#m1e97e0aef0" x="57.17" y="389.822537" style="stroke: #000000; stroke-width: 0.8"/>
      </g>
     </g>
     <g id="text_26">
      <!-- 800 -->
      <g transform="translate(31.0825 393.621756) scale(0.1 -0.1)">
       <use xlink:href="#DejaVuSans-38"/>
       <use xlink:href="#DejaVuSans-30" x="63.623047"/>
       <use xlink:href="#DejaVuSans-30" x="127.246094"/>
      </g>
     </g>
    </g>
    <g id="ytick_18">
     <g id="line2d_37">
      <path d="M 57.17 359.720217 
L 534.6 359.720217 
" clip-path="url(#pcc28da3448)" style="fill: none; stroke: #b0b0b0; stroke-width: 0.8; stroke-linecap: square"/>
     </g>
     <g id="line2d_38">
      <g>
       <use xlink:href="#m1e97e0aef0" x="57.17" y="359.720217" style="stroke: #000000; stroke-width: 0.8"/>
      </g>
     </g>
     <g id="text_27">
      <!-- 1000 -->
      <g transform="translate(24.72 363.519435) scale(0.1 -0.1)">
       <use xlink:href="#DejaVuSans-31"/>
       <use xlink:href="#DejaVuSans-30" x="63.623047"/>
       <use xlink:href="#DejaVuSans-30" x="127.246094"/>
       <use xlink:href="#DejaVuSans-30" x="190.869141"/>
      </g>
     </g>
    </g>
    <g id="ytick_19">
     <g id="line2d_39">
      <path d="M 57.17 329.617896 
L 534.6 329.617896 
" clip-path="url(#pcc28da3448)" style="fill: none; stroke: #b0b0b0; stroke-width: 0.8; stroke-linecap: square"/>
     </g>
     <g id="line2d_40">
      <g>
       <use xlink:href="#m1e97e0aef0" x="57.17" y="329.617896" style="stroke: #000000; stroke-width: 0.8"/>
      </g>
     </g>
     <g id="text_28">
      <!-- 1200 -->
      <g transform="translate(24.72 333.417115) scale(0.1 -0.1)">
       <use xlink:href="#DejaVuSans-31"/>
       <use xlink:href="#DejaVuSans-32" x="63.623047"/>
       <use xlink:href="#DejaVuSans-30" x="127.246094"/>
       <use xlink:href="#DejaVuSans-30" x="190.869141"/>
      </g>
     </g>
    </g>
    <g id="ytick_20">
     <g id="line2d_41">
      <path d="M 57.17 299.515576 
L 534.6 299.515576 
" clip-path="url(#pcc28da3448)" style="fill: none; stroke: #b0b0b0; stroke-width: 0.8; stroke-linecap: square"/>
     </g>
     <g id="line2d_42">
      <g>
       <use xlink:href="#m1e97e0aef0" x="57.17" y="299.515576" style="stroke: #000000; stroke-width: 0.8"/>
      </g>
     </g>
     <g id="text_29">
      <!-- 1400 -->
      <g transform="translate(24.72 303.314795) scale(0.1 -0.1)">
       <use xlink:href="#DejaVuSans-31"/>
       <use xlink:href="#DejaVuSans-34" x="63.623047"/>
       <use xlink:href="#DejaVuSans-30" x="127.246094"/>
       <use xlink:href="#DejaVuSans-30" x="190.869141"/>
      </g>
     </g>
    </g>
    <g id="text_30">
     <!-- PNL -->
     <g transform="translate(18.640313 416.891406) rotate(-90) scale(0.1 -0.1)">
      <use xlink:href="#DejaVuSans-50"/>
      <use xlink:href="#DejaVuSans-4e" x="60.302734"/>
      <use xlink:href="#DejaVuSans-4c" x="135.107422"/>
     </g>
    </g>
   </g>
   <g id="line2d_43">
    <path d="M 78.871364 510.231818 
L 108.114336 510.231818 
L 108.883888 507.550598 
L 133.509549 507.550598 
L 134.279101 507.091472 
L 139.665964 507.091472 
L 140.435516 501.41422 
L 160.443865 501.41422 
L 161.213417 500.504597 
L 173.526248 500.504597 
L 174.295799 499.99411 
L 177.374007 499.99411 
L 178.143559 477.08372 
L 179.682663 477.08372 
L 180.452215 476.611978 
L 181.221767 476.611978 
L 181.991319 476.282515 
L 182.76087 475.375453 
L 194.304149 475.375453 
L 195.073701 473.562517 
L 209.695187 473.562517 
L 210.464739 472.32063 
L 294.345896 472.32063 
L 295.115448 463.333168 
L 315.123798 463.272921 
L 315.893349 340.198656 
L 338.210355 340.198656 
L 338.979907 339.916229 
L 354.370945 339.916229 
L 355.140496 306.440917 
L 373.609742 306.440917 
L 374.379294 306.199322 
L 375.148846 304.468182 
L 512.898636 304.468182 
L 512.898636 304.468182 
" clip-path="url(#pcc28da3448)" style="fill: none; stroke: #1f77b4; stroke-width: 1.5; stroke-linecap: square"/>
   </g>
   <g id="patch_15">
    <path d="M 57.17 520.52 
L 57.17 294.18 
" style="fill: none; stroke: #000000; stroke-width: 0.8; stroke-linejoin: miter; stroke-linecap: square"/>
   </g>
   <g id="patch_16">
    <path d="M 534.6 520.52 
L 534.6 294.18 
" style="fill: none; stroke: #000000; stroke-width: 0.8; stroke-linejoin: miter; stroke-linecap: square"/>
   </g>
   <g id="patch_17">
    <path d="M 57.17 520.52 
L 534.6 520.52 
" style="fill: none; stroke: #000000; stroke-width: 0.8; stroke-linejoin: miter; stroke-linecap: square"/>
   </g>
   <g id="patch_18">
    <path d="M 57.17 294.18 
L 534.6 294.18 
" style="fill: none; stroke: #000000; stroke-width: 0.8; stroke-linejoin: miter; stroke-linecap: square"/>
   </g>
   <g id="text_31">
    <g id="patch_19">
     <path d="M 414.837875 330.492125 
L 514.7285 330.492125 
L 514.7285 312.814 
L 414.837875 312.814 
z
" style="fill: #ffffff; opacity: 0.7; stroke: #000000; stroke-linejoin: miter"/>
    </g>
    <!-- Final PnL: 1367.09 -->
    <g transform="translate(418.837875 324.412438) scale(0.1 -0.1)">
     <use xlink:href="#DejaVuSans-46"/>
     <use xlink:href="#DejaVuSans-69" x="50.269531"/>
     <use xlink:href="#DejaVuSans-6e" x="78.052734"/>
     <use xlink:href="#DejaVuSans-61" x="141.431641"/>
     <use xlink:href="#DejaVuSans-6c" x="202.710938"/>
     <use xlink:href="#DejaVuSans-20" x="230.494141"/>
     <use xlink:href="#DejaVuSans-50" x="262.28125"/>
     <use xlink:href="#DejaVuSans-6e" x="320.833984"/>
     <use xlink:href="#DejaVuSans-4c" x="384.212891"/>
     <use xlink:href="#DejaVuSans-3a" x="439.925781"/>
     <use xlink:href="#DejaVuSans-20" x="473.617188"/>
     <use xlink:href="#DejaVuSans-31" x="505.404297"/>
     <use xlink:href="#DejaVuSans-33" x="569.027344"/>
     <use xlink:href="#DejaVuSans-36" x="632.650391"/>
     <use xlink:href="#DejaVuSans-37" x="696.273438"/>
     <use xlink:href="#DejaVuSans-2e" x="759.896484"/>
     <use xlink:href="#DejaVuSans-30" x="791.683594"/>
     <use xlink:href="#DejaVuSans-39" x="855.306641"/>
    </g>
   </g>
   <g id="text_32">
    <!-- PnL for SPY 03-27-2019 -->
    <g transform="translate(225.43 288.18) scale(0.12 -0.12)">
     <use xlink:href="#DejaVuSans-50"/>
     <use xlink:href="#DejaVuSans-6e" x="58.552734"/>
     <use xlink:href="#DejaVuSans-4c" x="121.931641"/>
     <use xlink:href="#DejaVuSans-20" x="177.644531"/>
     <use xlink:href="#DejaVuSans-66" x="209.431641"/>
     <use xlink:href="#DejaVuSans-6f" x="244.636719"/>
     <use xlink:href="#DejaVuSans-72" x="305.818359"/>
     <use xlink:href="#DejaVuSans-20" x="346.931641"/>
     <use xlink:href="#DejaVuSans-53" x="378.71875"/>
     <use xlink:href="#DejaVuSans-50" x="442.195312"/>
     <use xlink:href="#DejaVuSans-59" x="500.248047"/>
     <use xlink:href="#DejaVuSans-20" x="561.332031"/>
     <use xlink:href="#DejaVuSans-30" x="593.119141"/>
     <use xlink:href="#DejaVuSans-33" x="656.742188"/>
     <use xlink:href="#DejaVuSans-2d" x="720.365234"/>
     <use xlink:href="#DejaVuSans-32" x="756.449219"/>
     <use xlink:href="#DejaVuSans-37" x="820.072266"/>
     <use xlink:href="#DejaVuSans-2d" x="883.695312"/>
     <use xlink:href="#DejaVuSans-32" x="919.779297"/>
     <use xlink:href="#DejaVuSans-30" x="983.402344"/>
     <use xlink:href="#DejaVuSans-31" x="1047.025391"/>
     <use xlink:href="#DejaVuSans-39" x="1110.648438"/>
    </g>
   </g>
  </g>
  <g id="axes_4">
   <g id="patch_20">
    <path d="M 591.77 520.52 
L 1069.2 520.52 
L 1069.2 294.18 
L 591.77 294.18 
z
" style="fill: #ffffff"/>
   </g>
   <g id="matplotlib.axis_7">
    <g id="text_33">
     <!-- Time Increasing -->
     <g transform="translate(790.849063 532.118438) scale(0.1 -0.1)">
      <use xlink:href="#DejaVuSans-54"/>
      <use xlink:href="#DejaVuSans-69" x="57.958984"/>
      <use xlink:href="#DejaVuSans-6d" x="85.742188"/>
      <use xlink:href="#DejaVuSans-65" x="183.154297"/>
      <use xlink:href="#DejaVuSans-20" x="244.677734"/>
      <use xlink:href="#DejaVuSans-49" x="276.464844"/>
      <use xlink:href="#DejaVuSans-6e" x="305.957031"/>
      <use xlink:href="#DejaVuSans-63" x="369.335938"/>
      <use xlink:href="#DejaVuSans-72" x="424.316406"/>
      <use xlink:href="#DejaVuSans-65" x="463.179688"/>
      <use xlink:href="#DejaVuSans-61" x="524.703125"/>
      <use xlink:href="#DejaVuSans-73" x="585.982422"/>
      <use xlink:href="#DejaVuSans-69" x="638.082031"/>
      <use xlink:href="#DejaVuSans-6e" x="665.865234"/>
      <use xlink:href="#DejaVuSans-67" x="729.244141"/>
     </g>
    </g>
   </g>
   <g id="matplotlib.axis_8">
    <g id="ytick_21">
     <g id="line2d_44">
      <path d="M 591.77 510.231818 
L 1069.2 510.231818 
" clip-path="url(#p110bdf6143)" style="fill: none; stroke: #b0b0b0; stroke-width: 0.8; stroke-linecap: square"/>
     </g>
     <g id="line2d_45">
      <g>
       <use xlink:href="#m1e97e0aef0" x="591.77" y="510.231818" style="stroke: #000000; stroke-width: 0.8"/>
      </g>
     </g>
     <g id="text_34">
      <!-- 0.0 -->
      <g transform="translate(568.866875 514.031037) scale(0.1 -0.1)">
       <use xlink:href="#DejaVuSans-30"/>
       <use xlink:href="#DejaVuSans-2e" x="63.623047"/>
       <use xlink:href="#DejaVuSans-30" x="95.410156"/>
      </g>
     </g>
    </g>
    <g id="ytick_22">
     <g id="line2d_46">
      <path d="M 591.77 484.244946 
L 1069.2 484.244946 
" clip-path="url(#p110bdf6143)" style="fill: none; stroke: #b0b0b0; stroke-width: 0.8; stroke-linecap: square"/>
     </g>
     <g id="line2d_47">
      <g>
       <use xlink:href="#m1e97e0aef0" x="591.77" y="484.244946" style="stroke: #000000; stroke-width: 0.8"/>
      </g>
     </g>
     <g id="text_35">
      <!-- 0.5 -->
      <g transform="translate(568.866875 488.044165) scale(0.1 -0.1)">
       <use xlink:href="#DejaVuSans-30"/>
       <use xlink:href="#DejaVuSans-2e" x="63.623047"/>
       <use xlink:href="#DejaVuSans-35" x="95.410156"/>
      </g>
     </g>
    </g>
    <g id="ytick_23">
     <g id="line2d_48">
      <path d="M 591.77 458.258074 
L 1069.2 458.258074 
" clip-path="url(#p110bdf6143)" style="fill: none; stroke: #b0b0b0; stroke-width: 0.8; stroke-linecap: square"/>
     </g>
     <g id="line2d_49">
      <g>
       <use xlink:href="#m1e97e0aef0" x="591.77" y="458.258074" style="stroke: #000000; stroke-width: 0.8"/>
      </g>
     </g>
     <g id="text_36">
      <!-- 1.0 -->
      <g transform="translate(568.866875 462.057293) scale(0.1 -0.1)">
       <use xlink:href="#DejaVuSans-31"/>
       <use xlink:href="#DejaVuSans-2e" x="63.623047"/>
       <use xlink:href="#DejaVuSans-30" x="95.410156"/>
      </g>
     </g>
    </g>
    <g id="ytick_24">
     <g id="line2d_50">
      <path d="M 591.77 432.271202 
L 1069.2 432.271202 
" clip-path="url(#p110bdf6143)" style="fill: none; stroke: #b0b0b0; stroke-width: 0.8; stroke-linecap: square"/>
     </g>
     <g id="line2d_51">
      <g>
       <use xlink:href="#m1e97e0aef0" x="591.77" y="432.271202" style="stroke: #000000; stroke-width: 0.8"/>
      </g>
     </g>
     <g id="text_37">
      <!-- 1.5 -->
      <g transform="translate(568.866875 436.070421) scale(0.1 -0.1)">
       <use xlink:href="#DejaVuSans-31"/>
       <use xlink:href="#DejaVuSans-2e" x="63.623047"/>
       <use xlink:href="#DejaVuSans-35" x="95.410156"/>
      </g>
     </g>
    </g>
    <g id="ytick_25">
     <g id="line2d_52">
      <path d="M 591.77 406.28433 
L 1069.2 406.28433 
" clip-path="url(#p110bdf6143)" style="fill: none; stroke: #b0b0b0; stroke-width: 0.8; stroke-linecap: square"/>
     </g>
     <g id="line2d_53">
      <g>
       <use xlink:href="#m1e97e0aef0" x="591.77" y="406.28433" style="stroke: #000000; stroke-width: 0.8"/>
      </g>
     </g>
     <g id="text_38">
      <!-- 2.0 -->
      <g transform="translate(568.866875 410.083549) scale(0.1 -0.1)">
       <use xlink:href="#DejaVuSans-32"/>
       <use xlink:href="#DejaVuSans-2e" x="63.623047"/>
       <use xlink:href="#DejaVuSans-30" x="95.410156"/>
      </g>
     </g>
    </g>
    <g id="ytick_26">
     <g id="line2d_54">
      <path d="M 591.77 380.297458 
L 1069.2 380.297458 
" clip-path="url(#p110bdf6143)" style="fill: none; stroke: #b0b0b0; stroke-width: 0.8; stroke-linecap: square"/>
     </g>
     <g id="line2d_55">
      <g>
       <use xlink:href="#m1e97e0aef0" x="591.77" y="380.297458" style="stroke: #000000; stroke-width: 0.8"/>
      </g>
     </g>
     <g id="text_39">
      <!-- 2.5 -->
      <g transform="translate(568.866875 384.096677) scale(0.1 -0.1)">
       <use xlink:href="#DejaVuSans-32"/>
       <use xlink:href="#DejaVuSans-2e" x="63.623047"/>
       <use xlink:href="#DejaVuSans-35" x="95.410156"/>
      </g>
     </g>
    </g>
    <g id="ytick_27">
     <g id="line2d_56">
      <path d="M 591.77 354.310586 
L 1069.2 354.310586 
" clip-path="url(#p110bdf6143)" style="fill: none; stroke: #b0b0b0; stroke-width: 0.8; stroke-linecap: square"/>
     </g>
     <g id="line2d_57">
      <g>
       <use xlink:href="#m1e97e0aef0" x="591.77" y="354.310586" style="stroke: #000000; stroke-width: 0.8"/>
      </g>
     </g>
     <g id="text_40">
      <!-- 3.0 -->
      <g transform="translate(568.866875 358.109805) scale(0.1 -0.1)">
       <use xlink:href="#DejaVuSans-33"/>
       <use xlink:href="#DejaVuSans-2e" x="63.623047"/>
       <use xlink:href="#DejaVuSans-30" x="95.410156"/>
      </g>
     </g>
    </g>
    <g id="ytick_28">
     <g id="line2d_58">
      <path d="M 591.77 328.323714 
L 1069.2 328.323714 
" clip-path="url(#p110bdf6143)" style="fill: none; stroke: #b0b0b0; stroke-width: 0.8; stroke-linecap: square"/>
     </g>
     <g id="line2d_59">
      <g>
       <use xlink:href="#m1e97e0aef0" x="591.77" y="328.323714" style="stroke: #000000; stroke-width: 0.8"/>
      </g>
     </g>
     <g id="text_41">
      <!-- 3.5 -->
      <g transform="translate(568.866875 332.122933) scale(0.1 -0.1)">
       <use xlink:href="#DejaVuSans-33"/>
       <use xlink:href="#DejaVuSans-2e" x="63.623047"/>
       <use xlink:href="#DejaVuSans-35" x="95.410156"/>
      </g>
     </g>
    </g>
    <g id="ytick_29">
     <g id="line2d_60">
      <path d="M 591.77 302.336843 
L 1069.2 302.336843 
" clip-path="url(#p110bdf6143)" style="fill: none; stroke: #b0b0b0; stroke-width: 0.8; stroke-linecap: square"/>
     </g>
     <g id="line2d_61">
      <g>
       <use xlink:href="#m1e97e0aef0" x="591.77" y="302.336843" style="stroke: #000000; stroke-width: 0.8"/>
      </g>
     </g>
     <g id="text_42">
      <!-- 4.0 -->
      <g transform="translate(568.866875 306.136061) scale(0.1 -0.1)">
       <use xlink:href="#DejaVuSans-34"/>
       <use xlink:href="#DejaVuSans-2e" x="63.623047"/>
       <use xlink:href="#DejaVuSans-30" x="95.410156"/>
      </g>
     </g>
    </g>
    <g id="text_43">
     <!-- PNL -->
     <g transform="translate(562.787187 416.891406) rotate(-90) scale(0.1 -0.1)">
      <use xlink:href="#DejaVuSans-50"/>
      <use xlink:href="#DejaVuSans-4e" x="60.302734"/>
      <use xlink:href="#DejaVuSans-4c" x="135.107422"/>
     </g>
    </g>
   </g>
   <g id="line2d_62">
    <path d="M 613.471364 510.231818 
L 620.348556 510.231818 
L 621.112689 304.468182 
L 1047.498636 304.468182 
L 1047.498636 304.468182 
" clip-path="url(#p110bdf6143)" style="fill: none; stroke: #1f77b4; stroke-width: 1.5; stroke-linecap: square"/>
   </g>
   <g id="patch_21">
    <path d="M 591.77 520.52 
L 591.77 294.18 
" style="fill: none; stroke: #000000; stroke-width: 0.8; stroke-linejoin: miter; stroke-linecap: square"/>
   </g>
   <g id="patch_22">
    <path d="M 1069.2 520.52 
L 1069.2 294.18 
" style="fill: none; stroke: #000000; stroke-width: 0.8; stroke-linejoin: miter; stroke-linecap: square"/>
   </g>
   <g id="patch_23">
    <path d="M 591.77 520.52 
L 1069.2 520.52 
" style="fill: none; stroke: #000000; stroke-width: 0.8; stroke-linejoin: miter; stroke-linecap: square"/>
   </g>
   <g id="patch_24">
    <path d="M 591.77 294.18 
L 1069.2 294.18 
" style="fill: none; stroke: #000000; stroke-width: 0.8; stroke-linejoin: miter; stroke-linecap: square"/>
   </g>
   <g id="text_44">
    <g id="patch_25">
     <path d="M 968.525375 330.492125 
L 1049.3285 330.492125 
L 1049.3285 312.814 
L 968.525375 312.814 
z
" style="fill: #ffffff; opacity: 0.7; stroke: #000000; stroke-linejoin: miter"/>
    </g>
    <!-- Final PnL: 3.96 -->
    <g transform="translate(972.525375 324.412438) scale(0.1 -0.1)">
     <use xlink:href="#DejaVuSans-46"/>
     <use xlink:href="#DejaVuSans-69" x="50.269531"/>
     <use xlink:href="#DejaVuSans-6e" x="78.052734"/>
     <use xlink:href="#DejaVuSans-61" x="141.431641"/>
     <use xlink:href="#DejaVuSans-6c" x="202.710938"/>
     <use xlink:href="#DejaVuSans-20" x="230.494141"/>
     <use xlink:href="#DejaVuSans-50" x="262.28125"/>
     <use xlink:href="#DejaVuSans-6e" x="320.833984"/>
     <use xlink:href="#DejaVuSans-4c" x="384.212891"/>
     <use xlink:href="#DejaVuSans-3a" x="439.925781"/>
     <use xlink:href="#DejaVuSans-20" x="473.617188"/>
     <use xlink:href="#DejaVuSans-33" x="505.404297"/>
     <use xlink:href="#DejaVuSans-2e" x="569.027344"/>
     <use xlink:href="#DejaVuSans-39" x="600.814453"/>
     <use xlink:href="#DejaVuSans-36" x="664.4375"/>
    </g>
   </g>
   <g id="text_45">
    <!-- PnL for SPY 07-30-2019 -->
    <g transform="translate(760.03 288.18) scale(0.12 -0.12)">
     <use xlink:href="#DejaVuSans-50"/>
     <use xlink:href="#DejaVuSans-6e" x="58.552734"/>
     <use xlink:href="#DejaVuSans-4c" x="121.931641"/>
     <use xlink:href="#DejaVuSans-20" x="177.644531"/>
     <use xlink:href="#DejaVuSans-66" x="209.431641"/>
     <use xlink:href="#DejaVuSans-6f" x="244.636719"/>
     <use xlink:href="#DejaVuSans-72" x="305.818359"/>
     <use xlink:href="#DejaVuSans-20" x="346.931641"/>
     <use xlink:href="#DejaVuSans-53" x="378.71875"/>
     <use xlink:href="#DejaVuSans-50" x="442.195312"/>
     <use xlink:href="#DejaVuSans-59" x="500.248047"/>
     <use xlink:href="#DejaVuSans-20" x="561.332031"/>
     <use xlink:href="#DejaVuSans-30" x="593.119141"/>
     <use xlink:href="#DejaVuSans-37" x="656.742188"/>
     <use xlink:href="#DejaVuSans-2d" x="720.365234"/>
     <use xlink:href="#DejaVuSans-33" x="756.449219"/>
     <use xlink:href="#DejaVuSans-30" x="820.072266"/>
     <use xlink:href="#DejaVuSans-2d" x="883.695312"/>
     <use xlink:href="#DejaVuSans-32" x="919.779297"/>
     <use xlink:href="#DejaVuSans-30" x="983.402344"/>
     <use xlink:href="#DejaVuSans-31" x="1047.025391"/>
     <use xlink:href="#DejaVuSans-39" x="1110.648438"/>
    </g>
   </g>
  </g>
  <g id="axes_5">
   <g id="patch_26">
    <path d="M 57.17 787.82 
L 534.6 787.82 
L 534.6 561.48 
L 57.17 561.48 
z
" style="fill: #ffffff"/>
   </g>
   <g id="matplotlib.axis_9">
    <g id="text_46">
     <!-- Time Increasing -->
     <g transform="translate(256.249062 799.418437) scale(0.1 -0.1)">
      <use xlink:href="#DejaVuSans-54"/>
      <use xlink:href="#DejaVuSans-69" x="57.958984"/>
      <use xlink:href="#DejaVuSans-6d" x="85.742188"/>
      <use xlink:href="#DejaVuSans-65" x="183.154297"/>
      <use xlink:href="#DejaVuSans-20" x="244.677734"/>
      <use xlink:href="#DejaVuSans-49" x="276.464844"/>
      <use xlink:href="#DejaVuSans-6e" x="305.957031"/>
      <use xlink:href="#DejaVuSans-63" x="369.335938"/>
      <use xlink:href="#DejaVuSans-72" x="424.316406"/>
      <use xlink:href="#DejaVuSans-65" x="463.179688"/>
      <use xlink:href="#DejaVuSans-61" x="524.703125"/>
      <use xlink:href="#DejaVuSans-73" x="585.982422"/>
      <use xlink:href="#DejaVuSans-69" x="638.082031"/>
      <use xlink:href="#DejaVuSans-6e" x="665.865234"/>
      <use xlink:href="#DejaVuSans-67" x="729.244141"/>
     </g>
    </g>
   </g>
   <g id="matplotlib.axis_10">
    <g id="ytick_30">
     <g id="line2d_63">
      <path d="M 57.17 777.531818 
L 534.6 777.531818 
" clip-path="url(#p9bad26f8d0)" style="fill: none; stroke: #b0b0b0; stroke-width: 0.8; stroke-linecap: square"/>
     </g>
     <g id="line2d_64">
      <g>
       <use xlink:href="#m1e97e0aef0" x="57.17" y="777.531818" style="stroke: #000000; stroke-width: 0.8"/>
      </g>
     </g>
     <g id="text_47">
      <!-- 0 -->
      <g transform="translate(43.8075 781.331037) scale(0.1 -0.1)">
       <use xlink:href="#DejaVuSans-30"/>
      </g>
     </g>
    </g>
    <g id="ytick_31">
     <g id="line2d_65">
      <path d="M 57.17 730.764358 
L 534.6 730.764358 
" clip-path="url(#p9bad26f8d0)" style="fill: none; stroke: #b0b0b0; stroke-width: 0.8; stroke-linecap: square"/>
     </g>
     <g id="line2d_66">
      <g>
       <use xlink:href="#m1e97e0aef0" x="57.17" y="730.764358" style="stroke: #000000; stroke-width: 0.8"/>
      </g>
     </g>
     <g id="text_48">
      <!-- 1 -->
      <g transform="translate(43.8075 734.563577) scale(0.1 -0.1)">
       <use xlink:href="#DejaVuSans-31"/>
      </g>
     </g>
    </g>
    <g id="ytick_32">
     <g id="line2d_67">
      <path d="M 57.17 683.996898 
L 534.6 683.996898 
" clip-path="url(#p9bad26f8d0)" style="fill: none; stroke: #b0b0b0; stroke-width: 0.8; stroke-linecap: square"/>
     </g>
     <g id="line2d_68">
      <g>
       <use xlink:href="#m1e97e0aef0" x="57.17" y="683.996898" style="stroke: #000000; stroke-width: 0.8"/>
      </g>
     </g>
     <g id="text_49">
      <!-- 2 -->
      <g transform="translate(43.8075 687.796117) scale(0.1 -0.1)">
       <use xlink:href="#DejaVuSans-32"/>
      </g>
     </g>
    </g>
    <g id="ytick_33">
     <g id="line2d_69">
      <path d="M 57.17 637.229438 
L 534.6 637.229438 
" clip-path="url(#p9bad26f8d0)" style="fill: none; stroke: #b0b0b0; stroke-width: 0.8; stroke-linecap: square"/>
     </g>
     <g id="line2d_70">
      <g>
       <use xlink:href="#m1e97e0aef0" x="57.17" y="637.229438" style="stroke: #000000; stroke-width: 0.8"/>
      </g>
     </g>
     <g id="text_50">
      <!-- 3 -->
      <g transform="translate(43.8075 641.028656) scale(0.1 -0.1)">
       <use xlink:href="#DejaVuSans-33"/>
      </g>
     </g>
    </g>
    <g id="ytick_34">
     <g id="line2d_71">
      <path d="M 57.17 590.461977 
L 534.6 590.461977 
" clip-path="url(#p9bad26f8d0)" style="fill: none; stroke: #b0b0b0; stroke-width: 0.8; stroke-linecap: square"/>
     </g>
     <g id="line2d_72">
      <g>
       <use xlink:href="#m1e97e0aef0" x="57.17" y="590.461977" style="stroke: #000000; stroke-width: 0.8"/>
      </g>
     </g>
     <g id="text_51">
      <!-- 4 -->
      <g transform="translate(43.8075 594.261196) scale(0.1 -0.1)">
       <use xlink:href="#DejaVuSans-34"/>
      </g>
     </g>
    </g>
    <g id="text_52">
     <!-- PNL -->
     <g transform="translate(37.727813 684.191406) rotate(-90) scale(0.1 -0.1)">
      <use xlink:href="#DejaVuSans-50"/>
      <use xlink:href="#DejaVuSans-4e" x="60.302734"/>
      <use xlink:href="#DejaVuSans-4c" x="135.107422"/>
     </g>
    </g>
   </g>
   <g id="line2d_73">
    <path d="M 78.871364 777.531818 
L 394.677874 777.531818 
L 395.504593 571.768182 
L 512.898636 571.768182 
L 512.898636 571.768182 
" clip-path="url(#p9bad26f8d0)" style="fill: none; stroke: #1f77b4; stroke-width: 1.5; stroke-linecap: square"/>
   </g>
   <g id="patch_27">
    <path d="M 57.17 787.82 
L 57.17 561.48 
" style="fill: none; stroke: #000000; stroke-width: 0.8; stroke-linejoin: miter; stroke-linecap: square"/>
   </g>
   <g id="patch_28">
    <path d="M 534.6 787.82 
L 534.6 561.48 
" style="fill: none; stroke: #000000; stroke-width: 0.8; stroke-linejoin: miter; stroke-linecap: square"/>
   </g>
   <g id="patch_29">
    <path d="M 57.17 787.82 
L 534.6 787.82 
" style="fill: none; stroke: #000000; stroke-width: 0.8; stroke-linejoin: miter; stroke-linecap: square"/>
   </g>
   <g id="patch_30">
    <path d="M 57.17 561.48 
L 534.6 561.48 
" style="fill: none; stroke: #000000; stroke-width: 0.8; stroke-linejoin: miter; stroke-linecap: square"/>
   </g>
   <g id="text_53">
    <g id="patch_31">
     <path d="M 433.925375 597.792125 
L 514.7285 597.792125 
L 514.7285 580.114 
L 433.925375 580.114 
z
" style="fill: #ffffff; opacity: 0.7; stroke: #000000; stroke-linejoin: miter"/>
    </g>
    <!-- Final PnL: 4.40 -->
    <g transform="translate(437.925375 591.712438) scale(0.1 -0.1)">
     <use xlink:href="#DejaVuSans-46"/>
     <use xlink:href="#DejaVuSans-69" x="50.269531"/>
     <use xlink:href="#DejaVuSans-6e" x="78.052734"/>
     <use xlink:href="#DejaVuSans-61" x="141.431641"/>
     <use xlink:href="#DejaVuSans-6c" x="202.710938"/>
     <use xlink:href="#DejaVuSans-20" x="230.494141"/>
     <use xlink:href="#DejaVuSans-50" x="262.28125"/>
     <use xlink:href="#DejaVuSans-6e" x="320.833984"/>
     <use xlink:href="#DejaVuSans-4c" x="384.212891"/>
     <use xlink:href="#DejaVuSans-3a" x="439.925781"/>
     <use xlink:href="#DejaVuSans-20" x="473.617188"/>
     <use xlink:href="#DejaVuSans-34" x="505.404297"/>
     <use xlink:href="#DejaVuSans-2e" x="569.027344"/>
     <use xlink:href="#DejaVuSans-34" x="600.814453"/>
     <use xlink:href="#DejaVuSans-30" x="664.4375"/>
    </g>
   </g>
   <g id="text_54">
    <!-- PnL for SPY 08-30-2019 -->
    <g transform="translate(225.43 555.48) scale(0.12 -0.12)">
     <use xlink:href="#DejaVuSans-50"/>
     <use xlink:href="#DejaVuSans-6e" x="58.552734"/>
     <use xlink:href="#DejaVuSans-4c" x="121.931641"/>
     <use xlink:href="#DejaVuSans-20" x="177.644531"/>
     <use xlink:href="#DejaVuSans-66" x="209.431641"/>
     <use xlink:href="#DejaVuSans-6f" x="244.636719"/>
     <use xlink:href="#DejaVuSans-72" x="305.818359"/>
     <use xlink:href="#DejaVuSans-20" x="346.931641"/>
     <use xlink:href="#DejaVuSans-53" x="378.71875"/>
     <use xlink:href="#DejaVuSans-50" x="442.195312"/>
     <use xlink:href="#DejaVuSans-59" x="500.248047"/>
     <use xlink:href="#DejaVuSans-20" x="561.332031"/>
     <use xlink:href="#DejaVuSans-30" x="593.119141"/>
     <use xlink:href="#DejaVuSans-38" x="656.742188"/>
     <use xlink:href="#DejaVuSans-2d" x="720.365234"/>
     <use xlink:href="#DejaVuSans-33" x="756.449219"/>
     <use xlink:href="#DejaVuSans-30" x="820.072266"/>
     <use xlink:href="#DejaVuSans-2d" x="883.695312"/>
     <use xlink:href="#DejaVuSans-32" x="919.779297"/>
     <use xlink:href="#DejaVuSans-30" x="983.402344"/>
     <use xlink:href="#DejaVuSans-31" x="1047.025391"/>
     <use xlink:href="#DejaVuSans-39" x="1110.648438"/>
    </g>
   </g>
  </g>
  <g id="axes_6">
   <g id="patch_32">
    <path d="M 591.77 787.82 
L 1069.2 787.82 
L 1069.2 561.48 
L 591.77 561.48 
z
" style="fill: #ffffff"/>
   </g>
   <g id="matplotlib.axis_11">
    <g id="text_55">
     <!-- Time Increasing -->
     <g transform="translate(790.849063 799.418437) scale(0.1 -0.1)">
      <use xlink:href="#DejaVuSans-54"/>
      <use xlink:href="#DejaVuSans-69" x="57.958984"/>
      <use xlink:href="#DejaVuSans-6d" x="85.742188"/>
      <use xlink:href="#DejaVuSans-65" x="183.154297"/>
      <use xlink:href="#DejaVuSans-20" x="244.677734"/>
      <use xlink:href="#DejaVuSans-49" x="276.464844"/>
      <use xlink:href="#DejaVuSans-6e" x="305.957031"/>
      <use xlink:href="#DejaVuSans-63" x="369.335938"/>
      <use xlink:href="#DejaVuSans-72" x="424.316406"/>
      <use xlink:href="#DejaVuSans-65" x="463.179688"/>
      <use xlink:href="#DejaVuSans-61" x="524.703125"/>
      <use xlink:href="#DejaVuSans-73" x="585.982422"/>
      <use xlink:href="#DejaVuSans-69" x="638.082031"/>
      <use xlink:href="#DejaVuSans-6e" x="665.865234"/>
      <use xlink:href="#DejaVuSans-67" x="729.244141"/>
     </g>
    </g>
   </g>
   <g id="matplotlib.axis_12">
    <g id="ytick_35">
     <g id="line2d_74">
      <path d="M 591.77 777.531818 
L 1069.2 777.531818 
" clip-path="url(#pa476c149d4)" style="fill: none; stroke: #b0b0b0; stroke-width: 0.8; stroke-linecap: square"/>
     </g>
     <g id="line2d_75">
      <g>
       <use xlink:href="#m1e97e0aef0" x="591.77" y="777.531818" style="stroke: #000000; stroke-width: 0.8"/>
      </g>
     </g>
     <g id="text_56">
      <!-- 0 -->
      <g transform="translate(578.4075 781.331037) scale(0.1 -0.1)">
       <use xlink:href="#DejaVuSans-30"/>
      </g>
     </g>
    </g>
    <g id="ytick_36">
     <g id="line2d_76">
      <path d="M 591.77 744.295589 
L 1069.2 744.295589 
" clip-path="url(#pa476c149d4)" style="fill: none; stroke: #b0b0b0; stroke-width: 0.8; stroke-linecap: square"/>
     </g>
     <g id="line2d_77">
      <g>
       <use xlink:href="#m1e97e0aef0" x="591.77" y="744.295589" style="stroke: #000000; stroke-width: 0.8"/>
      </g>
     </g>
     <g id="text_57">
      <!-- 1000 -->
      <g transform="translate(559.32 748.094808) scale(0.1 -0.1)">
       <use xlink:href="#DejaVuSans-31"/>
       <use xlink:href="#DejaVuSans-30" x="63.623047"/>
       <use xlink:href="#DejaVuSans-30" x="127.246094"/>
       <use xlink:href="#DejaVuSans-30" x="190.869141"/>
      </g>
     </g>
    </g>
    <g id="ytick_37">
     <g id="line2d_78">
      <path d="M 591.77 711.05936 
L 1069.2 711.05936 
" clip-path="url(#pa476c149d4)" style="fill: none; stroke: #b0b0b0; stroke-width: 0.8; stroke-linecap: square"/>
     </g>
     <g id="line2d_79">
      <g>
       <use xlink:href="#m1e97e0aef0" x="591.77" y="711.05936" style="stroke: #000000; stroke-width: 0.8"/>
      </g>
     </g>
     <g id="text_58">
      <!-- 2000 -->
      <g transform="translate(559.32 714.858579) scale(0.1 -0.1)">
       <use xlink:href="#DejaVuSans-32"/>
       <use xlink:href="#DejaVuSans-30" x="63.623047"/>
       <use xlink:href="#DejaVuSans-30" x="127.246094"/>
       <use xlink:href="#DejaVuSans-30" x="190.869141"/>
      </g>
     </g>
    </g>
    <g id="ytick_38">
     <g id="line2d_80">
      <path d="M 591.77 677.823131 
L 1069.2 677.823131 
" clip-path="url(#pa476c149d4)" style="fill: none; stroke: #b0b0b0; stroke-width: 0.8; stroke-linecap: square"/>
     </g>
     <g id="line2d_81">
      <g>
       <use xlink:href="#m1e97e0aef0" x="591.77" y="677.823131" style="stroke: #000000; stroke-width: 0.8"/>
      </g>
     </g>
     <g id="text_59">
      <!-- 3000 -->
      <g transform="translate(559.32 681.62235) scale(0.1 -0.1)">
       <use xlink:href="#DejaVuSans-33"/>
       <use xlink:href="#DejaVuSans-30" x="63.623047"/>
       <use xlink:href="#DejaVuSans-30" x="127.246094"/>
       <use xlink:href="#DejaVuSans-30" x="190.869141"/>
      </g>
     </g>
    </g>
    <g id="ytick_39">
     <g id="line2d_82">
      <path d="M 591.77 644.586902 
L 1069.2 644.586902 
" clip-path="url(#pa476c149d4)" style="fill: none; stroke: #b0b0b0; stroke-width: 0.8; stroke-linecap: square"/>
     </g>
     <g id="line2d_83">
      <g>
       <use xlink:href="#m1e97e0aef0" x="591.77" y="644.586902" style="stroke: #000000; stroke-width: 0.8"/>
      </g>
     </g>
     <g id="text_60">
      <!-- 4000 -->
      <g transform="translate(559.32 648.386121) scale(0.1 -0.1)">
       <use xlink:href="#DejaVuSans-34"/>
       <use xlink:href="#DejaVuSans-30" x="63.623047"/>
       <use xlink:href="#DejaVuSans-30" x="127.246094"/>
       <use xlink:href="#DejaVuSans-30" x="190.869141"/>
      </g>
     </g>
    </g>
    <g id="ytick_40">
     <g id="line2d_84">
      <path d="M 591.77 611.350673 
L 1069.2 611.350673 
" clip-path="url(#pa476c149d4)" style="fill: none; stroke: #b0b0b0; stroke-width: 0.8; stroke-linecap: square"/>
     </g>
     <g id="line2d_85">
      <g>
       <use xlink:href="#m1e97e0aef0" x="591.77" y="611.350673" style="stroke: #000000; stroke-width: 0.8"/>
      </g>
     </g>
     <g id="text_61">
      <!-- 5000 -->
      <g transform="translate(559.32 615.149892) scale(0.1 -0.1)">
       <use xlink:href="#DejaVuSans-35"/>
       <use xlink:href="#DejaVuSans-30" x="63.623047"/>
       <use xlink:href="#DejaVuSans-30" x="127.246094"/>
       <use xlink:href="#DejaVuSans-30" x="190.869141"/>
      </g>
     </g>
    </g>
    <g id="ytick_41">
     <g id="line2d_86">
      <path d="M 591.77 578.114444 
L 1069.2 578.114444 
" clip-path="url(#pa476c149d4)" style="fill: none; stroke: #b0b0b0; stroke-width: 0.8; stroke-linecap: square"/>
     </g>
     <g id="line2d_87">
      <g>
       <use xlink:href="#m1e97e0aef0" x="591.77" y="578.114444" style="stroke: #000000; stroke-width: 0.8"/>
      </g>
     </g>
     <g id="text_62">
      <!-- 6000 -->
      <g transform="translate(559.32 581.913663) scale(0.1 -0.1)">
       <use xlink:href="#DejaVuSans-36"/>
       <use xlink:href="#DejaVuSans-30" x="63.623047"/>
       <use xlink:href="#DejaVuSans-30" x="127.246094"/>
       <use xlink:href="#DejaVuSans-30" x="190.869141"/>
      </g>
     </g>
    </g>
    <g id="text_63">
     <!-- PNL -->
     <g transform="translate(553.240312 684.191406) rotate(-90) scale(0.1 -0.1)">
      <use xlink:href="#DejaVuSans-50"/>
      <use xlink:href="#DejaVuSans-4e" x="60.302734"/>
      <use xlink:href="#DejaVuSans-4c" x="135.107422"/>
     </g>
    </g>
   </g>
   <g id="line2d_88">
    <path d="M 613.471364 777.531818 
L 638.424151 777.531818 
L 639.180296 752.243887 
L 639.936441 751.962075 
L 806.288358 751.962075 
L 807.044503 579.290049 
L 816.118244 579.2165 
L 816.874389 575.75671 
L 841.827176 575.711038 
L 842.583321 575.024246 
L 856.950078 575.016149 
L 857.706223 574.440577 
L 901.562637 574.366522 
L 903.074927 574.247211 
L 903.831072 574.247211 
L 904.587217 571.768182 
L 1047.498636 571.768182 
L 1047.498636 571.768182 
" clip-path="url(#pa476c149d4)" style="fill: none; stroke: #1f77b4; stroke-width: 1.5; stroke-linecap: square"/>
   </g>
   <g id="patch_33">
    <path d="M 591.77 787.82 
L 591.77 561.48 
" style="fill: none; stroke: #000000; stroke-width: 0.8; stroke-linejoin: miter; stroke-linecap: square"/>
   </g>
   <g id="patch_34">
    <path d="M 1069.2 787.82 
L 1069.2 561.48 
" style="fill: none; stroke: #000000; stroke-width: 0.8; stroke-linejoin: miter; stroke-linecap: square"/>
   </g>
   <g id="patch_35">
    <path d="M 591.77 787.82 
L 1069.2 787.82 
" style="fill: none; stroke: #000000; stroke-width: 0.8; stroke-linejoin: miter; stroke-linecap: square"/>
   </g>
   <g id="patch_36">
    <path d="M 591.77 561.48 
L 1069.2 561.48 
" style="fill: none; stroke: #000000; stroke-width: 0.8; stroke-linejoin: miter; stroke-linecap: square"/>
   </g>
   <g id="text_64">
    <g id="patch_37">
     <path d="M 949.437875 597.792125 
L 1049.3285 597.792125 
L 1049.3285 580.114 
L 949.437875 580.114 
z
" style="fill: #ffffff; opacity: 0.7; stroke: #000000; stroke-linejoin: miter"/>
    </g>
    <!-- Final PnL: 6190.94 -->
    <g transform="translate(953.437875 591.712438) scale(0.1 -0.1)">
     <use xlink:href="#DejaVuSans-46"/>
     <use xlink:href="#DejaVuSans-69" x="50.269531"/>
     <use xlink:href="#DejaVuSans-6e" x="78.052734"/>
     <use xlink:href="#DejaVuSans-61" x="141.431641"/>
     <use xlink:href="#DejaVuSans-6c" x="202.710938"/>
     <use xlink:href="#DejaVuSans-20" x="230.494141"/>
     <use xlink:href="#DejaVuSans-50" x="262.28125"/>
     <use xlink:href="#DejaVuSans-6e" x="320.833984"/>
     <use xlink:href="#DejaVuSans-4c" x="384.212891"/>
     <use xlink:href="#DejaVuSans-3a" x="439.925781"/>
     <use xlink:href="#DejaVuSans-20" x="473.617188"/>
     <use xlink:href="#DejaVuSans-36" x="505.404297"/>
     <use xlink:href="#DejaVuSans-31" x="569.027344"/>
     <use xlink:href="#DejaVuSans-39" x="632.650391"/>
     <use xlink:href="#DejaVuSans-30" x="696.273438"/>
     <use xlink:href="#DejaVuSans-2e" x="759.896484"/>
     <use xlink:href="#DejaVuSans-39" x="791.683594"/>
     <use xlink:href="#DejaVuSans-34" x="855.306641"/>
    </g>
   </g>
   <g id="text_65">
    <!-- PnL for SPY 10-30-2019 -->
    <g transform="translate(760.03 555.48) scale(0.12 -0.12)">
     <use xlink:href="#DejaVuSans-50"/>
     <use xlink:href="#DejaVuSans-6e" x="58.552734"/>
     <use xlink:href="#DejaVuSans-4c" x="121.931641"/>
     <use xlink:href="#DejaVuSans-20" x="177.644531"/>
     <use xlink:href="#DejaVuSans-66" x="209.431641"/>
     <use xlink:href="#DejaVuSans-6f" x="244.636719"/>
     <use xlink:href="#DejaVuSans-72" x="305.818359"/>
     <use xlink:href="#DejaVuSans-20" x="346.931641"/>
     <use xlink:href="#DejaVuSans-53" x="378.71875"/>
     <use xlink:href="#DejaVuSans-50" x="442.195312"/>
     <use xlink:href="#DejaVuSans-59" x="500.248047"/>
     <use xlink:href="#DejaVuSans-20" x="561.332031"/>
     <use xlink:href="#DejaVuSans-31" x="593.119141"/>
     <use xlink:href="#DejaVuSans-30" x="656.742188"/>
     <use xlink:href="#DejaVuSans-2d" x="720.365234"/>
     <use xlink:href="#DejaVuSans-33" x="756.449219"/>
     <use xlink:href="#DejaVuSans-30" x="820.072266"/>
     <use xlink:href="#DejaVuSans-2d" x="883.695312"/>
     <use xlink:href="#DejaVuSans-32" x="919.779297"/>
     <use xlink:href="#DejaVuSans-30" x="983.402344"/>
     <use xlink:href="#DejaVuSans-31" x="1047.025391"/>
     <use xlink:href="#DejaVuSans-39" x="1110.648438"/>
    </g>
   </g>
  </g>
  <g id="axes_7">
   <g id="patch_38">
    <path d="M 57.17 1055.12 
L 534.6 1055.12 
L 534.6 828.78 
L 57.17 828.78 
z
" style="fill: #ffffff"/>
   </g>
   <g id="matplotlib.axis_13">
    <g id="text_66">
     <!-- Time Increasing -->
     <g transform="translate(256.249062 1066.718438) scale(0.1 -0.1)">
      <use xlink:href="#DejaVuSans-54"/>
      <use xlink:href="#DejaVuSans-69" x="57.958984"/>
      <use xlink:href="#DejaVuSans-6d" x="85.742188"/>
      <use xlink:href="#DejaVuSans-65" x="183.154297"/>
      <use xlink:href="#DejaVuSans-20" x="244.677734"/>
      <use xlink:href="#DejaVuSans-49" x="276.464844"/>
      <use xlink:href="#DejaVuSans-6e" x="305.957031"/>
      <use xlink:href="#DejaVuSans-63" x="369.335938"/>
      <use xlink:href="#DejaVuSans-72" x="424.316406"/>
      <use xlink:href="#DejaVuSans-65" x="463.179688"/>
      <use xlink:href="#DejaVuSans-61" x="524.703125"/>
      <use xlink:href="#DejaVuSans-73" x="585.982422"/>
      <use xlink:href="#DejaVuSans-69" x="638.082031"/>
      <use xlink:href="#DejaVuSans-6e" x="665.865234"/>
      <use xlink:href="#DejaVuSans-67" x="729.244141"/>
     </g>
    </g>
   </g>
   <g id="matplotlib.axis_14">
    <g id="ytick_42">
     <g id="line2d_89">
      <path d="M 57.17 1044.831818 
L 534.6 1044.831818 
" clip-path="url(#p6ab9c4786c)" style="fill: none; stroke: #b0b0b0; stroke-width: 0.8; stroke-linecap: square"/>
     </g>
     <g id="line2d_90">
      <g>
       <use xlink:href="#m1e97e0aef0" x="57.17" y="1044.831818" style="stroke: #000000; stroke-width: 0.8"/>
      </g>
     </g>
     <g id="text_67">
      <!-- 0 -->
      <g transform="translate(43.8075 1048.631037) scale(0.1 -0.1)">
       <use xlink:href="#DejaVuSans-30"/>
      </g>
     </g>
    </g>
    <g id="ytick_43">
     <g id="line2d_91">
      <path d="M 57.17 997.496078 
L 534.6 997.496078 
" clip-path="url(#p6ab9c4786c)" style="fill: none; stroke: #b0b0b0; stroke-width: 0.8; stroke-linecap: square"/>
     </g>
     <g id="line2d_92">
      <g>
       <use xlink:href="#m1e97e0aef0" x="57.17" y="997.496078" style="stroke: #000000; stroke-width: 0.8"/>
      </g>
     </g>
     <g id="text_68">
      <!-- 5 -->
      <g transform="translate(43.8075 1001.295296) scale(0.1 -0.1)">
       <use xlink:href="#DejaVuSans-35"/>
      </g>
     </g>
    </g>
    <g id="ytick_44">
     <g id="line2d_93">
      <path d="M 57.17 950.160337 
L 534.6 950.160337 
" clip-path="url(#p6ab9c4786c)" style="fill: none; stroke: #b0b0b0; stroke-width: 0.8; stroke-linecap: square"/>
     </g>
     <g id="line2d_94">
      <g>
       <use xlink:href="#m1e97e0aef0" x="57.17" y="950.160337" style="stroke: #000000; stroke-width: 0.8"/>
      </g>
     </g>
     <g id="text_69">
      <!-- 10 -->
      <g transform="translate(37.445 953.959556) scale(0.1 -0.1)">
       <use xlink:href="#DejaVuSans-31"/>
       <use xlink:href="#DejaVuSans-30" x="63.623047"/>
      </g>
     </g>
    </g>
    <g id="ytick_45">
     <g id="line2d_95">
      <path d="M 57.17 902.824596 
L 534.6 902.824596 
" clip-path="url(#p6ab9c4786c)" style="fill: none; stroke: #b0b0b0; stroke-width: 0.8; stroke-linecap: square"/>
     </g>
     <g id="line2d_96">
      <g>
       <use xlink:href="#m1e97e0aef0" x="57.17" y="902.824596" style="stroke: #000000; stroke-width: 0.8"/>
      </g>
     </g>
     <g id="text_70">
      <!-- 15 -->
      <g transform="translate(37.445 906.623815) scale(0.1 -0.1)">
       <use xlink:href="#DejaVuSans-31"/>
       <use xlink:href="#DejaVuSans-35" x="63.623047"/>
      </g>
     </g>
    </g>
    <g id="ytick_46">
     <g id="line2d_97">
      <path d="M 57.17 855.488856 
L 534.6 855.488856 
" clip-path="url(#p6ab9c4786c)" style="fill: none; stroke: #b0b0b0; stroke-width: 0.8; stroke-linecap: square"/>
     </g>
     <g id="line2d_98">
      <g>
       <use xlink:href="#m1e97e0aef0" x="57.17" y="855.488856" style="stroke: #000000; stroke-width: 0.8"/>
      </g>
     </g>
     <g id="text_71">
      <!-- 20 -->
      <g transform="translate(37.445 859.288074) scale(0.1 -0.1)">
       <use xlink:href="#DejaVuSans-32"/>
       <use xlink:href="#DejaVuSans-30" x="63.623047"/>
      </g>
     </g>
    </g>
    <g id="text_72">
     <!-- PNL -->
     <g transform="translate(31.365313 951.491406) rotate(-90) scale(0.1 -0.1)">
      <use xlink:href="#DejaVuSans-50"/>
      <use xlink:href="#DejaVuSans-4e" x="60.302734"/>
      <use xlink:href="#DejaVuSans-4c" x="135.107422"/>
     </g>
    </g>
   </g>
   <g id="line2d_99">
    <path d="M 78.871364 1044.831818 
L 91.56686 1044.831818 
L 92.360328 848.902201 
L 105.849293 848.902201 
L 106.642761 839.068182 
L 512.898636 839.068182 
L 512.898636 839.068182 
" clip-path="url(#p6ab9c4786c)" style="fill: none; stroke: #1f77b4; stroke-width: 1.5; stroke-linecap: square"/>
   </g>
   <g id="patch_39">
    <path d="M 57.17 1055.12 
L 57.17 828.78 
" style="fill: none; stroke: #000000; stroke-width: 0.8; stroke-linejoin: miter; stroke-linecap: square"/>
   </g>
   <g id="patch_40">
    <path d="M 534.6 1055.12 
L 534.6 828.78 
" style="fill: none; stroke: #000000; stroke-width: 0.8; stroke-linejoin: miter; stroke-linecap: square"/>
   </g>
   <g id="patch_41">
    <path d="M 57.17 1055.12 
L 534.6 1055.12 
" style="fill: none; stroke: #000000; stroke-width: 0.8; stroke-linejoin: miter; stroke-linecap: square"/>
   </g>
   <g id="patch_42">
    <path d="M 57.17 828.78 
L 534.6 828.78 
" style="fill: none; stroke: #000000; stroke-width: 0.8; stroke-linejoin: miter; stroke-linecap: square"/>
   </g>
   <g id="text_73">
    <g id="patch_43">
     <path d="M 427.562875 865.092125 
L 514.7285 865.092125 
L 514.7285 847.414 
L 427.562875 847.414 
z
" style="fill: #ffffff; opacity: 0.7; stroke: #000000; stroke-linejoin: miter"/>
    </g>
    <!-- Final PnL: 21.73 -->
    <g transform="translate(431.562875 859.012438) scale(0.1 -0.1)">
     <use xlink:href="#DejaVuSans-46"/>
     <use xlink:href="#DejaVuSans-69" x="50.269531"/>
     <use xlink:href="#DejaVuSans-6e" x="78.052734"/>
     <use xlink:href="#DejaVuSans-61" x="141.431641"/>
     <use xlink:href="#DejaVuSans-6c" x="202.710938"/>
     <use xlink:href="#DejaVuSans-20" x="230.494141"/>
     <use xlink:href="#DejaVuSans-50" x="262.28125"/>
     <use xlink:href="#DejaVuSans-6e" x="320.833984"/>
     <use xlink:href="#DejaVuSans-4c" x="384.212891"/>
     <use xlink:href="#DejaVuSans-3a" x="439.925781"/>
     <use xlink:href="#DejaVuSans-20" x="473.617188"/>
     <use xlink:href="#DejaVuSans-32" x="505.404297"/>
     <use xlink:href="#DejaVuSans-31" x="569.027344"/>
     <use xlink:href="#DejaVuSans-2e" x="632.650391"/>
     <use xlink:href="#DejaVuSans-37" x="664.4375"/>
     <use xlink:href="#DejaVuSans-33" x="728.060547"/>
    </g>
   </g>
   <g id="text_74">
    <!-- PnL for SPY 12-30-2019 -->
    <g transform="translate(225.43 822.78) scale(0.12 -0.12)">
     <use xlink:href="#DejaVuSans-50"/>
     <use xlink:href="#DejaVuSans-6e" x="58.552734"/>
     <use xlink:href="#DejaVuSans-4c" x="121.931641"/>
     <use xlink:href="#DejaVuSans-20" x="177.644531"/>
     <use xlink:href="#DejaVuSans-66" x="209.431641"/>
     <use xlink:href="#DejaVuSans-6f" x="244.636719"/>
     <use xlink:href="#DejaVuSans-72" x="305.818359"/>
     <use xlink:href="#DejaVuSans-20" x="346.931641"/>
     <use xlink:href="#DejaVuSans-53" x="378.71875"/>
     <use xlink:href="#DejaVuSans-50" x="442.195312"/>
     <use xlink:href="#DejaVuSans-59" x="500.248047"/>
     <use xlink:href="#DejaVuSans-20" x="561.332031"/>
     <use xlink:href="#DejaVuSans-31" x="593.119141"/>
     <use xlink:href="#DejaVuSans-32" x="656.742188"/>
     <use xlink:href="#DejaVuSans-2d" x="720.365234"/>
     <use xlink:href="#DejaVuSans-33" x="756.449219"/>
     <use xlink:href="#DejaVuSans-30" x="820.072266"/>
     <use xlink:href="#DejaVuSans-2d" x="883.695312"/>
     <use xlink:href="#DejaVuSans-32" x="919.779297"/>
     <use xlink:href="#DejaVuSans-30" x="983.402344"/>
     <use xlink:href="#DejaVuSans-31" x="1047.025391"/>
     <use xlink:href="#DejaVuSans-39" x="1110.648438"/>
    </g>
   </g>
  </g>
  <g id="axes_8">
   <g id="patch_44">
    <path d="M 591.77 1055.12 
L 1069.2 1055.12 
L 1069.2 828.78 
L 591.77 828.78 
z
" style="fill: #ffffff"/>
   </g>
   <g id="matplotlib.axis_15">
    <g id="text_75">
     <!-- Time Increasing -->
     <g transform="translate(790.849063 1066.718438) scale(0.1 -0.1)">
      <use xlink:href="#DejaVuSans-54"/>
      <use xlink:href="#DejaVuSans-69" x="57.958984"/>
      <use xlink:href="#DejaVuSans-6d" x="85.742188"/>
      <use xlink:href="#DejaVuSans-65" x="183.154297"/>
      <use xlink:href="#DejaVuSans-20" x="244.677734"/>
      <use xlink:href="#DejaVuSans-49" x="276.464844"/>
      <use xlink:href="#DejaVuSans-6e" x="305.957031"/>
      <use xlink:href="#DejaVuSans-63" x="369.335938"/>
      <use xlink:href="#DejaVuSans-72" x="424.316406"/>
      <use xlink:href="#DejaVuSans-65" x="463.179688"/>
      <use xlink:href="#DejaVuSans-61" x="524.703125"/>
      <use xlink:href="#DejaVuSans-73" x="585.982422"/>
      <use xlink:href="#DejaVuSans-69" x="638.082031"/>
      <use xlink:href="#DejaVuSans-6e" x="665.865234"/>
      <use xlink:href="#DejaVuSans-67" x="729.244141"/>
     </g>
    </g>
   </g>
   <g id="matplotlib.axis_16">
    <g id="ytick_47">
     <g id="line2d_100">
      <path d="M 591.77 1044.831818 
L 1069.2 1044.831818 
" clip-path="url(#p0b98de825c)" style="fill: none; stroke: #b0b0b0; stroke-width: 0.8; stroke-linecap: square"/>
     </g>
     <g id="line2d_101">
      <g>
       <use xlink:href="#m1e97e0aef0" x="591.77" y="1044.831818" style="stroke: #000000; stroke-width: 0.8"/>
      </g>
     </g>
     <g id="text_76">
      <!-- 0 -->
      <g transform="translate(578.4075 1048.631037) scale(0.1 -0.1)">
       <use xlink:href="#DejaVuSans-30"/>
      </g>
     </g>
    </g>
    <g id="ytick_48">
     <g id="line2d_102">
      <path d="M 591.77 1002.433992 
L 1069.2 1002.433992 
" clip-path="url(#p0b98de825c)" style="fill: none; stroke: #b0b0b0; stroke-width: 0.8; stroke-linecap: square"/>
     </g>
     <g id="line2d_103">
      <g>
       <use xlink:href="#m1e97e0aef0" x="591.77" y="1002.433992" style="stroke: #000000; stroke-width: 0.8"/>
      </g>
     </g>
     <g id="text_77">
      <!-- 20 -->
      <g transform="translate(572.045 1006.233211) scale(0.1 -0.1)">
       <use xlink:href="#DejaVuSans-32"/>
       <use xlink:href="#DejaVuSans-30" x="63.623047"/>
      </g>
     </g>
    </g>
    <g id="ytick_49">
     <g id="line2d_104">
      <path d="M 591.77 960.036165 
L 1069.2 960.036165 
" clip-path="url(#p0b98de825c)" style="fill: none; stroke: #b0b0b0; stroke-width: 0.8; stroke-linecap: square"/>
     </g>
     <g id="line2d_105">
      <g>
       <use xlink:href="#m1e97e0aef0" x="591.77" y="960.036165" style="stroke: #000000; stroke-width: 0.8"/>
      </g>
     </g>
     <g id="text_78">
      <!-- 40 -->
      <g transform="translate(572.045 963.835384) scale(0.1 -0.1)">
       <use xlink:href="#DejaVuSans-34"/>
       <use xlink:href="#DejaVuSans-30" x="63.623047"/>
      </g>
     </g>
    </g>
    <g id="ytick_50">
     <g id="line2d_106">
      <path d="M 591.77 917.638339 
L 1069.2 917.638339 
" clip-path="url(#p0b98de825c)" style="fill: none; stroke: #b0b0b0; stroke-width: 0.8; stroke-linecap: square"/>
     </g>
     <g id="line2d_107">
      <g>
       <use xlink:href="#m1e97e0aef0" x="591.77" y="917.638339" style="stroke: #000000; stroke-width: 0.8"/>
      </g>
     </g>
     <g id="text_79">
      <!-- 60 -->
      <g transform="translate(572.045 921.437558) scale(0.1 -0.1)">
       <use xlink:href="#DejaVuSans-36"/>
       <use xlink:href="#DejaVuSans-30" x="63.623047"/>
      </g>
     </g>
    </g>
    <g id="ytick_51">
     <g id="line2d_108">
      <path d="M 591.77 875.240513 
L 1069.2 875.240513 
" clip-path="url(#p0b98de825c)" style="fill: none; stroke: #b0b0b0; stroke-width: 0.8; stroke-linecap: square"/>
     </g>
     <g id="line2d_109">
      <g>
       <use xlink:href="#m1e97e0aef0" x="591.77" y="875.240513" style="stroke: #000000; stroke-width: 0.8"/>
      </g>
     </g>
     <g id="text_80">
      <!-- 80 -->
      <g transform="translate(572.045 879.039731) scale(0.1 -0.1)">
       <use xlink:href="#DejaVuSans-38"/>
       <use xlink:href="#DejaVuSans-30" x="63.623047"/>
      </g>
     </g>
    </g>
    <g id="ytick_52">
     <g id="line2d_110">
      <path d="M 591.77 832.842686 
L 1069.2 832.842686 
" clip-path="url(#p0b98de825c)" style="fill: none; stroke: #b0b0b0; stroke-width: 0.8; stroke-linecap: square"/>
     </g>
     <g id="line2d_111">
      <g>
       <use xlink:href="#m1e97e0aef0" x="591.77" y="832.842686" style="stroke: #000000; stroke-width: 0.8"/>
      </g>
     </g>
     <g id="text_81">
      <!-- 100 -->
      <g transform="translate(565.6825 836.641905) scale(0.1 -0.1)">
       <use xlink:href="#DejaVuSans-31"/>
       <use xlink:href="#DejaVuSans-30" x="63.623047"/>
       <use xlink:href="#DejaVuSans-30" x="127.246094"/>
      </g>
     </g>
    </g>
    <g id="text_82">
     <!-- PNL -->
     <g transform="translate(559.602813 951.491406) rotate(-90) scale(0.1 -0.1)">
      <use xlink:href="#DejaVuSans-50"/>
      <use xlink:href="#DejaVuSans-4e" x="60.302734"/>
      <use xlink:href="#DejaVuSans-4c" x="135.107422"/>
     </g>
    </g>
   </g>
   <g id="line2d_112">
    <path d="M 613.471364 1044.831818 
L 616.369709 1044.831818 
L 617.094296 1043.763338 
L 650.425272 1043.763338 
L 651.149858 1025.25827 
L 727.231433 1025.25827 
L 727.95602 1022.105663 
L 729.405193 1022.105663 
L 730.129779 1019.999787 
L 839.54233 1019.999787 
L 840.266917 1015.533587 
L 840.991503 1013.639483 
L 841.71609 1013.639483 
L 842.440676 844.642743 
L 843.165263 844.183842 
L 851.135713 844.183842 
L 851.8603 843.478385 
L 852.584886 843.037432 
L 853.309473 842.411301 
L 854.034059 839.807174 
L 854.758645 839.619761 
L 894.610899 839.619761 
L 895.335486 839.068182 
L 1047.498636 839.068182 
L 1047.498636 839.068182 
" clip-path="url(#p0b98de825c)" style="fill: none; stroke: #1f77b4; stroke-width: 1.5; stroke-linecap: square"/>
   </g>
   <g id="patch_45">
    <path d="M 591.77 1055.12 
L 591.77 828.78 
" style="fill: none; stroke: #000000; stroke-width: 0.8; stroke-linejoin: miter; stroke-linecap: square"/>
   </g>
   <g id="patch_46">
    <path d="M 1069.2 1055.12 
L 1069.2 828.78 
" style="fill: none; stroke: #000000; stroke-width: 0.8; stroke-linejoin: miter; stroke-linecap: square"/>
   </g>
   <g id="patch_47">
    <path d="M 591.77 1055.12 
L 1069.2 1055.12 
" style="fill: none; stroke: #000000; stroke-width: 0.8; stroke-linejoin: miter; stroke-linecap: square"/>
   </g>
   <g id="patch_48">
    <path d="M 591.77 828.78 
L 1069.2 828.78 
" style="fill: none; stroke: #000000; stroke-width: 0.8; stroke-linejoin: miter; stroke-linecap: square"/>
   </g>
   <g id="text_83">
    <g id="patch_49">
     <path d="M 962.162875 865.092125 
L 1049.3285 865.092125 
L 1049.3285 847.414 
L 962.162875 847.414 
z
" style="fill: #ffffff; opacity: 0.7; stroke: #000000; stroke-linejoin: miter"/>
    </g>
    <!-- Final PnL: 97.06 -->
    <g transform="translate(966.162875 859.012438) scale(0.1 -0.1)">
     <use xlink:href="#DejaVuSans-46"/>
     <use xlink:href="#DejaVuSans-69" x="50.269531"/>
     <use xlink:href="#DejaVuSans-6e" x="78.052734"/>
     <use xlink:href="#DejaVuSans-61" x="141.431641"/>
     <use xlink:href="#DejaVuSans-6c" x="202.710938"/>
     <use xlink:href="#DejaVuSans-20" x="230.494141"/>
     <use xlink:href="#DejaVuSans-50" x="262.28125"/>
     <use xlink:href="#DejaVuSans-6e" x="320.833984"/>
     <use xlink:href="#DejaVuSans-4c" x="384.212891"/>
     <use xlink:href="#DejaVuSans-3a" x="439.925781"/>
     <use xlink:href="#DejaVuSans-20" x="473.617188"/>
     <use xlink:href="#DejaVuSans-39" x="505.404297"/>
     <use xlink:href="#DejaVuSans-37" x="569.027344"/>
     <use xlink:href="#DejaVuSans-2e" x="632.650391"/>
     <use xlink:href="#DejaVuSans-30" x="664.4375"/>
     <use xlink:href="#DejaVuSans-36" x="728.060547"/>
    </g>
   </g>
   <g id="text_84">
    <!-- PnL for SPY 01-30-2020 -->
    <g transform="translate(760.03 822.78) scale(0.12 -0.12)">
     <use xlink:href="#DejaVuSans-50"/>
     <use xlink:href="#DejaVuSans-6e" x="58.552734"/>
     <use xlink:href="#DejaVuSans-4c" x="121.931641"/>
     <use xlink:href="#DejaVuSans-20" x="177.644531"/>
     <use xlink:href="#DejaVuSans-66" x="209.431641"/>
     <use xlink:href="#DejaVuSans-6f" x="244.636719"/>
     <use xlink:href="#DejaVuSans-72" x="305.818359"/>
     <use xlink:href="#DejaVuSans-20" x="346.931641"/>
     <use xlink:href="#DejaVuSans-53" x="378.71875"/>
     <use xlink:href="#DejaVuSans-50" x="442.195312"/>
     <use xlink:href="#DejaVuSans-59" x="500.248047"/>
     <use xlink:href="#DejaVuSans-20" x="561.332031"/>
     <use xlink:href="#DejaVuSans-30" x="593.119141"/>
     <use xlink:href="#DejaVuSans-31" x="656.742188"/>
     <use xlink:href="#DejaVuSans-2d" x="720.365234"/>
     <use xlink:href="#DejaVuSans-33" x="756.449219"/>
     <use xlink:href="#DejaVuSans-30" x="820.072266"/>
     <use xlink:href="#DejaVuSans-2d" x="883.695312"/>
     <use xlink:href="#DejaVuSans-32" x="919.779297"/>
     <use xlink:href="#DejaVuSans-30" x="983.402344"/>
     <use xlink:href="#DejaVuSans-32" x="1047.025391"/>
     <use xlink:href="#DejaVuSans-30" x="1110.648438"/>
    </g>
   </g>
  </g>
 </g>
 <defs>
  <clipPath id="p81bc65bdee">
   <rect x="57.17" y="26.88" width="477.43" height="226.34"/>
  </clipPath>
  <clipPath id="p03367c154b">
   <rect x="591.77" y="26.88" width="477.43" height="226.34"/>
  </clipPath>
  <clipPath id="pcc28da3448">
   <rect x="57.17" y="294.18" width="477.43" height="226.34"/>
  </clipPath>
  <clipPath id="p110bdf6143">
   <rect x="591.77" y="294.18" width="477.43" height="226.34"/>
  </clipPath>
  <clipPath id="p9bad26f8d0">
   <rect x="57.17" y="561.48" width="477.43" height="226.34"/>
  </clipPath>
  <clipPath id="pa476c149d4">
   <rect x="591.77" y="561.48" width="477.43" height="226.34"/>
  </clipPath>
  <clipPath id="p6ab9c4786c">
   <rect x="57.17" y="828.78" width="477.43" height="226.34"/>
  </clipPath>
  <clipPath id="p0b98de825c">
   <rect x="591.77" y="828.78" width="477.43" height="226.34"/>
  </clipPath>
 </defs>
</svg>
