Date,Open,High,Low,Close,Volume,high range,positive move,criteria,security,CL1,CL2,CL3
2020-04-22,13.119999885559082,16.18000030517578,10.260000228881836,13.779999732971191,1235218,0.5769980452465471,0.050304866857396685,high range,CL=F,CLM0,CLN0,CLQ0
2020-03-20,24.729999542236328,27.889999389648438,19.459999084472656,22.43000030517578,1133808,0.43319633616540965,-0.09300441890960741,high range,CL=F,CLJ0,CLK0,CLM0
2020-04-27,16.84000015258789,16.979999542236328,11.880000114440918,12.779999732971191,623201,0.42929287699214974,-0.2410926593128788,high range,CL=F,CLM0,CLN0,CLQ0
2020-04-23,14.199999809265137,18.260000228881836,13.350000381469727,16.5,833584,0.36779024023305373,0.16197184659355926,high range,CL=F,CLM0,CLN0,CLQ0
2020-04-28,12.960000038146973,13.6899995803833,10.069999694824219,12.34000015258789,897087,0.35948361422688924,-0.04783949720170911,high range,CL=F,CLM0,CLN0,CLQ0
2020-04-21,-14.0,13.859999656677246,-16.739999771118164,10.010000228881836,2288230,-1.8279569800586355,-1.7150000163487025,low range,CL=F,CLK0,CLM0,CLN0
2020-04-20,17.729999542236328,17.850000381469727,-40.31999969482422,-37.630001068115234,247947,-1.4427083461451784,-3.1223915420005066,low range,CL=F,CLK0,CLM0,CLN0
2019-04-10,64.22000122070312,64.69999694824219,64.05000305175781,64.61000061035156,722216,0.010148225847220102,0.006072864874420311,low range,CL=F,CLK9,CLM9,CLN9
2019-12-16,59.869998931884766,60.34000015258789,59.709999084472656,60.209999084472656,347395,0.010551014533159883,0.005678973754028546,low range,CL=F,CLF0,CLG0,CLH0
2019-04-18,63.75,64.16000366210938,63.459999084472656,64.0,148238,0.011030642731414651,0.00392156862745098,low range,CL=F,CLK9,CLM9,CLN9
2020-04-30,15.640000343322754,19.440000534057617,15.449999809265137,18.84000015258789,545344,0.2582524772848046,0.20460356387596404,high return,CL=F,CLM0,CLN0,CLQ0
2020-04-02,21.219999313354492,27.389999389648438,20.760000228881836,25.31999969482422,1095972,0.3193641179031771,0.19321397333361137,high return,CL=F,CLK0,CLM0,CLN0
2020-04-23,14.199999809265137,18.260000228881836,13.350000381469727,16.5,833584,0.36779024023305373,0.16197184659355926,high return,CL=F,CLM0,CLN0,CLQ0
2020-05-05,21.239999771118164,25.489999771118164,21.1299991607666,24.559999465942383,387240,0.2063417313544929,0.1563088385405119,high return,CL=F,CLM0,CLN0,CLQ0
2020-04-03,24.809999465942383,29.1299991607666,23.520000457763672,28.34000015258789,1007577,0.23852034837657224,0.14228136890898657,high return,CL=F,CLK0,CLM0,CLN0
2020-04-20,17.729999542236328,17.850000381469727,-40.31999969482422,-37.630001068115234,247947,-1.4427083461451784,-3.1223915420005066,low return,CL=F,CLK0,CLM0,CLN0
2020-04-21,-14.0,13.859999656677246,-16.739999771118164,10.010000228881836,2288230,-1.8279569800586355,-1.7150000163487025,low return,CL=F,CLK0,CLM0,CLN0
2020-03-18,26.940000534057617,27.219999313354492,20.059999465942383,20.3700008392334,309481,0.35692921425886714,-0.24387526223388187,low return,CL=F,CLJ0,CLK0,CLM0
2020-04-27,16.84000015258789,16.979999542236328,11.880000114440918,12.779999732971191,623201,0.42929287699214974,-0.2410926593128788,low return,CL=F,CLM0,CLN0,CLQ0
2020-03-16,33.75,33.75,28.100000381469727,28.700000762939453,698829,0.20106759935334773,-0.1496296070240162,low return,CL=F,CLJ0,CLK0,CLM0
2020-04-21,-14.0,13.859999656677246,-16.739999771118164,10.010000228881836,2288230,-1.8279569800586355,-1.7150000163487025,high volume,CL=F,CLK0,CLM0,CLN0
2020-03-09,32.869998931884766,34.880001068115234,27.34000015258789,31.1299991607666,1774383,0.2757864255100832,-0.05293580248432313,high volume,CL=F,CLJ0,CLK0,CLM0
2019-09-16,61.47999954223633,63.380001068115234,58.77000045776367,62.900001525878906,1404916,0.07844139143174993,0.023096974531807646,high volume,CL=F,CLV9,CLX9,CLZ0
2020-03-06,46.09000015258789,46.380001068115234,41.04999923706055,41.279998779296875,1276180,0.12984170353510466,-0.10436106221234066,high volume,CL=F,CLJ0,CLK0,CLM0
2020-04-22,13.119999885559082,16.18000030517578,10.260000228881836,13.779999732971191,1235218,0.5769980452465471,0.050304866857396685,high volume,CL=F,CLM0,CLN0,CLQ0
2023-04-06,80.37000274658203,80.95999908447266,79.6500015258789,80.69999694824219,0,0.016446924463248396,0.004105937419221877,low volume,CL=F,CLK3,CLM3,CLN3
2022-08-19,90.38999938964844,92.08999633789062,88.37999725341797,90.7699966430664,58714,0.04197781398244134,0.0042039745102762606,low volume,CL=F,CLU2,CLV2,CLX2
2023-01-19,79.13999938964844,81.18000030517578,78.12999725341797,80.33000183105469,58863,0.039037542032223524,0.015036674887337731,low volume,CL=F,CLG3,CLH3,CLJ3
2022-09-19,85.20999908447266,86.22000122070312,82.0999984741211,85.7300033569336,59626,0.05018273840627056,0.006102620326816727,low volume,CL=F,CLV2,CLX2,CLZ3
2020-07-20,40.63999938964844,40.90999984741211,39.83000183105469,40.810001373291016,60179,0.02711518871975969,0.004183119739068696,low volume,CL=F,CLQ0,CLU0,CLV0
2023-06-02,70.20999908447266,72.16999816894531,70.0,71.73999786376953,322596,0.030999973842075892,0.021791750452183713,Recent Data,CL=F,CLN3,CLQ3,CLU3
2023-06-05,75.02999877929688,75.05999755859375,71.7300033569336,72.1500015258789,383943,0.04642400733051508,-0.03838461015959193,Recent Data,CL=F,CLN3,CLQ3,CLU3
2023-06-06,71.98999786376953,72.33000183105469,70.12999725341797,71.73999786376953,314962,0.03137037877938168,-0.0034727046453465406,Recent Data,CL=F,CLN3,CLQ3,CLU3
2023-06-07,71.55999755859375,73.19000244140625,71.01000213623047,72.52999877929688,299127,0.030699904796418945,0.013555076212920245,Recent Data,CL=F,CLN3,CLQ3,CLU3
2023-06-08,72.47000122070312,73.27999877929688,69.02999877929688,71.29000091552734,485396,0.06156743553752805,-0.016282603633221416,Recent Data,CL=F,CLN3,CLQ3,CLU3
2023-06-09,70.94000244140625,71.7699966430664,70.0999984741211,70.16999816894531,300724,0.023823084241033583,-0.010854302875122282,Recent Data,CL=F,CLN3,CLQ3,CLU3
2023-06-12,70.2699966430664,70.33000183105469,66.80000305175781,67.12000274658203,404769,0.05284429068905536,-0.04482701077224525,Recent Data,CL=F,CLN3,CLQ3,CLU3
2023-06-13,67.30999755859375,69.83000183105469,67.1500015258789,69.41999816894531,366354,0.03991065144120566,0.03134750686203479,Recent Data,CL=F,CLN3,CLQ3,CLU3
2023-06-14,69.3499984741211,70.48999786376953,68.06999969482422,68.2699966430664,304449,0.03555161127948881,-0.01557320626989927,Recent Data,CL=F,CLN3,CLQ3,CLU3
2023-06-15,68.69999694824219,70.95999908447266,67.97000122070312,70.62000274658203,115613,0.04398996336723327,0.027947683895624548,Recent Data,CL=F,CLN3,CLQ3,CLU3
2023-06-16,70.55000305175781,71.88999938964844,69.94999694824219,71.77999877929688,99185,0.02773413189484065,0.017434382343494686,Recent Data,CL=F,CLN3,CLQ3,CLU3
2023-06-20,71.44999694824219,72.08999633789062,69.6500015258789,70.5,430492,0.0350322291250076,-0.013295969052739887,Recent Data,CL=F,CLN3,CLQ3,CLU3
2023-06-21,70.9000015258789,72.72000122070312,70.80000305175781,72.52999877929688,264656,0.027118617036523462,0.022990087705752876,Recent Data,CL=F,CLQ3,CLU3,CLV3
2023-06-22,72.43000030517578,72.6500015258789,68.93000030517578,69.51000213623047,421348,0.05396781088399037,-0.04031476124040072,Recent Data,CL=F,CLQ3,CLU3,CLV3
2023-06-23,69.52999877929688,69.6500015258789,67.3499984741211,69.16000366210938,322475,0.03415000896609637,-0.0053213738484584735,Recent Data,CL=F,CLQ3,CLU3,CLV3
2023-06-26,69.83999633789062,70.11000061035156,68.70999908447266,69.37000274658203,280116,0.020375513673893845,-0.006729576402534917,Recent Data,CL=F,CLQ3,CLU3,CLV3
2023-06-27,69.48999786376953,70.1500015258789,67.5,67.69999694824219,384752,0.03925928186487269,-0.025759115995895126,Recent Data,CL=F,CLQ3,CLU3,CLV3
2023-06-28,68.01000213623047,69.7300033569336,67.05000305175781,69.55999755859375,368295,0.03997017424603266,0.02279069803965737,Recent Data,CL=F,CLQ3,CLU3,CLV3
2023-06-29,69.25,70.5999984741211,68.93000030517578,69.86000061035156,292865,0.024227450479496322,0.008808673073668772,Recent Data,CL=F,CLQ3,CLU3,CLV3
2023-06-30,69.81999969482422,71.04000091552734,69.52999877929688,70.63999938964844,299873,0.02171727546010089,0.011744481501122173,Recent Data,CL=F,CLQ3,CLU3,CLV3
2023-07-03,70.44999694824219,71.7699966430664,69.69000244140625,69.79000091552734,303479,0.029846378659678877,-0.009368290437254753,Recent Data,CL=F,CLQ3,CLU3,CLV3
2023-07-05,70.1500015258789,72.16999816894531,69.9000015258789,71.79000091552734,456809,0.032474915500910126,0.023378465487893515,Recent Data,CL=F,CLQ3,CLU3,CLV3
2023-07-06,71.80000305175781,72.33999633789062,70.22000122070312,71.80000305175781,395381,0.03019075876293857,0.0,Recent Data,CL=F,CLQ3,CLU3,CLV3
2023-07-07,71.88999938964844,73.91999816894531,71.19000244140625,73.86000061035156,362632,0.038348021265851434,0.027402993982870848,Recent Data,CL=F,CLQ3,CLU3,CLV3
2023-07-10,73.86000061035156,74.1500015258789,72.66999816894531,72.98999786376953,301014,0.020366084962501845,-0.011779078518719906,Recent Data,CL=F,CLQ3,CLU3,CLV3
2023-07-11,73.19000244140625,74.95999908447266,72.9800033569336,74.83000183105469,326883,0.027130660954552417,0.02240742362266448,Recent Data,CL=F,CLQ3,CLU3,CLV3
2023-07-12,74.83000183105469,76.1500015258789,74.66999816894531,75.75,352887,0.019820589168691262,0.012294509507328522,Recent Data,CL=F,CLQ3,CLU3,CLV3
2023-07-13,75.8499984741211,77.33000183105469,75.31999969482422,76.88999938964844,379728,0.026686167609857155,0.013711284593923581,Recent Data,CL=F,CLQ3,CLU3,CLV3
2023-07-14,77.16000366210938,77.30000305175781,75.11000061035156,75.41999816894531,299576,0.029157268321263023,-0.022550614445065394,Recent Data,CL=F,CLQ3,CLU3,CLV3
2023-07-17,75.0199966430664,76.08999633789062,73.83999633789062,74.1500015258789,244785,0.030471290785335857,-0.0115968429234515,Recent Data,CL=F,CLQ3,CLU3,CLV3
2023-07-18,74.18000030517578,75.95999908447266,73.87999725341797,75.75,125092,0.028153788689515128,0.021164730228703906,Recent Data,CL=F,CLQ3,CLU3,CLV3
2023-07-19,75.83999633789062,76.97000122070312,75.06999969482422,75.3499984741211,92920,0.02530973136542991,-0.006460942608520698,Recent Data,CL=F,CLQ3,CLU3,CLV3
2023-07-20,75.3499984741211,76.1500015258789,74.72000122070312,75.62999725341797,340962,0.01913811940328987,0.0037159759119708593,Recent Data,CL=F,CLQ3,CLU3,CLV3
2023-07-21,75.69999694824219,77.29000091552734,75.69000244140625,77.06999969482422,308106,0.021138835018002507,0.018097791305311854,Recent Data,CL=F,CLU3,CLV3,CLX3
2023-07-24,77.01000213623047,79.27999877929688,76.44000244140625,78.73999786376953,368285,0.037153273772689566,0.02246455888260729,Recent Data,CL=F,CLU3,CLV3,CLX3
2023-07-25,78.8499984741211,79.9000015258789,78.29000091552734,79.62999725341797,349600,0.020564575188710327,0.009892185090566285,Recent Data,CL=F,CLU3,CLV3,CLX3
2023-07-26,79.33999633789062,79.7699966430664,78.55000305175781,78.77999877929688,322031,0.015531426402424466,-0.00705819995515062,Recent Data,CL=F,CLU3,CLV3,CLX3
2023-07-27,78.9000015258789,80.5999984741211,78.87000274658203,80.08999633789062,374358,0.021934774531423923,0.015082316717337514,Recent Data,CL=F,CLU3,CLV3,CLX3
2023-07-28,79.83999633789062,80.70999908447266,79.06999969482422,80.58000183105469,299547,0.020741107828229688,0.00926860630143678,Recent Data,CL=F,CLU3,CLV3,CLX3
2023-07-31,80.6500015258789,82.0,80.12999725341797,81.80000305175781,297270,0.02333711232596187,0.014259163101316181,Recent Data,CL=F,CLU3,CLV3,CLX3
2023-08-01,81.7300033569336,82.22000122070312,80.58999633789062,81.37000274658203,307859,0.020225895978185176,-0.004404754625781154,Recent Data,CL=F,CLU3,CLV3,CLX3
2023-08-02,82.05000305175781,82.43000030517578,79.05000305175781,79.48999786376953,414825,0.04275771186504475,-0.031200549576742967,Recent Data,CL=F,CLU3,CLV3,CLX3
2023-08-03,79.7699966430664,81.86000061035156,78.69000244140625,81.55000305175781,402641,0.04028463681019378,0.022314234469083736,Recent Data,CL=F,CLU3,CLV3,CLX3
2023-08-04,81.7300033569336,83.23999786376953,81.51000213623047,82.81999969482422,320873,0.021224336672788467,0.013336550753954603,Recent Data,CL=F,CLU3,CLV3,CLX3
2023-08-07,82.81999969482422,83.30000305175781,81.5199966430664,81.94000244140625,293036,0.021835211996942626,-0.010625419665063867,Recent Data,CL=F,CLU3,CLV3,CLX3
2023-08-08,82.52999877929688,83.08000183105469,79.9000015258789,82.91999816894531,424545,0.03979975274651036,0.004725547018259149,Recent Data,CL=F,CLU3,CLV3,CLX3
2023-08-09,82.87999725341797,84.6500015258789,82.66999816894531,84.4000015258789,478140,0.023950688288237737,0.018339820497499503,Recent Data,CL=F,CLU3,CLV3,CLX3
2023-08-10,84.25,84.88999938964844,82.58000183105469,82.81999969482422,362188,0.02797284460370479,-0.01697329739081046,Recent Data,CL=F,CLU3,CLV3,CLX3
2023-08-11,82.83000183105469,83.80999755859375,82.2300033569336,83.19000244140625,331254,0.019214327339887333,0.004346258630850239,Recent Data,CL=F,CLU3,CLV3,CLX3
2023-08-14,83.08999633789062,83.19999694824219,81.76000213623047,82.51000213623047,277352,0.01761246054779163,-0.006980313241338631,Recent Data,CL=F,CLU3,CLV3,CLX3
2023-08-15,82.5199966430664,82.91000366210938,80.4000015258789,80.98999786376953,303207,0.031218931450176117,-0.01854094572876392,Recent Data,CL=F,CLU3,CLV3,CLX3
2023-08-16,81.2300033569336,81.43000030517578,79.05000305175781,79.37999725341797,325403,0.030107490974537608,-0.022774911080410697,Recent Data,CL=F,CLU3,CLV3,CLX3
2023-08-17,79.25,81.08000183105469,78.94999694824219,80.38999938964844,235581,0.02697916358640118,0.014384850342567035,Recent Data,CL=F,CLU3,CLV3,CLX3
2023-08-18,80.04000091552734,81.61000061035156,79.58999633789062,81.25,128090,0.02538012772214777,0.015117429668068916,Recent Data,CL=F,CLU3,CLV3,CLX3
2023-08-21,81.43000030517578,82.47000122070312,80.61000061035156,80.72000122070312,115874,0.023074067687238173,-0.008719134002355246,Recent Data,CL=F,CLU3,CLV3,CLX3
2023-08-22,80.80000305175781,80.98999786376953,80.0999984741211,80.3499984741211,287489,0.011111103702904322,-0.005569363374262012,Recent Data,CL=F,CLU3,CLV3,CLX3
2023-08-23,79.63999938964844,79.91000366210938,77.62000274658203,78.88999938964844,378146,0.029502716239316072,-0.009417378274082264,Recent Data,CL=F,CLV3,CLX3,CLZ4
2023-08-24,78.56999969482422,79.27999877929688,77.58999633789062,79.05000305175781,349230,0.021781189859148724,0.006109244734605922,Recent Data,CL=F,CLV3,CLX3,CLZ4
2023-08-25,78.87999725341797,80.44999694824219,78.13999938964844,79.83000183105469,411409,0.029562293020695442,0.012043668999944772,Recent Data,CL=F,CLV3,CLX3,CLZ4
2023-08-28,80.1500015258789,80.87000274658203,79.61000061035156,80.0999984741211,246584,0.015827184104639142,-0.0006238683818573287,Recent Data,CL=F,CLV3,CLX3,CLZ4
2023-08-29,79.9800033569336,81.41000366210938,79.33999633789062,81.16000366210938,284168,0.02609033803585104,0.014753691618512355,Recent Data,CL=F,CLV3,CLX3,CLZ4
2023-08-30,81.29000091552734,82.05000305175781,80.87999725341797,81.62999725341797,299418,0.014465947552815966,0.004182511182942818,Recent Data,CL=F,CLV3,CLX3,CLZ4
2023-08-31,81.69999694824219,83.69000244140625,81.4800033569336,83.62999725341797,368848,0.027123208068505742,0.023623015633629178,Recent Data,CL=F,CLV3,CLX3,CLZ4
2023-09-01,83.62999725341797,86.05999755859375,83.45999908447266,85.55000305175781,420461,0.031152630034054378,0.022958338651163507,Recent Data,CL=F,CLV3,CLX3,CLZ4
2023-09-05,86.05999755859375,88.06999969482422,85.0199966430664,86.69000244140625,452908,0.03587394933173698,0.00732053103282466,Recent Data,CL=F,CLV3,CLX3,CLZ4
2023-09-06,86.72000122070312,88.08000183105469,85.93000030517578,87.54000091552734,307115,0.025020383082081824,0.009455715904999964,Recent Data,CL=F,CLV3,CLX3,CLZ4
2023-09-07,87.54000091552734,87.73999786376953,86.38999938964844,86.87000274658203,270736,0.01562679110613416,-0.007653623051613106,Recent Data,CL=F,CLV3,CLX3,CLZ4
2023-09-08,86.77999877929688,87.94999694824219,86.1500015258789,87.51000213623047,294437,0.020893736395611952,0.008412115316919672,Recent Data,CL=F,CLV3,CLX3,CLZ4
2023-09-11,87.4000015258789,88.1500015258789,86.70999908447266,87.29000091552734,292388,0.01660710940618744,-0.0012585881971522805,Recent Data,CL=F,CLV3,CLX3,CLZ4
2023-09-12,87.2699966430664,89.37000274658203,87.22000122070312,88.83999633789062,341137,0.024650326711627785,0.017990142720475916,Recent Data,CL=F,CLV3,CLX3,CLZ4
2023-09-13,88.75,89.63999938964844,88.29000091552734,88.5199966430664,345972,0.01529050243654118,-0.002591587120378521,Recent Data,CL=F,CLV3,CLX3,CLZ4
2023-09-14,88.80999755859375,90.79000091552734,88.68000030517578,90.16000366210938,325270,0.02379342132488032,0.015201060022830627,Recent Data,CL=F,CLV3,CLX3,CLZ4
2023-09-15,90.66999816894531,91.2300033569336,89.22000122070312,90.7699966430664,315003,0.0225286046708107,0.0011028838219977318,Recent Data,CL=F,CLV3,CLX3,CLZ4
2023-09-18,91.19999694824219,92.43000030517578,90.75,91.4800033569336,119258,0.0185124000570334,0.0030702458120729485,Recent Data,CL=F,CLV3,CLX3,CLZ4
2023-09-19,92.22000122070312,93.73999786376953,91.06999969482422,91.19999694824219,94597,0.029318086942928326,-0.01106055366470706,Recent Data,CL=F,CLV3,CLX3,CLZ4
2023-09-20,91.55000305175781,91.9800033569336,89.87000274658203,90.27999877929688,457854,0.02347836370163915,-0.013872247188707797,Recent Data,CL=F,CLV3,CLX3,CLZ4
2023-09-21,89.30000305175781,90.9800033569336,88.37000274658203,89.62999725341797,351032,0.029534916026156988,0.00369534367729969,Recent Data,CL=F,CLX3,CLZ4,CLF4
2023-09-22,89.62000274658203,91.33000183105469,89.30999755859375,90.02999877929688,402087,0.022617896402199206,0.00457482727236895,Recent Data,CL=F,CLX3,CLZ4,CLF4
2023-09-25,90.55000305175781,90.83000183105469,89.02999877929688,89.68000030517578,328369,0.020217938632347672,-0.00960798141646382,Recent Data,CL=F,CLX3,CLZ4,CLF4
2023-09-26,89.87999725341797,90.73999786376953,88.19000244140625,90.38999938964844,318016,0.028914790245725498,0.00567425625072629,Recent Data,CL=F,CLX3,CLZ4,CLF4
2023-09-27,90.52999877929688,94.16999816894531,90.4000015258789,93.68000030517578,504630,0.04170350198486628,0.034795112872566106,Recent Data,CL=F,CLX3,CLZ4,CLF4
2023-09-28,93.77999877929688,95.02999877929688,91.38999938964844,91.70999908447266,406709,0.03982929657466146,-0.022072933693417764,Recent Data,CL=F,CLX3,CLZ4,CLF4
2023-09-29,91.76000213623047,93.0999984741211,90.3499984741211,90.79000091552734,355782,0.030437189224609463,-0.0105710679830088,Recent Data,CL=F,CLX3,CLZ4,CLF4
2023-10-02,90.81999969482422,91.87999725341797,88.45999908447266,88.81999969482422,334493,0.0386615216407528,-0.022021581223524038,Recent Data,CL=F,CLX3,CLZ4,CLF4
2023-10-03,88.66999816894531,90.2699966430664,87.76000213623047,89.2300033569336,350659,0.02860066597240569,0.006315610686280702,Recent Data,CL=F,CLX3,CLZ4,CLF4
2023-10-04,89.41999816894531,89.58999633789062,84.16000366210938,84.22000122070312,459995,0.06451987214237669,-0.058152505644403996,Recent Data,CL=F,CLX3,CLZ4,CLF4
2023-10-05,84.44999694824219,84.91999816894531,82.1500015258789,82.30999755859375,465997,0.03371876557048878,-0.025340431817422123,Recent Data,CL=F,CLX3,CLZ4,CLF4
2023-10-06,82.27999877929688,83.27999877929688,81.5,82.79000091552734,461139,0.021840475819593558,0.006198373162334009,Recent Data,CL=F,CLX3,CLZ4,CLF4
2023-10-09,85.25,87.23999786376953,84.66999816894531,86.37999725341797,435037,0.03035313275543244,0.013255099746838342,Recent Data,CL=F,CLX3,CLZ4,CLF4
2023-10-10,86.43000030517578,86.73999786376953,85.12000274658203,85.97000122070312,337654,0.01903189690924382,-0.005322215467412299,Recent Data,CL=F,CLX3,CLZ4,CLF4
2023-10-11,85.95999908447266,86.51000213623047,83.11000061035156,83.48999786376953,425395,0.04090965588869731,-0.028734309527805618,Recent Data,CL=F,CLX3,CLZ4,CLF4
2023-10-12,83.19999694824219,85.19999694824219,82.30999755859375,82.91000366210938,373492,0.035111158733678045,-0.003485496355405087,Recent Data,CL=F,CLX3,CLZ4,CLF4
2023-10-13,83.51000213623047,87.83000183105469,83.3499984741211,87.69000244140625,356863,0.053749291409100224,0.05005388813614107,Recent Data,CL=F,CLX3,CLZ4,CLF4
2023-10-16,87.72000122070312,88.33000183105469,86.31999969482422,86.66000366210938,235780,0.023285474320396567,-0.012083875328806722,Recent Data,CL=F,CLX3,CLZ4,CLF4
2023-10-17,87.05999755859375,87.75,85.5999984741211,86.66000366210938,197124,0.025116840703319668,-0.0045944625281567255,Recent Data,CL=F,CLX3,CLZ4,CLF4
2023-10-18,87.80999755859375,89.87999725341797,87.19999694824219,88.31999969482422,92797,0.030733949529453575,0.005808019023006522,Recent Data,CL=F,CLX3,CLZ4,CLF4
2023-10-19,88.23999786376953,90.68000030517578,86.5999984741211,89.37000274658203,72058,0.04711318594623215,0.012806039326486303,Recent Data,CL=F,CLX3,CLZ4,CLF4
2023-10-20,90.27999877929688,90.77999877929688,88.33000183105469,88.75,311917,0.027736860607432117,-0.016947261851843715,Recent Data,CL=F,CLX3,CLZ4,CLF4
2023-10-23,88.0,88.29000091552734,85.3499984741211,85.48999786376953,315517,0.034446426408521684,-0.02852275154807351,Recent Data,CL=F,CLZ4,CLF4,CLG4
2023-10-24,86.1500015258789,86.30000305175781,82.94000244140625,83.73999786376953,370591,0.04051121909147841,-0.0279745051587193,Recent Data,CL=F,CLZ4,CLF4,CLG4
2023-10-25,83.69000244140625,85.55999755859375,82.08000183105469,85.38999938964844,429459,0.042397607820501025,0.020313023045164847,Recent Data,CL=F,CLZ4,CLF4,CLG4
2023-10-26,85.37000274658203,85.58999633789062,82.55999755859375,83.20999908447266,341792,0.03670056769498389,-0.025301670289519292,Recent Data,CL=F,CLZ4,CLF4,CLG4
2023-10-27,83.52999877929688,85.9000015258789,83.0999984741211,85.54000091552734,333760,0.033694381506273866,0.02406323674852792,Recent Data,CL=F,CLZ4,CLF4,CLG4
2023-10-30,85.0,85.30000305175781,81.81999969482422,82.30999755859375,356928,0.04253242935606772,-0.03164708754595588,Recent Data,CL=F,CLZ4,CLF4,CLG4
2023-10-31,82.58999633789062,83.37000274658203,80.73999786376953,81.0199966430664,346007,0.03257375467423269,-0.019009562470508726,Recent Data,CL=F,CLZ4,CLF4,CLG4
2023-11-01,81.4800033569336,83.41999816894531,80.30000305175781,80.44000244140625,321592,0.03885423410477942,-0.012763879144328045,Recent Data,CL=F,CLZ4,CLF4,CLG4
2023-11-02,80.81999969482422,82.83000183105469,80.22000122070312,82.45999908447266,307122,0.03253553441330508,0.020291999453613763,Recent Data,CL=F,CLZ4,CLF4,CLG4
2023-11-03,82.58000183105469,83.5999984741211,80.0999984741211,80.51000213623047,457281,0.04369538160641524,-0.025066597831507716,Recent Data,CL=F,CLZ4,CLF4,CLG4
2023-11-06,81.12999725341797,82.23999786376953,80.66000366210938,80.81999969482422,271131,0.019588322959652554,-0.0038209980166206644,Recent Data,CL=F,CLZ4,CLF4,CLG4
2023-11-07,80.93000030517578,81.05000305175781,77.08999633789062,77.37000274658203,396289,0.05136861982078988,-0.043988601818478856,Recent Data,CL=F,CLZ4,CLF4,CLG4
2023-11-08,77.12000274658203,77.52999877929688,74.91000366210938,75.33000183105469,429647,0.0349752368055581,-0.023210591957696432,Recent Data,CL=F,CLZ4,CLF4,CLG4
2023-11-09,75.6500015258789,77.16000366210938,75.20999908447266,75.73999786376953,303430,0.025927464451190287,0.001189640926310337,Recent Data,CL=F,CLZ4,CLF4,CLG4
2023-11-10,75.58999633789062,77.7300033569336,75.30999755859375,77.16999816894531,266998,0.032133924801378416,0.02090226098162526,Recent Data,CL=F,CLZ4,CLF4,CLG4
2023-11-13,77.1500015258789,78.63999938964844,76.20999908447266,78.26000213623047,262903,0.03188558370775364,0.01438756433438602,Recent Data,CL=F,CLZ4,CLF4,CLG4
2023-11-14,78.52999877929688,79.7699966430664,77.79000091552734,78.26000213623047,263002,0.025453087854943626,-0.0034381337993549844,Recent Data,CL=F,CLZ4,CLF4,CLG4
2023-11-15,78.16999816894531,78.7699966430664,76.30999755859375,76.66000366210938,282301,0.03223691735258902,-0.01931680366132866,Recent Data,CL=F,CLZ4,CLF4,CLG4
2023-11-16,76.5999984741211,76.62999725341797,72.16000366210938,72.9000015258789,125165,0.06194558431897296,-0.04830283318467966,Recent Data,CL=F,CLZ4,CLF4,CLG4
2023-11-17,72.97000122070312,75.98999786376953,72.75,75.88999938964844,101484,0.044536053110234106,0.04001641935174927,Recent Data,CL=F,CLZ4,CLF4,CLG4
2023-11-20,75.6500015258789,78.22000122070312,75.6500015258789,77.5999984741211,270638,0.03397223586234899,0.025776561915535696,Recent Data,CL=F,CLZ4,CLF4,CLG4
2023-11-21,77.6500015258789,77.91999816894531,76.91999816894531,77.7699966430664,238629,0.01300052033027384,0.001545333095035529,Recent Data,CL=F,CLZ4,CLF4,CLG4
2023-11-22,77.7699966430664,77.97000122070312,73.79000091552734,77.0999984741211,389325,0.056647245606636115,-0.008615124056393364,Recent Data,CL=F,CLF4,CLG4,CLH4
2023-11-23,76.79000091552734,76.80999755859375,75.30000305175781,76.3499984741211,389325,0.020053047086837906,-0.005729944474024341,Recent Data,CL=F,CLF4,CLG4,CLH4
2023-11-24,76.79000091552734,77.08999633789062,75.06999969482422,75.54000091552734,281147,0.026908174387613285,-0.016278161024832642,Recent Data,CL=F,CLF4,CLG4,CLH4
2023-11-27,75.30999755859375,76.2300033569336,74.05999755859375,74.86000061035156,289562,0.029300646366116997,-0.0059752617558123606,Recent Data,CL=F,CLF4,CLG4,CLH4
2023-11-28,75.06999969482422,77.0199966430664,74.63999938964844,76.41000366210938,286618,0.031886351458733295,0.017850059580825393,Recent Data,CL=F,CLF4,CLG4,CLH4
2023-11-29,76.55999755859375,78.08999633789062,75.66999816894531,77.86000061035156,322170,0.03198094657729846,0.016980186692964295,Recent Data,CL=F,CLF4,CLG4,CLH4
2023-11-30,77.75,79.5999984741211,75.05000305175781,75.95999908447266,559169,0.060626185707486284,-0.02302251981385651,Recent Data,CL=F,CLF4,CLG4,CLH4
