# RigidBody restart file
#$LABELS step RigidBodyKey posX  posY  posZ rotXX rotXY rotXZ rotYX rotYY rotYZ rotZX rotZY rotZZ velX  velY  velZ angVelX angVelY angVelZ
172450000 ssb#0 124.54 192.048 194.548 -0.9462282658 0.147288844 -0.2880245149 -0.2661164403 0.1518464833 0.9519059062 0.1839406192 0.9773682356 -0.1044854522 -115.0511932 -382.4317932 -103.64151 166.3110962 -3134.461426 741.9707031
172450000 ssb#1 53.55404663 127.8396912 263.0775757 -0.2532267272 -0.6516235471 -0.7150265574 0.09727106988 0.7182206511 -0.688982904 0.9625043869 -0.2440202832 -0.1184885353 -334.8730469 189.1231079 -23.59052277 -4270.672852 -5198.897461 4917.731445
172450000 ssb#2 3.794542313 136.2264404 277.9151611 -0.1370713264 -0.8607677817 0.4901941121 0.08660129458 -0.5033836365 -0.8597121835 0.9867683053 -0.07539044321 0.1435430646 217.3821716 -318.7949829 -35.94562531 7835.356445 6224.133301 -7436.154297
172450000 ssb#3 -19.75008965 101.4953537 318.5178833 -0.3112710416 -0.7134394646 -0.6277853847 -0.9386518002 0.3340191245 0.08581387252 0.148469314 0.6159832478 -0.7736417055 -352.0111694 -423.6499023 290.5506592 -675.4118652 9391.853516 -1750.477783
172450000 ssb#4 -23.30876541 44.59033585 308.3160095 -0.2202579975 -0.03566650301 0.974789381 0.7761271 -0.6117366552 0.152986601 0.590857923 0.7902569771 0.1624216437 -632.2338867 190.4529724 219.8817902 -9613.077148 2109.956543 1156.037598
172450000 ssb#5 -26.97184753 -11.45568943 294.6105957 -0.6161133051 -0.7041180134 -0.3530188799 -0.7867460251 0.5716860294 0.2328214198 0.0378822051 0.4211805463 -0.9061853886 -355.7556458 301.898407 -301.1151733 445.0091248 -4080.451172 2848.44458
172450000 ssb#6 -2.236636162 33.368927 257.2483521 -0.038317509 0.930675745 -0.3638329804 0.3548797667 -0.327691704 -0.8756017685 -0.9341264367 -0.1626678407 -0.3177216351 103.4963303 -127.4277802 559.4761963 1830.743896 -293.0004883 850.8949585
172450000 ssb#7 -10.79417515 69.01483154 217.3641357 0.213949725 -0.6745483279 -0.7065480947 0.975442946 0.1087928712 0.1915081143 -0.05231407285 -0.7301704288 0.6812595129 -226.3591309 61.07553864 110.7146301 -1483.435547 -134.9835205 7034.114258
172450000 ssb#8 12.16537571 14.32714653 199.1390381 -0.5836005211 -0.72437644 0.3670004904 0.3359035254 -0.6268161535 -0.7030436397 0.7393100262 -0.2870199084 0.6091307998 -691.0463867 155.5193787 274.010437 903.5733032 -11622.94727 -9436.269531
172450000 ssb#9 75.54955292 -2.889811516 193.5866394 0.9468141198 0.01623474248 -0.3213712275 0.2175190151 0.7036859393 0.6763960719 0.2371255159 -0.7103257179 0.6627283692 -285.8157349 517.2845459 324.5743408 6632.64502 428.2762451 -1943.081299
172450000 ssb#10 124.8682022 7.634225368 219.3917694 -0.7200071216 0.6327708364 0.2849401236 0.1653857678 0.555226028 -0.815089941 -0.6739712954 -0.5397455692 -0.5044179559 295.7783508 411.382019 -116.456398 1268.657837 6430.57959 -6216.771484
172450000 ssb#11 90.11503601 53.88534164 206.7752533 -0.4374178648 0.4139492512 -0.7983180881 0.8510534167 -0.09619515389 -0.5161925554 -0.2904718816 -0.9052029848 -0.3102154434 -199.273468 153.6196594 480.3735657 -1003.141968 2149.783447 1217.533203
172450000 ssb#12 72.2456131 102.6953812 214.3036346 -0.1476223171 0.9790567756 -0.1401985735 -0.9781233668 -0.1655246913 -0.1260014772 -0.1465689242 0.1185308695 0.982073307 -110.5093765 487.9955139 73.94315338 2861.425293 3329.03418 -2372.778076
172450000 ssb#13 85.34759521 157.4625092 214.1025848 -0.6967784166 -0.4009506106 -0.5947592854 -0.71277529 0.4798875153 0.5115265846 0.0803206414 0.7803503275 -0.6201629043 22.73610115 -38.40622711 -144.8554993 9579.121094 -8187.902832 -1587.939697
