Name,tau_mean,tau_std,rho_mean,rho_std,o_mean,o_std,Dx[nm]mean,Dx[nm]std,Dy[nm]mean,Dy[nm]std,Dz[nm]mean,Dz[nm]std,B_tau[pN-nm2]mean,B_tau[pN-nm2]std,B_rho[pN-nm2]mean,B_rho[pN-nm2]std,C[pN-nm2]mean,C[pN-nm2]std,YDx[pN]mean,YDx[pN]std,YDy[pN]mean,YDy[pN]std,S[pN]mean,S[pN]std,g_tau_rho[pN-nm2]mean,g_tau_rho[pN-nm2]std,g_tau_o[pN-nm2]mean,g_tau_o[pN-nm2]std,g_rho_o[pN-nm2]mean,g_rho_o[pN-nm2]std,gDxDy[pN]mean,gDxDy[pN]std,gDxDz[pN]mean,gDxDz[pN]std,gDyDz[pN]mean,gDyDz[pN]std,g_tauDx[pN]mean,g_tauDx[pN]std,g_tauDy[pN]mean,g_tauDy[pN]std,g_tauDz[pN-nm]mean,g_tauDz[pN-nm]std,g_rhoDx[pN-nm]mean,g_rhoDx[pN-nm]std,g_rhoDy[pN-nm]mean,g_rhoDy[pN-nm]std,g_rhoDz[pN-nm]mean,g_rhoDz[pN-nm]std,g_oDx[pN-nm]mean,g_oDx[pN-nm]std,g_oDy[pN-nm]mean,g_oDy[pN-nm]std,g_oDz[pN-nm]mean,g_oDz[pN-nm]std
AA/TT,-3.62,4.34,6.17,5.52,36.4,3.99,-0.03,0.05,-0.01,0.04,0.34,0.03,301.53,28.76,172.67,16.47,400.39,38.18,560.96,53.5,872.97,83.25,1920.88,183.18,34.64,3.3,56.95,5.43,81.6,7.78,106.75,10.18,209.9,20.02,373.7,35.64,-30.91,-2.95,-43.76,-4.17,-319.84,-30.5,-30.33,-2.89,-70.05,-6.68,-90.13,-8.59,37.99,3.62,-206.97,-19.74,-300.81,-28.69
AG/CT,-2.99,4.32,10.18,5.42,32.27,4.28,-0.03,0.06,-0.03,0.04,0.34,0.03,317.62,29.97,171.36,16.17,347.47,32.78,452.93,42.73,789.85,74.52,2087.34,196.93,49.66,4.69,53.35,5.03,48.35,4.56,-18.85,-1.78,190.45,17.97,369.88,34.9,-83.18,-7.85,-77.92,-7.35,-344.1,-32.46,15.82,1.49,9.08,0.86,-102.98,-9.72,108.65,10.25,-114.53,-10.81,-310.71,-29.31
GA/TC,-1.11,5.16,3.7,5.64,39.02,4.25,-0.01,0.05,0.01,0.05,0.34,0.03,277.69,26.64,170.73,16.38,344.19,33.02,557.64,53.5,835.18,80.12,2361.15,226.52,-5.96,-0.57,-29.64,-2.84,95.43,9.16,74.01,7.1,102.12,9.8,509.49,48.88,-84.87,-8.14,37.97,3.64,-401.74,-38.54,-9.69,-0.93,-45.22,-4.34,-61.43,-5.89,13.2,1.27,-167.93,-16.11,-211.56,-20.3
GG/CC,0.77,5.01,6.85,5.66,34.26,5.51,-0.01,0.07,-0.05,0.07,0.36,0.03,309.91,29.72,164.48,15.77,288.76,27.69,391.3,37.52,560.77,53.77,2145.27,205.7,5.62,0.54,3.09,0.3,42.38,4.06,-7.39,-0.71,46.05,4.42,454.48,43.58,-135.35,-12.98,-54.14,-5.19,-392.32,-37.62,26.71,2.56,14.63,1.4,-10.54,-1.01,78.3,7.51,-227.37,-21.8,-310.65,-29.79
AC/GT,-0.5,4.78,5.03,5.86,32.1,5.09,0.04,0.06,-0.04,0.05,0.32,0.04,218.91,23.85,157.4,17.15,255.39,27.82,341.17,37.17,753.74,82.12,1711.07,186.42,20.26,2.21,30.88,3.36,61.24,6.67,16.9,1.84,45.34,4.94,522.58,56.93,-34.43,-3.75,-89.54,-9.76,40.85,4.45,-1.46,-0.16,36.3,3.95,73.03,7.96,26.98,2.94,-127.09,-13.85,-266.32,-29.02
AT/AT,-0.13,4.13,3.33,5.79,31.97,4.14,0.02,0.07,-0.05,0.04,0.33,0.03,263.28,26.2,161.0,16.02,332.8,33.12,266.11,26.48,773.42,76.97,1475.58,146.84,6.86,0.68,1.86,0.19,69.68,6.93,4.8,0.48,-15.49,-1.54,281.05,27.97,-10.37,-1.03,3.11,0.31,4.51,0.45,11.12,1.11,26.75,2.66,83.95,8.35,-6.57,-0.65,-118.97,-11.84,-164.19,-16.34
GC/GC,0.01,4.86,2.09,5.55,38.32,4.86,0.01,0.06,-0.04,0.04,0.34,0.03,230.96,22.86,200.35,19.83,301.64,29.86,417.69,41.35,1340.78,132.73,2270.19,224.74,1.7,0.17,2.55,0.25,51.71,5.12,8.83,0.87,20.41,2.02,939.72,93.03,-123.64,-12.24,-16.63,-1.65,-13.07,-1.29,1.39,0.14,91.82,9.09,211.84,20.97,8.64,0.86,-236.09,-23.37,-363.29,-35.96
TG/CA,1.04,5.22,13.57,7.0,32.27,5.11,0.0,0.07,-0.02,0.06,0.35,0.04,189.65,20.22,132.03,14.08,281.44,30.01,353.84,37.73,478.38,51.01,1396.03,148.85,-3.66,-0.39,-28.65,-3.05,80.55,8.59,-46.57,-4.96,-48.68,-5.19,174.33,18.59,-41.36,-4.41,-20.37,-2.17,-55.92,-5.96,-18.19,-1.94,23.68,2.52,-141.52,-15.09,36.09,3.85,-90.49,-9.65,-274.23,-29.24
TA/TA,1.92,5.24,8.93,8.11,35.71,5.31,-0.02,0.07,0.01,0.07,0.35,0.04,174.92,17.75,123.8,12.56,309.72,31.42,333.37,33.82,380.62,38.62,1483.42,150.5,5.57,0.57,-5.23,-0.53,106.7,10.82,-0.79,-0.08,-5.55,-0.56,262.03,26.58,-21.11,-2.14,7.57,0.77,-15.79,-1.6,16.48,1.67,13.86,1.41,-128.83,-13.07,8.62,0.87,-124.01,-12.58,-237.07,-24.05
CG/CG,-0.48,5.95,14.47,7.42,32.78,5.19,-0.03,0.06,0.02,0.05,0.35,0.04,173.43,19.8,129.45,14.78,276.46,31.57,502.78,57.41,595.34,67.98,1401.16,160.0,2.31,0.26,0.52,0.06,72.68,8.3,-21.7,-2.48,14.87,1.7,100.67,11.5,-138.13,-15.77,24.41,2.79,-0.57,-0.06,11.9,1.36,71.97,8.22,-180.78,-20.64,25.41,2.9,-73.78,-8.43,-335.03,-38.26