EXCLUDE 120 123
EXCLUDE 59 62
EXCLUDE 226 229
EXCLUDE 249 252
EXCLUDE 48 52
EXCLUDE 25 27
EXCLUDE 206 209
EXCLUDE 159 161
EXCLUDE 157 160
EXCLUDE 166 169
EXCLUDE 55 58
EXCLUDE 97 99
EXCLUDE 200 204
EXCLUDE 242 246
EXCLUDE 101 103
EXCLUDE 17 19
EXCLUDE 174 178
EXCLUDE 41 44
EXCLUDE 231 234
EXCLUDE 104 108
EXCLUDE 74 77
EXCLUDE 207 210
EXCLUDE 208 211
EXCLUDE 78 81
EXCLUDE 153 155
EXCLUDE 212 215
EXCLUDE 0 4
EXCLUDE 258 261
EXCLUDE 137 140
EXCLUDE 63 65
EXCLUDE 146 149
EXCLUDE 135 138
EXCLUDE 56 59
EXCLUDE 70 74
EXCLUDE 109 111
EXCLUDE 79 82
EXCLUDE 28 31
EXCLUDE 113 115
EXCLUDE 217 220
EXCLUDE 259 262
EXCLUDE 173 175
EXCLUDE 253 255
EXCLUDE 203 206
EXCLUDE 181 183
EXCLUDE 44 48
EXCLUDE 185 187
EXCLUDE 188 192
EXCLUDE 90 93
EXCLUDE 52 56
EXCLUDE 6 9
EXCLUDE 196 200
EXCLUDE 234 238
EXCLUDE 257 259
EXCLUDE 10 13
EXCLUDE 33 36
EXCLUDE 167 170
EXCLUDE 215 217
EXCLUDE 142 145
EXCLUDE 227 230
EXCLUDE 66 69
EXCLUDE 26 30
EXCLUDE 122 126
EXCLUDE 204 208
EXCLUDE 70 73
EXCLUDE 160 164
EXCLUDE 91 94
EXCLUDE 95 98
EXCLUDE 4 8
EXCLUDE 11 14
EXCLUDE 82 86
EXCLUDE 59 61
EXCLUDE 116 119
EXCLUDE 15 18
EXCLUDE 124 128
EXCLUDE 262 266
EXCLUDE 249 251
EXCLUDE 48 51
EXCLUDE 157 159
EXCLUDE 151 154
EXCLUDE 55 57
EXCLUDE 200 203
EXCLUDE 242 245
EXCLUDE 213 216
EXCLUDE 174 177
EXCLUDE 41 43
EXCLUDE 3 5
EXCLUDE 231 233
EXCLUDE 207 209
EXCLUDE 114 118
EXCLUDE 0 3
EXCLUDE 238 242
EXCLUDE 247 250
EXCLUDE 98 102
EXCLUDE 171 174
EXCLUDE 175 178
EXCLUDE 102 106
EXCLUDE 37 40
EXCLUDE 131 133
EXCLUDE 179 182
EXCLUDE 18 22
EXCLUDE 135 137
EXCLUDE 79 81
EXCLUDE 75 78
EXCLUDE 259 261
EXCLUDE 221 224
EXCLUDE 209 212
EXCLUDE 216 220
EXCLUDE 203 205
EXCLUDE 44 47
EXCLUDE 86 90
EXCLUDE 143 146
EXCLUDE 67 70
EXCLUDE 147 150
EXCLUDE 234 237
EXCLUDE 196 199
EXCLUDE 238 241
EXCLUDE 110 114
EXCLUDE 33 35
EXCLUDE 57 60
EXCLUDE 167 169
EXCLUDE 37 39
EXCLUDE 171 173
EXCLUDE 227 229
EXCLUDE 26 29
EXCLUDE 122 125
EXCLUDE 182 186
EXCLUDE 160 163
EXCLUDE 49 52
EXCLUDE 91 93
EXCLUDE 186 190
EXCLUDE 4 7
EXCLUDE 11 13
EXCLUDE 201 204
EXCLUDE 94 98
EXCLUDE 82 85
EXCLUDE 15 17
EXCLUDE 124 127
EXCLUDE 86 89
EXCLUDE 220 223
EXCLUDE 1 4
EXCLUDE 262 265
EXCLUDE 266 269
EXCLUDE 22 26
EXCLUDE 151 153
EXCLUDE 150 154
EXCLUDE 213 215
EXCLUDE 117 119
EXCLUDE 121 123
EXCLUDE 60 64
EXCLUDE 133 136
EXCLUDE 64 68
EXCLUDE 230 233
EXCLUDE 250 254
EXCLUDE 114 117
EXCLUDE 71 74
EXCLUDE 98 101
EXCLUDE 197 200
EXCLUDE 175 177
EXCLUDE 243 246
EXCLUDE 18 21
EXCLUDE 42 46
EXCLUDE 232 236
EXCLUDE 53 56
EXCLUDE 154 157
EXCLUDE 75 77
EXCLUDE 31 34
EXCLUDE 239 242
EXCLUDE 254 258
EXCLUDE 209 211
EXCLUDE 216 219
EXCLUDE 103 106
EXCLUDE 143 145
EXCLUDE 67 69
EXCLUDE 132 136
EXCLUDE 123 126
EXCLUDE 147 149
EXCLUDE 71 73
EXCLUDE 2 6
EXCLUDE 110 113
EXCLUDE 5 8
EXCLUDE 57 59
EXCLUDE 125 128
EXCLUDE 260 264
EXCLUDE 178 181
EXCLUDE 246 250
EXCLUDE 182 185
EXCLUDE 49 51
EXCLUDE 23 26
EXCLUDE 239 241
EXCLUDE 94 97
EXCLUDE 193 196
EXCLUDE 115 118
EXCLUDE 7 9
EXCLUDE 235 238
EXCLUDE 34 38
EXCLUDE 1 3
EXCLUDE 119 122
EXCLUDE 224 228
EXCLUDE 22 25
EXCLUDE 108 112
EXCLUDE 228 232
EXCLUDE 187 190
EXCLUDE 150 153
EXCLUDE 27 30
EXCLUDE 172 176
EXCLUDE 161 164
EXCLUDE 20 23
EXCLUDE 99 102
EXCLUDE 165 168
EXCLUDE 60 63
EXCLUDE 138 142
EXCLUDE 64 67
EXCLUDE 83 86
EXCLUDE 267 269
EXCLUDE 250 253
EXCLUDE 263 266
EXCLUDE 45 47
EXCLUDE 76 80
EXCLUDE 222 226
EXCLUDE 210 214
EXCLUDE 197 199
EXCLUDE 214 218
EXCLUDE 243 245
EXCLUDE 42 45
EXCLUDE 61 64
EXCLUDE 141 144
EXCLUDE 65 68
EXCLUDE 14 17
EXCLUDE 232 235
EXCLUDE 111 114
EXCLUDE 30 34
EXCLUDE 103 105
EXCLUDE 164 168
EXCLUDE 168 172
EXCLUDE 132 135
EXCLUDE 123 125
EXCLUDE 136 139
EXCLUDE 19 22
EXCLUDE 106 110
EXCLUDE 5 7
EXCLUDE 92 96
EXCLUDE 52 55
EXCLUDE 125 127
EXCLUDE 12 16
EXCLUDE 204 207
EXCLUDE 246 249
EXCLUDE 23 25
EXCLUDE 144 148
EXCLUDE 68 72
EXCLUDE 148 152
EXCLUDE 87 90
EXCLUDE 193 195
EXCLUDE 115 117
EXCLUDE 235 237
EXCLUDE 34 37
EXCLUDE 58 62
EXCLUDE 224 227
EXCLUDE 118 122
EXCLUDE 228 231
EXCLUDE 251 254
EXCLUDE 187 189
EXCLUDE 190 194
EXCLUDE 50 54
EXCLUDE 27 29
EXCLUDE 155 158
EXCLUDE 183 186
EXCLUDE 161 163
EXCLUDE 99 101
EXCLUDE 138 141
EXCLUDE 8 12
EXCLUDE 83 85
EXCLUDE 176 180
EXCLUDE 217 219
EXCLUDE 87 89
EXCLUDE 221 223
EXCLUDE 263 265
EXCLUDE 233 236
EXCLUDE 76 79
EXCLUDE 222 225
EXCLUDE 210 213
EXCLUDE 155 157
EXCLUDE 61 63
EXCLUDE 141 143
EXCLUDE 65 67
EXCLUDE 130 134
EXCLUDE 140 144
EXCLUDE 3 6
EXCLUDE 72 76
EXCLUDE 111 113
EXCLUDE 30 33
EXCLUDE 164 167
EXCLUDE 95 97
EXCLUDE 198 202
EXCLUDE 168 171
EXCLUDE 244 248
EXCLUDE 19 21
EXCLUDE 106 109
EXCLUDE 92 95
EXCLUDE 229 232
EXCLUDE 236 240
EXCLUDE 12 15
EXCLUDE 35 38
EXCLUDE 255 258
EXCLUDE 169 172
EXCLUDE 39 42
EXCLUDE 139 142
EXCLUDE 120 124
EXCLUDE 144 147
EXCLUDE 137 139
EXCLUDE 68 71
EXCLUDE 148 151
EXCLUDE 93 96
EXCLUDE 118 121
EXCLUDE 81 84
EXCLUDE 247 249
EXCLUDE 251 253
EXCLUDE 102 105
EXCLUDE 190 193
EXCLUDE 50 53
EXCLUDE 179 181
EXCLUDE 149 152
EXCLUDE 183 185
EXCLUDE 107 110
EXCLUDE 46 50
EXCLUDE 194 198
EXCLUDE 8 11
EXCLUDE 176 179
EXCLUDE 2 5
EXCLUDE 225 228
EXCLUDE 24 28
EXCLUDE 109 112
EXCLUDE 158 162
EXCLUDE 28 32
EXCLUDE 205 208
EXCLUDE 104 107
EXCLUDE 240 244
EXCLUDE 162 166
EXCLUDE 100 104
EXCLUDE 173 176
EXCLUDE 177 180
EXCLUDE 130 133
EXCLUDE 13 16
EXCLUDE 140 143
EXCLUDE 84 88
EXCLUDE 72 75
EXCLUDE 254 257
EXCLUDE 264 268
EXCLUDE 6 10
EXCLUDE 191 194
EXCLUDE 152 156
EXCLUDE 186 189
EXCLUDE 53 55
EXCLUDE 77 80
EXCLUDE 198 201
EXCLUDE 223 226
EXCLUDE 201 203
EXCLUDE 244 247
EXCLUDE 211 214
EXCLUDE 205 207
EXCLUDE 215 218
EXCLUDE 142 146
EXCLUDE 66 70
EXCLUDE 88 92
EXCLUDE 229 231
EXCLUDE 73 76
EXCLUDE 236 239
EXCLUDE 112 116
EXCLUDE 35 37
EXCLUDE 116 120
EXCLUDE 169 171
EXCLUDE 39 41
EXCLUDE 245 248
EXCLUDE 96 100
EXCLUDE 139 141
EXCLUDE 38 42
EXCLUDE 188 191
EXCLUDE 16 20
EXCLUDE 184 188
EXCLUDE 93 95
EXCLUDE 133 135
EXCLUDE 81 83
EXCLUDE 126 129
EXCLUDE 9 12
EXCLUDE 80 84
EXCLUDE 218 222
EXCLUDE 149 151
EXCLUDE 107 109
EXCLUDE 46 49
EXCLUDE 145 148
EXCLUDE 69 72
EXCLUDE 194 197
EXCLUDE 31 33
EXCLUDE 131 134
EXCLUDE 62 66
EXCLUDE 225 227
EXCLUDE 252 256
EXCLUDE 24 27
EXCLUDE 180 184
EXCLUDE 158 161
EXCLUDE 47 50
EXCLUDE 156 160
EXCLUDE 240 243
EXCLUDE 162 165
EXCLUDE 51 54
EXCLUDE 195 198
EXCLUDE 100 103
EXCLUDE 199 202
EXCLUDE 177 179
EXCLUDE 13 15
EXCLUDE 84 87
EXCLUDE 260 263
EXCLUDE 264 267
EXCLUDE 191 193
EXCLUDE 20 24
EXCLUDE 152 155
EXCLUDE 29 32
EXCLUDE 105 107
EXCLUDE 77 79
EXCLUDE 223 225
EXCLUDE 211 213
EXCLUDE 88 91
EXCLUDE 119 121
EXCLUDE 73 75
EXCLUDE 108 111
EXCLUDE 112 115
EXCLUDE 172 175
EXCLUDE 96 99
EXCLUDE 245 247
EXCLUDE 38 41
EXCLUDE 165 167
EXCLUDE 202 206
EXCLUDE 16 19
EXCLUDE 248 252
EXCLUDE 184 187
EXCLUDE 40 44
EXCLUDE 43 46
EXCLUDE 192 196
EXCLUDE 32 36
EXCLUDE 117 120
EXCLUDE 9 11
EXCLUDE 237 240
EXCLUDE 80 83
EXCLUDE 241 244
EXCLUDE 256 260
EXCLUDE 214 217
EXCLUDE 218 221
EXCLUDE 230 234
EXCLUDE 121 124
EXCLUDE 145 147
EXCLUDE 69 71
EXCLUDE 134 138
EXCLUDE 163 166
EXCLUDE 62 65
EXCLUDE 85 88
EXCLUDE 105 108
EXCLUDE 219 222
EXCLUDE 252 255
EXCLUDE 261 264
EXCLUDE 180 183
EXCLUDE 265 268
EXCLUDE 47 49
EXCLUDE 156 159
EXCLUDE 89 92
EXCLUDE 51 53
EXCLUDE 195 197
EXCLUDE 199 201
EXCLUDE 54 58
EXCLUDE 189 191
EXCLUDE 226 230
EXCLUDE 29 31
EXCLUDE 25 28
EXCLUDE 206 210
EXCLUDE 170 174
EXCLUDE 159 162
EXCLUDE 166 170
EXCLUDE 36 40
EXCLUDE 97 100
EXCLUDE 178 182
EXCLUDE 21 23
EXCLUDE 58 61
EXCLUDE 127 129
EXCLUDE 101 104
EXCLUDE 136 140
EXCLUDE 17 20
EXCLUDE 255 257
EXCLUDE 74 78
EXCLUDE 220 224
EXCLUDE 7 10
EXCLUDE 208 212
EXCLUDE 78 82
EXCLUDE 153 156
EXCLUDE 202 205
EXCLUDE 212 216
EXCLUDE 248 251
EXCLUDE 258 262
EXCLUDE 40 43
EXCLUDE 43 45
EXCLUDE 63 66
EXCLUDE 146 150
EXCLUDE 192 195
EXCLUDE 233 235
EXCLUDE 32 35
EXCLUDE 237 239
EXCLUDE 56 60
EXCLUDE 36 39
EXCLUDE 241 243
EXCLUDE 256 259
EXCLUDE 113 116
EXCLUDE 170 173
EXCLUDE 253 256
EXCLUDE 45 48
EXCLUDE 154 158
EXCLUDE 181 184
EXCLUDE 134 137
EXCLUDE 189 192
EXCLUDE 185 188
EXCLUDE 163 165
EXCLUDE 90 94
EXCLUDE 257 260
EXCLUDE 10 14
EXCLUDE 85 87
EXCLUDE 14 18
EXCLUDE 219 221
EXCLUDE 261 263
EXCLUDE 265 267
EXCLUDE 89 91
EXCLUDE 21 24
EXCLUDE 54 57
