ANGLE 0 1 71 model/tabPot/p1p2b2.dat
ANGLE 70 1 71 model/tabPot/b1p2b2.dat
ANGLE 1 2 72 model/tabPot/p1p2b2.dat
ANGLE 71 2 72 model/tabPot/b1p2b2.dat
ANGLE 2 3 73 model/tabPot/p1p2b2.dat
ANGLE 72 3 73 model/tabPot/b1p2b2.dat
ANGLE 3 4 74 model/tabPot/p1p2b2.dat
ANGLE 73 4 74 model/tabPot/b1p2b2.dat
ANGLE 4 5 75 model/tabPot/p1p2b2.dat
ANGLE 74 5 75 model/tabPot/b1p2b2.dat
ANGLE 5 6 76 model/tabPot/p1p2b2.dat
ANGLE 75 6 76 model/tabPot/b1p2b2.dat
ANGLE 6 7 77 model/tabPot/p1p2b2.dat
ANGLE 76 7 77 model/tabPot/b1p2b2.dat
ANGLE 7 8 78 model/tabPot/p1p2b2.dat
ANGLE 77 8 78 model/tabPot/b1p2b2.dat
ANGLE 8 9 79 model/tabPot/p1p2b2.dat
ANGLE 78 9 79 model/tabPot/b1p2b2.dat
ANGLE 9 10 80 model/tabPot/p1p2b2.dat
ANGLE 79 10 80 model/tabPot/b1p2b2.dat
ANGLE 10 11 81 model/tabPot/p1p2b2.dat
ANGLE 80 11 81 model/tabPot/b1p2b2.dat
ANGLE 11 12 82 model/tabPot/p1p2b2.dat
ANGLE 81 12 82 model/tabPot/b1p2b2.dat
ANGLE 12 13 83 model/tabPot/p1p2b2.dat
ANGLE 82 13 83 model/tabPot/b1p2b2.dat
ANGLE 13 14 84 model/tabPot/p1p2b2.dat
ANGLE 83 14 84 model/tabPot/b1p2b2.dat
ANGLE 14 15 85 model/tabPot/p1p2b2.dat
ANGLE 84 15 85 model/tabPot/b1p2b2.dat
ANGLE 15 16 86 model/tabPot/p1p2b2.dat
ANGLE 85 16 86 model/tabPot/b1p2b2.dat
ANGLE 16 17 87 model/tabPot/p1p2b2.dat
ANGLE 86 17 87 model/tabPot/b1p2b2.dat
ANGLE 17 18 88 model/tabPot/p1p2b2.dat
ANGLE 87 18 88 model/tabPot/b1p2b2.dat
ANGLE 18 19 89 model/tabPot/p1p2b2.dat
ANGLE 88 19 89 model/tabPot/b1p2b2.dat
ANGLE 19 20 90 model/tabPot/p1p2b2.dat
ANGLE 89 20 90 model/tabPot/b1p2b2.dat
ANGLE 20 21 91 model/tabPot/p1p2b2.dat
ANGLE 90 21 91 model/tabPot/b1p2b2.dat
ANGLE 21 22 92 model/tabPot/p1p2b2.dat
ANGLE 91 22 92 model/tabPot/b1p2b2.dat
ANGLE 22 23 93 model/tabPot/p1p2b2.dat
ANGLE 92 23 93 model/tabPot/b1p2b2.dat
ANGLE 23 24 94 model/tabPot/p1p2b2.dat
ANGLE 93 24 94 model/tabPot/b1p2b2.dat
ANGLE 24 25 95 model/tabPot/p1p2b2.dat
ANGLE 94 25 95 model/tabPot/b1p2b2.dat
ANGLE 25 26 96 model/tabPot/p1p2b2.dat
ANGLE 95 26 96 model/tabPot/b1p2b2.dat
ANGLE 26 27 97 model/tabPot/p1p2b2.dat
ANGLE 96 27 97 model/tabPot/b1p2b2.dat
ANGLE 27 28 98 model/tabPot/p1p2b2.dat
ANGLE 97 28 98 model/tabPot/b1p2b2.dat
ANGLE 28 29 99 model/tabPot/p1p2b2.dat
ANGLE 98 29 99 model/tabPot/b1p2b2.dat
ANGLE 29 30 100 model/tabPot/p1p2b2.dat
ANGLE 99 30 100 model/tabPot/b1p2b2.dat
ANGLE 30 31 101 model/tabPot/p1p2b2.dat
ANGLE 100 31 101 model/tabPot/b1p2b2.dat
ANGLE 31 32 102 model/tabPot/p1p2b2.dat
ANGLE 101 32 102 model/tabPot/b1p2b2.dat
ANGLE 32 33 103 model/tabPot/p1p2b2.dat
ANGLE 102 33 103 model/tabPot/b1p2b2.dat
ANGLE 33 34 104 model/tabPot/p1p2b2.dat
ANGLE 103 34 104 model/tabPot/b1p2b2.dat
ANGLE 34 35 105 model/tabPot/p1p2b2.dat
ANGLE 104 35 105 model/tabPot/b1p2b2.dat
ANGLE 35 36 106 model/tabPot/p1p2b2.dat
ANGLE 105 36 106 model/tabPot/b1p2b2.dat
ANGLE 36 37 107 model/tabPot/p1p2b2.dat
ANGLE 106 37 107 model/tabPot/b1p2b2.dat
ANGLE 37 38 108 model/tabPot/p1p2b2.dat
ANGLE 107 38 108 model/tabPot/b1p2b2.dat
ANGLE 38 39 109 model/tabPot/p1p2b2.dat
ANGLE 108 39 109 model/tabPot/b1p2b2.dat
ANGLE 39 40 110 model/tabPot/p1p2b2.dat
ANGLE 109 40 110 model/tabPot/b1p2b2.dat
ANGLE 40 41 111 model/tabPot/p1p2b2.dat
ANGLE 110 41 111 model/tabPot/b1p2b2.dat
ANGLE 41 42 112 model/tabPot/p1p2b2.dat
ANGLE 111 42 112 model/tabPot/b1p2b2.dat
ANGLE 42 43 113 model/tabPot/p1p2b2.dat
ANGLE 112 43 113 model/tabPot/b1p2b2.dat
ANGLE 43 44 114 model/tabPot/p1p2b2.dat
ANGLE 113 44 114 model/tabPot/b1p2b2.dat
ANGLE 44 45 115 model/tabPot/p1p2b2.dat
ANGLE 114 45 115 model/tabPot/b1p2b2.dat
ANGLE 45 46 116 model/tabPot/p1p2b2.dat
ANGLE 115 46 116 model/tabPot/b1p2b2.dat
ANGLE 46 47 117 model/tabPot/p1p2b2.dat
ANGLE 116 47 117 model/tabPot/b1p2b2.dat
ANGLE 47 48 118 model/tabPot/p1p2b2.dat
ANGLE 117 48 118 model/tabPot/b1p2b2.dat
ANGLE 48 49 119 model/tabPot/p1p2b2.dat
ANGLE 118 49 119 model/tabPot/b1p2b2.dat
ANGLE 49 50 120 model/tabPot/p1p2b2.dat
ANGLE 119 50 120 model/tabPot/b1p2b2.dat
ANGLE 50 51 121 model/tabPot/p1p2b2.dat
ANGLE 120 51 121 model/tabPot/b1p2b2.dat
ANGLE 51 52 122 model/tabPot/p1p2b2.dat
ANGLE 121 52 122 model/tabPot/b1p2b2.dat
ANGLE 52 53 123 model/tabPot/p1p2b2.dat
ANGLE 122 53 123 model/tabPot/b1p2b2.dat
ANGLE 53 54 124 model/tabPot/p1p2b2.dat
ANGLE 123 54 124 model/tabPot/b1p2b2.dat
ANGLE 54 55 125 model/tabPot/p1p2b2.dat
ANGLE 124 55 125 model/tabPot/b1p2b2.dat
ANGLE 55 56 126 model/tabPot/p1p2b2.dat
ANGLE 125 56 126 model/tabPot/b1p2b2.dat
ANGLE 56 57 127 model/tabPot/p1p2b2.dat
ANGLE 126 57 127 model/tabPot/b1p2b2.dat
ANGLE 57 58 128 model/tabPot/p1p2b2.dat
ANGLE 127 58 128 model/tabPot/b1p2b2.dat
ANGLE 58 59 129 model/tabPot/p1p2b2.dat
ANGLE 128 59 129 model/tabPot/b1p2b2.dat
ANGLE 59 60 130 model/tabPot/p1p2b2.dat
ANGLE 129 60 130 model/tabPot/b1p2b2.dat
ANGLE 60 61 131 model/tabPot/p1p2b2.dat
ANGLE 130 61 131 model/tabPot/b1p2b2.dat
ANGLE 61 62 132 model/tabPot/p1p2b2.dat
ANGLE 131 62 132 model/tabPot/b1p2b2.dat
ANGLE 62 63 133 model/tabPot/p1p2b2.dat
ANGLE 132 63 133 model/tabPot/b1p2b2.dat
ANGLE 63 64 134 model/tabPot/p1p2b2.dat
ANGLE 133 64 134 model/tabPot/b1p2b2.dat
ANGLE 64 65 135 model/tabPot/p1p2b2.dat
ANGLE 134 65 135 model/tabPot/b1p2b2.dat
ANGLE 65 66 136 model/tabPot/p1p2b2.dat
ANGLE 135 66 136 model/tabPot/b1p2b2.dat
ANGLE 66 67 137 model/tabPot/p1p2b2.dat
ANGLE 136 67 137 model/tabPot/b1p2b2.dat
ANGLE 67 68 138 model/tabPot/p1p2b2.dat
ANGLE 137 68 138 model/tabPot/b1p2b2.dat
ANGLE 68 69 139 model/tabPot/p1p2b2.dat
ANGLE 138 69 139 model/tabPot/b1p2b2.dat
ANGLE 0 1 2 model/tabPot/p1p2p3.dat
ANGLE 70 1 2 model/tabPot/b1p2p3.dat
ANGLE 1 2 3 model/tabPot/p1p2p3.dat
ANGLE 71 2 3 model/tabPot/b1p2p3.dat
ANGLE 2 3 4 model/tabPot/p1p2p3.dat
ANGLE 72 3 4 model/tabPot/b1p2p3.dat
ANGLE 3 4 5 model/tabPot/p1p2p3.dat
ANGLE 73 4 5 model/tabPot/b1p2p3.dat
ANGLE 4 5 6 model/tabPot/p1p2p3.dat
ANGLE 74 5 6 model/tabPot/b1p2p3.dat
ANGLE 5 6 7 model/tabPot/p1p2p3.dat
ANGLE 75 6 7 model/tabPot/b1p2p3.dat
ANGLE 6 7 8 model/tabPot/p1p2p3.dat
ANGLE 76 7 8 model/tabPot/b1p2p3.dat
ANGLE 7 8 9 model/tabPot/p1p2p3.dat
ANGLE 77 8 9 model/tabPot/b1p2p3.dat
ANGLE 8 9 10 model/tabPot/p1p2p3.dat
ANGLE 78 9 10 model/tabPot/b1p2p3.dat
ANGLE 9 10 11 model/tabPot/p1p2p3.dat
ANGLE 79 10 11 model/tabPot/b1p2p3.dat
ANGLE 10 11 12 model/tabPot/p1p2p3.dat
ANGLE 80 11 12 model/tabPot/b1p2p3.dat
ANGLE 11 12 13 model/tabPot/p1p2p3.dat
ANGLE 81 12 13 model/tabPot/b1p2p3.dat
ANGLE 12 13 14 model/tabPot/p1p2p3.dat
ANGLE 82 13 14 model/tabPot/b1p2p3.dat
ANGLE 13 14 15 model/tabPot/p1p2p3.dat
ANGLE 83 14 15 model/tabPot/b1p2p3.dat
ANGLE 14 15 16 model/tabPot/p1p2p3.dat
ANGLE 84 15 16 model/tabPot/b1p2p3.dat
ANGLE 15 16 17 model/tabPot/p1p2p3.dat
ANGLE 85 16 17 model/tabPot/b1p2p3.dat
ANGLE 16 17 18 model/tabPot/p1p2p3.dat
ANGLE 86 17 18 model/tabPot/b1p2p3.dat
ANGLE 17 18 19 model/tabPot/p1p2p3.dat
ANGLE 87 18 19 model/tabPot/b1p2p3.dat
ANGLE 18 19 20 model/tabPot/p1p2p3.dat
ANGLE 88 19 20 model/tabPot/b1p2p3.dat
ANGLE 19 20 21 model/tabPot/p1p2p3.dat
ANGLE 89 20 21 model/tabPot/b1p2p3.dat
ANGLE 20 21 22 model/tabPot/p1p2p3.dat
ANGLE 90 21 22 model/tabPot/b1p2p3.dat
ANGLE 21 22 23 model/tabPot/p1p2p3.dat
ANGLE 91 22 23 model/tabPot/b1p2p3.dat
ANGLE 22 23 24 model/tabPot/p1p2p3.dat
ANGLE 92 23 24 model/tabPot/b1p2p3.dat
ANGLE 23 24 25 model/tabPot/p1p2p3.dat
ANGLE 93 24 25 model/tabPot/b1p2p3.dat
ANGLE 24 25 26 model/tabPot/p1p2p3.dat
ANGLE 94 25 26 model/tabPot/b1p2p3.dat
ANGLE 25 26 27 model/tabPot/p1p2p3.dat
ANGLE 95 26 27 model/tabPot/b1p2p3.dat
ANGLE 26 27 28 model/tabPot/p1p2p3.dat
ANGLE 96 27 28 model/tabPot/b1p2p3.dat
ANGLE 27 28 29 model/tabPot/p1p2p3.dat
ANGLE 97 28 29 model/tabPot/b1p2p3.dat
ANGLE 28 29 30 model/tabPot/p1p2p3.dat
ANGLE 98 29 30 model/tabPot/b1p2p3.dat
ANGLE 29 30 31 model/tabPot/p1p2p3.dat
ANGLE 99 30 31 model/tabPot/b1p2p3.dat
ANGLE 30 31 32 model/tabPot/p1p2p3.dat
ANGLE 100 31 32 model/tabPot/b1p2p3.dat
ANGLE 31 32 33 model/tabPot/p1p2p3.dat
ANGLE 101 32 33 model/tabPot/b1p2p3.dat
ANGLE 32 33 34 model/tabPot/p1p2p3.dat
ANGLE 102 33 34 model/tabPot/b1p2p3.dat
ANGLE 33 34 35 model/tabPot/p1p2p3.dat
ANGLE 103 34 35 model/tabPot/b1p2p3.dat
ANGLE 34 35 36 model/tabPot/p1p2p3.dat
ANGLE 104 35 36 model/tabPot/b1p2p3.dat
ANGLE 35 36 37 model/tabPot/p1p2p3.dat
ANGLE 105 36 37 model/tabPot/b1p2p3.dat
ANGLE 36 37 38 model/tabPot/p1p2p3.dat
ANGLE 106 37 38 model/tabPot/b1p2p3.dat
ANGLE 37 38 39 model/tabPot/p1p2p3.dat
ANGLE 107 38 39 model/tabPot/b1p2p3.dat
ANGLE 38 39 40 model/tabPot/p1p2p3.dat
ANGLE 108 39 40 model/tabPot/b1p2p3.dat
ANGLE 39 40 41 model/tabPot/p1p2p3.dat
ANGLE 109 40 41 model/tabPot/b1p2p3.dat
ANGLE 40 41 42 model/tabPot/p1p2p3.dat
ANGLE 110 41 42 model/tabPot/b1p2p3.dat
ANGLE 41 42 43 model/tabPot/p1p2p3.dat
ANGLE 111 42 43 model/tabPot/b1p2p3.dat
ANGLE 42 43 44 model/tabPot/p1p2p3.dat
ANGLE 112 43 44 model/tabPot/b1p2p3.dat
ANGLE 43 44 45 model/tabPot/p1p2p3.dat
ANGLE 113 44 45 model/tabPot/b1p2p3.dat
ANGLE 44 45 46 model/tabPot/p1p2p3.dat
ANGLE 114 45 46 model/tabPot/b1p2p3.dat
ANGLE 45 46 47 model/tabPot/p1p2p3.dat
ANGLE 115 46 47 model/tabPot/b1p2p3.dat
ANGLE 46 47 48 model/tabPot/p1p2p3.dat
ANGLE 116 47 48 model/tabPot/b1p2p3.dat
ANGLE 47 48 49 model/tabPot/p1p2p3.dat
ANGLE 117 48 49 model/tabPot/b1p2p3.dat
ANGLE 48 49 50 model/tabPot/p1p2p3.dat
ANGLE 118 49 50 model/tabPot/b1p2p3.dat
ANGLE 49 50 51 model/tabPot/p1p2p3.dat
ANGLE 119 50 51 model/tabPot/b1p2p3.dat
ANGLE 50 51 52 model/tabPot/p1p2p3.dat
ANGLE 120 51 52 model/tabPot/b1p2p3.dat
ANGLE 51 52 53 model/tabPot/p1p2p3.dat
ANGLE 121 52 53 model/tabPot/b1p2p3.dat
ANGLE 52 53 54 model/tabPot/p1p2p3.dat
ANGLE 122 53 54 model/tabPot/b1p2p3.dat
ANGLE 53 54 55 model/tabPot/p1p2p3.dat
ANGLE 123 54 55 model/tabPot/b1p2p3.dat
ANGLE 54 55 56 model/tabPot/p1p2p3.dat
ANGLE 124 55 56 model/tabPot/b1p2p3.dat
ANGLE 55 56 57 model/tabPot/p1p2p3.dat
ANGLE 125 56 57 model/tabPot/b1p2p3.dat
ANGLE 56 57 58 model/tabPot/p1p2p3.dat
ANGLE 126 57 58 model/tabPot/b1p2p3.dat
ANGLE 57 58 59 model/tabPot/p1p2p3.dat
ANGLE 127 58 59 model/tabPot/b1p2p3.dat
ANGLE 58 59 60 model/tabPot/p1p2p3.dat
ANGLE 128 59 60 model/tabPot/b1p2p3.dat
ANGLE 59 60 61 model/tabPot/p1p2p3.dat
ANGLE 129 60 61 model/tabPot/b1p2p3.dat
ANGLE 60 61 62 model/tabPot/p1p2p3.dat
ANGLE 130 61 62 model/tabPot/b1p2p3.dat
ANGLE 61 62 63 model/tabPot/p1p2p3.dat
ANGLE 131 62 63 model/tabPot/b1p2p3.dat
ANGLE 62 63 64 model/tabPot/p1p2p3.dat
ANGLE 132 63 64 model/tabPot/b1p2p3.dat
ANGLE 63 64 65 model/tabPot/p1p2p3.dat
ANGLE 133 64 65 model/tabPot/b1p2p3.dat
ANGLE 64 65 66 model/tabPot/p1p2p3.dat
ANGLE 134 65 66 model/tabPot/b1p2p3.dat
ANGLE 65 66 67 model/tabPot/p1p2p3.dat
ANGLE 135 66 67 model/tabPot/b1p2p3.dat
ANGLE 66 67 68 model/tabPot/p1p2p3.dat
ANGLE 136 67 68 model/tabPot/b1p2p3.dat
ANGLE 67 68 69 model/tabPot/p1p2p3.dat
ANGLE 137 68 69 model/tabPot/b1p2p3.dat
