0.0 17.1073331
0.05 16.77882685
0.1 16.4517663
0.15 16.1275971
0.2 15.8063193
0.25 15.4879329
0.3 15.17243785
0.35 14.8598342
0.4 14.55012195
0.45 14.2433011
0.5 13.9393716
0.55 13.6383335
0.6 13.3401868
0.65 13.04493145
0.7 12.7525675
0.75 12.46309495
0.8 12.1765138
0.85 11.892824
0.9 11.6120256
0.95 11.3341186
1.0 11.05910295
1.05 10.7869787
1.1 10.51774585
1.15 10.25140435
1.2 9.98795425
1.25 9.72739555
1.3 9.46972825
1.35 9.2149523
1.4 8.96306775
1.45 8.7140746
1.5 8.4679728
1.55 8.2247624
1.6 7.9844434
1.65 7.7470158
1.7 7.51247955
1.75 7.2808347
1.8 7.05208125
1.85 6.82621915
1.9 6.60324845
1.95 6.38316915
2.0 6.16598125
2.05 5.9516847
2.1 5.74027955
2.15 5.5317658
2.2 5.3261434
2.25 5.1234124
2.3 4.9235728
2.35 4.72662455
2.4 4.5325677
2.45 4.34140225
2.5 4.1531282
2.55 3.9677455
2.6 3.7852542
2.65 3.6056543
2.7 3.42894575
2.75 3.2551286
2.8 3.08420285
2.85 2.9161685
2.9 2.7510255
2.95 2.5887739
3.0 2.4294137
3.05 2.27294485
3.1 2.1193674
3.15 1.96868135
3.2 1.8208867
3.25 1.6759834
3.3 1.5339715
3.35 1.394851
3.4 1.25862185
3.45 1.1252841
3.5 0.99483775
3.55 0.8672828
3.6 0.7426192
3.65 0.620847
3.7 0.5019662
3.75 0.38597675
3.8 0.24550775
3.85 0.0682718
3.9 -0.1907366
3.95 -0.4843737
4.0 -0.71005075
4.05 -0.8814621
4.1 -0.99749415
4.15 -1.06759545
4.2 -1.11643945
4.25 -1.14674685
4.3 -1.1549883
4.35 -1.14264925
4.4 -1.11601185
4.45 -1.0811622
4.5 -1.0418092
4.55 -1.00015815
4.6 -0.95783825
4.65 -0.91599785
4.7 -0.87662045
4.75 -0.84172985
4.8 -0.81017365
4.85 -0.7814471
4.9 -0.7574789
4.95 -0.7366884
5.0 -0.71668385
5.05 -0.69891835
5.1 -0.6834711
5.15 -0.66717355
5.2 -0.6491585
5.25 -0.630595
5.3 -0.6112509
5.35 -0.59023715
5.4 -0.5682011
5.45 -0.54652565
5.5 -0.52414055
5.55 -0.5003119
5.6 -0.4771011
5.65 -0.4553578
5.7 -0.43339345
5.75 -0.41133425
5.8 -0.3904306
5.85 -0.3697353
5.9 -0.34844535
5.95 -0.32776625
6.0 -0.30980545
6.05 -0.2945022
6.1 -0.2804155
6.15 -0.2678351
6.2 -0.2571279
6.25 -0.24641425
6.3 -0.23520315
6.35 -0.22556525
6.4 -0.21802
6.45 -0.212469
6.5 -0.2092398
6.55 -0.2080833
6.6 -0.2082724
6.65 -0.20868345
6.7 -0.20849815
6.75 -0.2079541
6.8 -0.20638105
6.85 -0.2026798
6.9 -0.1978193
6.95 -0.19171325
7.0 -0.1834666
7.05 -0.1750179
7.1 -0.16780135
7.15 -0.1611136
7.2 -0.15568535
7.25 -0.1520604
7.3 -0.14935765
7.35 -0.1475472
7.4 -0.1466857
7.45 -0.1470288
7.5 -0.14847875
7.55 -0.14934525
7.6 -0.1493418
7.65 -0.1492695
7.7 -0.14804885
7.75 -0.1451056
7.8 -0.14113495
7.85 -0.13565555
7.9 -0.12837875
7.95 -0.1195538
8.0 -0.1095164
8.05 -0.09878975
8.1 -0.0872475
8.15 -0.07462945
8.2 -0.06191445
8.25 -0.05003015
8.3 -0.03910805
8.35 -0.02923825
8.4 -0.02003885
8.45 -0.0111579
8.5 -0.0025982
8.55 0.00563095
8.6 0.0135687
8.65 0.02077995
8.7 0.0274614
8.75 0.0346682
8.8 0.04246875
8.85 0.04964735
8.9 0.0561991
8.95 0.06302075
9.0 0.0692472
9.05 0.07446235
9.1 0.07981395
9.15 0.08516895
9.2 0.08978135
9.25 0.09418245
9.3 0.09862655
9.35 0.10288735
9.4 0.10708725
9.45 0.1109071
9.5 0.11452055
9.55 0.11856155
9.6 0.122937
9.65 0.12729735
9.7 0.1318264
9.75 0.13638515
9.8 0.14018135
9.85 0.14309115
9.9 0.14585625
9.95 0.14887015
10.0 0.15152015
10.05 0.1539302
10.1 0.1563191
10.15 0.1577882
10.2 0.15792315
10.25 0.15712115
10.3 0.15497815
10.35 0.1512089
10.4 0.1464996
10.45 0.14076435
10.5 0.1339756
10.55 0.12701615
10.6 0.1205891
10.65 0.11496545
10.7 0.1102054
10.75 0.10669395
10.8 0.104711
10.85 0.10334505
10.9 0.1023946
10.95 0.10259835
11.0 0.1029058
11.05 0.10267355
11.1 0.10314615
11.15 0.10390805
11.2 0.1042526
11.25 0.10524035
11.3 0.1065097
11.35 0.1074165
11.4 0.1088439
11.45 0.11084715
11.5 0.11276895
11.55 0.11485225
11.6 0.1170907
11.65 0.1187704
11.7 0.12020285
11.75 0.12228775
11.8 0.12526145
11.85 0.12834125
11.9 0.1310336
11.95 0.13336035
12.0 0.13489805
12.05 0.13580025
12.1 0.13704945
12.15 0.1388166
12.2 0.1401057
12.25 0.1405652
12.3 0.1398421
12.35 0.13760045
12.4 0.1349121
12.45 0.13268195
12.5 0.13093095
12.55 0.12962755
12.6 0.12828565
12.65 0.1262781
12.7 0.12362915
12.75 0.1201434
12.8 0.1164151
12.85 0.1133653
12.9 0.11023895
12.95 0.1070379
13.0 0.1047973
13.05 0.10262385
13.1 0.09971495
13.15 0.0970594
13.2 0.09428015
13.25 0.0905319
13.3 0.08679485
13.35 0.0836338
13.4 0.0802327
13.45 0.07658615
13.5 0.07326065
13.55 0.0695665
13.6 0.06496925
13.65 0.06054505
13.7 0.05669305
13.75 0.05237665
13.8 0.04785485
13.85 0.04390475
13.9 0.0397296
13.95 0.03511305
14.0 0.03097975
14.05 0.0271579
14.1 0.0232084
14.15 0.0193613
14.2 0.01566
14.25 0.0119879
14.3 0.0082883
14.35 0.00475555
14.4 0.00181525
14.45 -0.0007249
14.5 -0.0030241
14.55 -0.00477715
14.6 -0.0062991
14.65 -0.0079245
14.7 -0.00934375
14.75 -0.01049385
14.8 -0.0112802
14.85 -0.0113741
14.9 -0.01127065
14.95 -0.0114079
15.0 -0.0116186
15.05 -0.0120335
15.1 -0.01275395
15.15 -0.0132255
15.2 -0.01321525
15.25 -0.01296745
15.3 -0.0122831
15.35 -0.01141055
15.4 -0.01084855
15.45 -0.0104368
15.5 -0.01004625
15.55 -0.0101316
15.6 -0.0108763
15.65 -0.0116913
15.7 -0.01191545
15.75 -0.0117792
15.8 -0.01193715
15.85 -0.0117602
15.9 -0.0112479
15.95 -0.0116952
16.0 -0.0126206
16.05 -0.0128559
16.1 -0.01328045
16.15 -0.01423385
16.2 -0.0145828
16.25 -0.01478525
16.3 -0.0156862
16.35 -0.01654275
16.4 -0.0168836
16.45 -0.0172865
16.5 -0.01783925
16.55 -0.01806055
16.6 -0.0179842
16.65 -0.01829355
16.7 -0.01914665
16.75 -0.01991025
16.8 -0.02041455
16.85 -0.0210733
16.9 -0.0216214
16.95 -0.0216612
17.0 -0.0215542
17.05 -0.0214853
17.1 -0.02101705
17.15 -0.02009025
17.2 -0.01929
17.25 -0.01873015
17.3 -0.01826245
17.35 -0.0181882
17.4 -0.01862745
17.45 -0.018883
17.5 -0.01863055
17.55 -0.0183662
17.6 -0.01796535
17.65 -0.01699715
17.7 -0.01615825
17.75 -0.0160162
17.8 -0.01582865
17.85 -0.0152516
17.9 -0.01449405
17.95 -0.0132543
18.0 -0.011664
18.05 -0.01019055
18.1 -0.00886505
18.15 -0.0079416
18.2 -0.0073751
18.25 -0.00640505
18.3 -0.0050858
18.35 -0.0040672
18.4 -0.0030781
18.45 -0.0018674
18.5 -0.00086525
18.55 -5.41499999999e-05
18.6 0.0011417
18.65 0.00259025
18.7 0.0036541
18.75 0.0043525
18.8 0.0050068
18.85 0.0055891
18.9 0.00602435
18.95 0.0064835
19.0 0.0070823
19.05 0.0076202
19.1 0.0078471
19.15 0.00801595
19.2 0.00820045
19.25 0.00822995
19.3 0.00845525
19.35 0.0088467
19.4 0.0090906
19.45 0.0095502
19.5 0.0101487
19.55 0.0102137
19.6 0.0098551
19.65 0.009264
19.7 0.00843355
19.75 0.00803425
19.8 0.00816945
19.85 0.0084159
19.9 0.0088881
19.95 0.0094037
20.0 0.0092513
20.05 0.00865585
20.1 0.00856155
20.15 0.0086393
20.2 0.00823315
20.25 0.00793695
20.3 0.0079664
20.35 0.0073194
20.4 0.0065251
20.45 0.00675095
20.5 0.00705235
20.55 0.0069795
20.6 0.0074295
20.65 0.00793315
20.7 0.00755795
20.75 0.00710775
20.8 0.0070906
20.85 0.00682075
20.9 0.0063407
20.95 0.0062116
21.0 0.0063043
21.05 0.00626265
21.1 0.0062627
21.15 0.00635945
21.2 0.0063438
21.25 0.0062465
21.3 0.0062609
21.35 0.0063061
21.4 0.0061682
21.45 0.0061887
21.5 0.00662435
21.55 0.00706955
21.6 0.0073894
21.65 0.0077344
21.7 0.00777255
21.75 0.00729525
21.8 0.0066621
21.85 0.0062665
21.9 0.00634285
21.95 0.0065527
22.0 0.0065665
22.05 0.00649805
22.1 0.0062379
22.15 0.00577175
22.2 0.0055746
22.25 0.00572695
22.3 0.006025
22.35 0.0064877
22.4 0.0068331
22.45 0.00677955
22.5 0.0064617
22.55 0.00617855
22.6 0.0060122
22.65 0.00600335
22.7 0.00636685
22.75 0.0071224
22.8 0.0078601
22.85 0.00837435
22.9 0.00868935
22.95 0.0086767
23.0 0.0082278
23.05 0.007533
23.1 0.00730395
23.15 0.00779495
23.2 0.00835955
23.25 0.0089746
23.3 0.0097188
23.35 0.0095261
23.4 0.00858395
23.45 0.00839975
23.5 0.00859105
23.55 0.0084357
23.6 0.00868605
23.65 0.00908035
23.7 0.00873925
23.75 0.0084564
23.8 0.00899855
23.85 0.00962455
23.9 0.0097596
23.95 0.00965255
24.0 0.0094159
24.05 0.0086734
24.1 0.0077313
24.15 0.0077158
24.2 0.00838035
24.25 0.0085403
24.3 0.0084818
24.35 0.008825
24.4 0.008904
24.45 0.00836965
24.5 0.0079198
24.55 0.0080628
24.6 0.00834425
24.65 0.0081729
24.7 0.00809975
24.75 0.00848985
24.8 0.0083268
24.85 0.00735525
24.9 0.00656805
24.95 0.00614705
25.0 0.00593125
25.05 0.00615725
25.1 0.00663485
25.15 0.0070683
25.2 0.0073381
25.25 0.00703475
25.3 0.0065116
25.35 0.0065545
25.4 0.00671465
25.45 0.00657215
25.5 0.00662035
25.55 0.0066554
25.6 0.0062366
25.65 0.0058322
25.7 0.00564415
25.75 0.0055593
25.8 0.00562515
25.85 0.0054823
25.9 0.00514835
25.95 0.0052373
26.0 0.00525525
26.05 0.0048049
26.1 0.0049075
26.15 0.0053104
26.2 0.00485575
26.25 0.0043315
26.3 0.00435535
26.35 0.00408215
26.4 0.00390125
26.45 0.0044499
26.5 0.00479265
26.55 0.0045233
26.6 0.00426685
26.65 0.0040052
26.7 0.00331925
26.75 0.0027401
26.8 0.00302025
26.85 0.00337465
26.9 0.0029613
26.95 0.00273105
27.0 0.00310645
27.05 0.00310425
27.1 0.0025761
27.15 0.00216665
27.2 0.00197505
27.25 0.00156965
27.3 0.00089175
27.35 0.00089245
27.4 0.00172425
27.45 0.00195015
27.5 0.00157985
27.55 0.0016781
27.6 0.0016591
27.65 0.00107765
27.7 0.000976
27.75 0.0013315
27.8 0.0012079
27.85 0.00080025
27.9 0.0004511
27.95 5.20000000007e-06
28.0 -0.0003322
28.05 -0.0005441
28.1 -0.00093975
28.15 -0.0011808
28.2 -0.0011245
28.25 -0.00119515
28.3 -0.00114525
28.35 -0.00057815
28.4 -4.06499999999e-05
28.45 -9.27499999999e-05
28.5 -0.00064435
28.55 -0.00124635
28.6 -0.0014181
28.65 -0.00119255
28.7 -0.00097655
28.75 -0.00074075
28.8 -0.00035455
28.85 -0.0003853
28.9 -0.0010092
28.95 -0.00141615
29.0 -0.00121665
29.05 -0.0010309
29.1 -0.00117755
29.15 -0.0011913
29.2 -0.0008576
29.25 -0.0005891
29.3 -0.00069915
29.35 -0.0008433
29.4 -0.0007909
29.45 -0.00091555
29.5 -0.00124685
29.55 -0.0011366
29.6 -0.0006953
29.65 -0.00063805
29.7 -0.0007179
29.75 -0.0004103
29.8 -5.48999999999e-05
29.85 0.00011605
29.9 0.000327
29.95 0.00056335
30.0 0.00049645
30.05 -0.00012745
30.1 -0.00054315
30.15 4.60000000002e-06
30.2 0.00061465
30.25 0.00052865
30.3 0.00072865
30.35 0.00117205
30.4 0.00066315
30.45 -9.22999999999e-05
30.5 4.50000000001e-05
30.55 0.0003854
30.6 0.00022435
30.65 0.00014605
30.7 0.000459
30.75 0.0006503
30.8 0.0004295
30.85 0.0004554
30.9 0.00099675
30.95 0.001051
31.0 0.00066955
31.05 0.00075455
31.1 0.0008121
31.15 0.0004569
31.2 0.0005612
31.25 0.0009312
31.3 0.00083905
31.35 0.0007101
31.4 0.00070405
31.45 0.00049485
31.5 0.0003949
31.55 0.0006332
31.6 0.0007376
31.65 0.00063495
31.7 0.000732
31.75 0.00079375
31.8 0.0004477
31.85 0.00029125
31.9 0.0004011
31.95 -0.0001083
32.0 -0.00055245
32.05 7.89e-05
32.1 0.0005499
32.15 0.000314
32.2 0.0006063
32.25 0.00094475
32.3 0.0002855
32.35 -0.0003185
32.4 -0.0002907
32.45 -0.0003353
32.5 -0.0004207
32.55 -0.0001874
32.6 2.61000000001e-05
32.65 8.90000000006e-06
32.7 -9.24999999995e-06
32.75 2.80000000001e-05
32.8 -9.61499999999e-05
32.85 -0.00022135
32.9 6.23e-05
32.95 0.0001517
33.0 -0.00021745
33.05 -0.0003488
33.1 -0.00044275
33.15 -0.00084405
33.2 -0.00086595
33.25 -0.00054415
33.3 -0.00056765
33.35 -0.0005918
33.4 -0.0003783
33.45 -0.00031215
33.5 -0.00022515
33.55 0.0002634
33.6 0.0005948
33.65 0.00035445
33.7 0.00042385
33.75 0.0008374
33.8 0.0005138
33.85 -8.555e-05
33.9 -0.00010015
33.95 -0.00042335
34.0 -0.00131925
34.05 -0.0015746
34.1 -0.00125635
34.15 -0.0013166
34.2 -0.00153205
34.25 -0.001318
34.3 -0.0009537
34.35 -0.0007955
34.4 -0.0004057
34.45 0.0003329
34.5 0.00062405
34.55 0.0004898
34.6 0.00087935
34.65 0.00131185
34.7 0.0008733
34.75 0.00043795
34.8 0.0005003
34.85 0.00028445
34.9 -4.45999999999e-05
34.95 1.65000000008e-06
35.0 -7.23499999999e-05
35.05 -0.0005842
35.1 -0.00173335
35.15 -0.00337025
35.2 -0.0041713
35.25 -0.00388365
35.3 -0.0037485
35.35 -0.00361595
35.4 -0.00282185
35.45 -0.00224915
35.5 -0.0021473
35.55 -0.0014583
35.6 0.0001331
35.65 0.00194695
35.7 0.003108
35.75 0.00319015
35.8 0.0025796
35.85 0.0010162
35.9 -0.0016557
35.95 -0.003543
