{
    "_comment": "Build with `packer build rhel.json`",
    "description": "Red Hat template",
    "builders": [
      {
        "boot_command": [
          "<up><wait><tab><wait> text ks=http://{{ .HTTPIP }}:{{ .HTTPPort }}/{{ user `kickstart` }}<enter><wait5>"
        ],
        
        "disk_size": "{{ user `disk_size` }}",
        "guest_os_type": "{{ user `vmware_guest_os_type` }}",
        "headless": "{{ user `headless` }}",
        "http_directory": "http",
        "iso_checksum": "{{ user `iso_checksum` }}",
        
        "iso_urls": [
          "{{ user `iso_path` }}/{{ user `iso_name` }}",
          "{{ user `iso_url` }}"
        ],
        "output_directory": "output-{{ user `vm_name` }}-vmware-iso",
        "shutdown_command": "{{ user `shutdown_command` }}",
        "ssh_password": "{{ user `ssh_password` }}",
        "ssh_username": "{{ user `ssh_username` }}",
        "ssh_wait_timeout": "10000s",
        "tools_upload_flavor": "linux",
        "type": "vmware-iso",
        "vm_name": "{{ user `vm_name` }}",
        "vmx_data": {
          "cpuid.coresPerSocket": "1",
          "memsize": "{{ user `memory` }}",
          "numvcpus": "{{ user `cpus` }}"
        }
      },
      {
        "boot_command": [
          "<tab> text ks=http://{{ .HTTPIP }}:{{ .HTTPPort}}/{{ user `kickstart` }}<enter>"
        ],
        "disk_size": "{{ user `disk_size` }}",
        "guest_additions_path": "VBoxGuestAdditions_{{.Version}}.iso",
        "guest_os_type": "{{ user `virtualbox_guest_os_type` }}",
        "hard_drive_interface": "sata",
        "headless": "{{ user `headless` }}",
        "http_directory": "http",
        "iso_checksum": "{{ user `iso_checksum` }}",
        "iso_urls": [
          "{{ user `iso_path` }}/{{ user `iso_name` }}",
          "{{ user `iso_url` }}"
        ],
        "output_directory": "output-{{ user `vm_name` }}-virtualbox-iso",
        "shutdown_command": "{{ user `shutdown_command` }}",
        "ssh_password": "{{ user `ssh_password` }}",
        "ssh_username": "{{ user `ssh_username` }}",
        "ssh_wait_timeout": "10000s",
        "type": "virtualbox-iso",
        "vboxmanage": [
          [
            "modifyvm", "{{.Name}}", "--memory", "{{ user `memory` }}"
          ],
          [
            "modifyvm", "{{.Name}}", "--cpus", "{{ user `cpus` }}"
          ]
        ],
        "virtualbox_version_file": ".vbox_version",
        "vm_name": "{{ user `vm_name` }}"
      },
      {
        "boot_command": [
          "<tab> text ks=http://{{ .HTTPIP }}:{{ .HTTPPort}}/{{ user `kickstart` }}<enter>"
        ],
        "disk_size": "{{ user `disk_size` }}",
        "guest_os_type": "{{ user `parallels_guest_os_type` }}",
        "http_directory": "http",
        "iso_checksum": "{{ user `iso_checksum` }}",
        "iso_urls": [
          "{{ user `iso_path` }}/{{ user `iso_name` }}",
          "{{ user `iso_url` }}"
        ],
        "output_directory": "output-{{ user `vm_name` }}-parallels-iso",
        "parallels_tools_flavor": "lin",
        "prlctl": [
          [
            "set", "{{.Name}}", "--memsize", "{{ user `memory` }}"
          ],
          [
            "set", "{{.Name}}", "--cpus", "{{ user `cpus` }}"
          ]
        ],
        "shutdown_command": "{{ user `shutdown_command` }}",
        "ssh_password": "{{ user `ssh_password` }}",
        "ssh_username": "{{ user `ssh_username` }}",
        "ssh_wait_timeout": "10000s",
        "type": "parallels-iso",
        "vm_name": "{{ user `vm_name` }}"
      }
    ],
    "post-processors": [
      {
        "keep_input_artifact": false,
        "output": "box/{{.Provider}}/{{user `vm_name`}}-{{user `version`}}.box",
        "type": "vagrant",
        "vagrantfile_template": "{{ user `vagrantfile_template` }}"
      }
    ],
    "provisioners": [
      {
        "environment_vars": [
          "DESKTOP={{user `desktop`}}",
          "DOCKER={{user `docker`}}",
          "UPDATE={{user `update`}}",
          "INSTALL_VAGRANT_KEY={{user `install_vagrant_key`}}",
          "SSH_USERNAME={{user `ssh_username`}}",
          "SSH_PASSWORD={{user `ssh_password`}}",
          "http_proxy={{user `http_proxy`}}",
          "https_proxy={{user `https_proxy`}}",
          "ftp_proxy={{user `ftp_proxy`}}",
          "rsync_proxy={{user `rsync_proxy`}}",
          "no_proxy={{user `no_proxy`}}",
          "RHN_USERNAME={{user `rhn_username`}}",
          "RHN_PASSWORD={{user `rhn_password`}}"
        ],
        "execute_command": "echo 'vagrant' | {{.Vars}} sudo -E -S bash '{{.Path}}'",
        "scripts": [
          "script/subscription-attach.sh",
          "script/fix-slow-dns.sh",
          "script/kernel.sh",
          "script/sshd.sh",
          "script/update.sh",
          "script/vagrant.sh",
          "script/desktop.sh",
          "script/vmware.sh",
          "script/virtualbox.sh",
          "script/parallels.sh",
          "script/motd.sh",
          "script/cleanup.sh",
          "script/subscription-remove.sh"
        ],
        "type": "shell",
        "expect_disconnect": "true"
      }
    ],
    "variables": {
      "cpus": "2",
      "cutom_script": ".",
      "desktop": "false",
      "disk_size": "65536",
      "docker": "false",
      "ftp_proxy": "{{env `ftp_proxy`}}",
      "headless": "true",
      "http_proxy": "{{env `http_proxy`}}",
      "https_proxy": "{{env `https_proxy`}}",
      "install_vagrant_key": "true",
      "iso_checksum": "60a0be5aeed1f08f2bb7599a578c89ec134b4016cd62a8604b29f15d543a469c",
      "iso_name": "rhel-server-7.6-x86_64-dvd.iso",
      "iso_path": "/Volumes/Storage/software/rhel",
      "iso_url": "iso/rhel-server-7.6-x86_64-dvd.iso",
      "kickstart": "ks7.cfg",
      "memory": "512",
      "no_proxy": "{{env `no_proxy`}}",
      "rsync_proxy": "{{env `rsync_proxy`}}",
      "shutdown_command": "echo 'vagrant'|sudo -S shutdown -P now",
      "ssh_password": "vagrant",
      "ssh_username": "vagrant",
      "update": "false",
      "vagrantfile_template": "",
      "version": "1.0.0",
      "parallels_guest_os_type": "rhel7",
      "virtualbox_guest_os_type": "RedHat_64",
      "vmware_guest_os_type": "rhel7_64Guest",
      "vm_name": "rhel7",
      "rhn_username": "{{ env `RHN_USERNAME` }}",
      "rhn_password": "{{ env `RHN_PASSWORD` }}"
    }
  }