18:13:22 **** Incremental Build of configuration Debug for project test_bsp_xaxidma_example_sg_poll_2 ****
make pre-build main-build 
a9-linaro-pre-build-step
' '
make: Nothing to be done for 'main-build'.

18:13:22 Build Finished (took 162ms)

