vhdl xil_defaultlib  \
"../../../bd/design_1/ip/design_1_axi_smc_0/bd_0/ip/ip_1/sim/bd_afc3_psr_aclk_0.vhd" \
"../../../bd/design_1/ip/design_1_rst_ps7_0_50M_0/sim/design_1_rst_ps7_0_50M_0.vhd" \
"../../../bd/design_1/ip/design_1_smartconnect_0_0/bd_0/ip/ip_1/sim/bd_48ac_psr_aclk_0.vhd" \
"../../../bd/design_1/ip/design_1_axi_timer_0_0/sim/design_1_axi_timer_0_0.vhd" \

nosort
