2019-11-01 13:31:14.348141056,2019-11-01 13:31:14.348118690,214714,T,IEX,134.490000,7
2019-11-01 13:31:17.816804096,2019-11-01 13:31:17.816780810,219252,T,IEX,134.450000,8
2019-11-01 13:31:53.353376000,2019-11-01 13:31:53.353353604,254000,T,IEX,134.460000,8
2019-11-01 13:32:24.711180032,2019-11-01 13:32:24.711156482,289109,T,IEX,134.520000,10
2019-11-01 13:32:26.199996928,2019-11-01 13:32:26.199978104,290767,T,IEX,134.520000,8
2019-11-01 13:33:06.140116992,2019-11-01 13:33:06.140098317,331354,T,IEX,134.235000,1
2019-11-01 13:33:27.815182080,2019-11-01 13:33:27.815163602,357060,T,IEX,134.390000,11
2019-11-01 13:33:28.697458944,2019-11-01 13:33:28.697437061,357976,T,IEX,134.390000,6
2019-11-01 13:33:46.428239872,2019-11-01 13:33:46.428222541,374727,T,IEX,134.315000,1
2019-11-01 13:34:32.537596928,2019-11-01 13:34:32.537579499,420713,T,IEX,134.450000,29
2019-11-01 13:35:33.695714048,2019-11-01 13:35:33.695698420,483852,T,IEX,134.485000,2
2019-11-01 13:35:33.701873920,2019-11-01 13:35:33.701857122,483858,T,IEX,134.460000,3
2019-11-01 13:36:37.588610048,2019-11-01 13:36:37.588591820,550111,T,IEX,134.490000,1
2019-11-01 13:37:26.588247040,2019-11-01 13:37:26.588229250,599417,T,IEX,134.625000,3
2019-11-01 13:39:04.49019904,2019-11-01 13:39:04.48999446,690842,T,IEX,134.620000,7
2019-11-01 13:39:07.48851968,2019-11-01 13:39:07.48834593,693451,T,IEX,134.620000,28
2019-11-01 13:40:50.410821888,2019-11-01 13:40:50.410802472,795874,T,IEX,134.630000,1
2019-11-01 13:41:45.176660992,2019-11-01 13:41:45.176642411,843097,T,IEX,134.685000,3
2019-11-01 13:42:45.873434112,2019-11-01 13:42:45.873418682,899561,T,IEX,134.570000,100
2019-11-01 13:43:06.935307008,2019-11-01 13:43:06.935291610,915551,T,IEX,134.615000,1000
2019-11-01 13:43:06.956453888,2019-11-01 13:43:06.956434337,915573,T,IEX,134.615000,900
2019-11-01 13:43:06.970315008,2019-11-01 13:43:06.970294237,915583,T,IEX,134.615000,1300
2019-11-01 13:43:08.356912128,2019-11-01 13:43:08.356895712,916720,T,IEX,134.630000,28
2019-11-01 13:43:13.174259968,2019-11-01 13:43:13.174244356,920602,T,IEX,134.670000,100
2019-11-01 13:43:43.781747968,2019-11-01 13:43:43.781728523,943247,T,IEX,134.750000,300
2019-11-01 13:44:15.600948992,2019-11-01 13:44:15.600930526,967045,T,IEX,134.780000,2
2019-11-01 13:44:34.164839936,2019-11-01 13:44:34.164822048,980355,T,IEX,134.770000,28
2019-11-01 13:45:01.962711040,2019-11-01 13:45:01.962690013,996251,T,IEX,134.760000,600
2019-11-01 13:45:02.253120000,2019-11-01 13:45:02.253101925,996487,T,IEX,134.685000,100
2019-11-01 13:45:06.737379072,2019-11-01 13:45:06.737357925,998845,T,IEX,134.700000,800
2019-11-01 13:48:32.271520000,2019-11-01 13:48:32.271504124,1167701,T,IEX,134.755000,3
2019-11-01 13:48:50.266885120,2019-11-01 13:48:50.266866862,1181776,T,IEX,134.715000,3
2019-11-01 13:48:51.427817984,2019-11-01 13:48:51.427797803,1182611,T,IEX,134.705000,28
2019-11-01 13:48:55.691412992,2019-11-01 13:48:55.691396115,1185850,T,IEX,134.710000,26
2019-11-01 13:49:00.793928960,2019-11-01 13:49:00.793910342,1190444,T,IEX,134.700000,12
2019-11-01 13:50:11.367362048,2019-11-01 13:50:11.367343455,1245116,T,IEX,134.720000,100
2019-11-01 13:50:41.142824960,2019-11-01 13:50:41.142805613,1269171,T,IEX,134.720000,100
2019-11-01 13:50:53.927297024,2019-11-01 13:50:53.927280133,1279484,T,IEX,134.710000,600
2019-11-01 13:51:38.910728960,2019-11-01 13:51:38.910708985,1313030,T,IEX,134.710000,100
2019-11-01 13:51:39.283539968,2019-11-01 13:51:39.283520788,1313213,T,IEX,134.710000,100
2019-11-01 13:52:07.20864000,2019-11-01 13:52:07.20844924,1331906,T,IEX,134.665000,4
2019-11-01 13:55:13.810767872,2019-11-01 13:55:13.810749155,1505439,T,IEX,134.545000,2
2019-11-01 13:58:41.108772096,2019-11-01 13:58:41.108754045,1666574,T,IEX,134.500000,28
2019-11-01 13:59:38.468011008,2019-11-01 13:59:38.467990387,1707836,T,IEX,134.550000,100
2019-11-01 14:01:39.374006016,2019-11-01 14:01:39.373989955,1898402,T,IEX,134.605000,100
2019-11-01 14:02:41.903292928,2019-11-01 14:02:41.903277542,1981927,T,IEX,134.680000,100
2019-11-01 14:02:50.318540032,2019-11-01 14:02:50.318522711,1992744,T,IEX,134.680000,8
2019-11-01 14:02:50.318552064,2019-11-01 14:02:50.318535060,1992745,T,IEX,134.680000,2
2019-11-01 14:02:59.554236928,2019-11-01 14:02:59.554214618,2003033,T,IEX,134.700000,100
2019-11-01 14:03:32.431319040,2019-11-01 14:03:32.431298476,2052775,T,IEX,134.805000,127
2019-11-01 14:04:14.288753920,2019-11-01 14:04:14.288729037,2104515,T,IEX,134.770000,60
2019-11-01 14:04:35.520378880,2019-11-01 14:04:35.520363375,2124289,T,IEX,134.810000,100
2019-11-01 14:05:12.779015936,2019-11-01 14:05:12.778997700,2162695,T,IEX,134.835000,10
2019-11-01 14:06:47.546347008,2019-11-01 14:06:47.546329253,2268367,T,IEX,134.970000,100
2019-11-01 14:09:22.909602048,2019-11-01 14:09:22.909581388,2393990,T,IEX,135.000000,12
2019-11-01 14:09:30.357001984,2019-11-01 14:09:30.356984625,2398861,T,IEX,134.950000,74
2019-11-01 14:09:30.357201920,2019-11-01 14:09:30.357187302,2398863,T,IEX,134.950000,26
2019-11-01 14:11:08.446796032,2019-11-01 14:11:08.446778213,2471100,T,IEX,134.925000,10
2019-11-01 14:11:08.446810880,2019-11-01 14:11:08.446795814,2471101,T,IEX,134.925000,40
2019-11-01 14:11:22.591444992,2019-11-01 14:11:22.591423268,2482016,T,IEX,134.910000,29
2019-11-01 14:13:07.128018944,2019-11-01 14:13:07.128002065,2559956,T,IEX,134.910000,28
2019-11-01 14:14:31.443203072,2019-11-01 14:14:31.443183886,2633916,T,IEX,135.070000,100
2019-11-01 14:14:37.464231936,2019-11-01 14:14:37.464215767,2638037,T,IEX,135.095000,100
2019-11-01 14:17:04.993529088,2019-11-01 14:17:04.993511553,2754336,T,IEX,135.140000,100
2019-11-01 14:18:29.842813952,2019-11-01 14:18:29.842794067,2811847,T,IEX,135.095000,3
2019-11-01 14:20:54.851062016,2019-11-01 14:20:54.851044144,2932884,T,IEX,134.995000,700
2019-11-01 14:20:54.863739904,2019-11-01 14:20:54.863719281,2932888,T,IEX,134.995000,500
2019-11-01 14:21:03.84732928,2019-11-01 14:21:03.84714659,2940100,T,IEX,135.005000,100
2019-11-01 14:21:11.981748992,2019-11-01 14:21:11.981726821,2947522,T,IEX,134.985000,900
2019-11-01 14:21:33.928603904,2019-11-01 14:21:33.928585193,2963226,T,IEX,134.960000,2
2019-11-01 14:21:35.354123008,2019-11-01 14:21:35.354105176,2965212,T,IEX,134.940000,100
2019-11-01 14:22:23.802798080,2019-11-01 14:22:23.802778808,3005776,T,IEX,135.035000,100
2019-11-01 14:25:36.105421056,2019-11-01 14:25:36.105400017,3145958,T,IEX,135.060000,100
2019-11-01 14:25:36.105742080,2019-11-01 14:25:36.105723656,3145959,T,IEX,135.060000,100
2019-11-01 14:26:25.468475904,2019-11-01 14:26:25.468455910,3183852,T,IEX,135.075000,100
2019-11-01 14:26:25.964958976,2019-11-01 14:26:25.964938379,3184326,T,IEX,135.075000,100
2019-11-01 14:26:54.902521088,2019-11-01 14:26:54.902504744,3200185,T,IEX,135.050000,100
2019-11-01 14:28:18.385293056,2019-11-01 14:28:18.385273557,3256648,T,IEX,135.065000,100
2019-11-01 14:28:20.758848000,2019-11-01 14:28:20.758825431,3258002,T,IEX,135.030000,100
2019-11-01 14:28:22.75346944,2019-11-01 14:28:22.75328785,3258925,T,IEX,135.020000,100
2019-11-01 14:28:51.532743936,2019-11-01 14:28:51.532722666,3275693,T,IEX,135.010000,600
2019-11-01 14:30:13.143219968,2019-11-01 14:30:13.143204675,3336818,T,IEX,135.175000,18
2019-11-01 14:30:14.740873984,2019-11-01 14:30:14.740852706,3337865,T,IEX,135.120000,100
2019-11-01 14:30:21.607580928,2019-11-01 14:30:21.607559901,3342529,T,IEX,135.085000,100
2019-11-01 14:31:38.859008000,2019-11-01 14:31:38.858990852,3399039,T,IEX,135.030000,100
2019-11-01 14:32:03.355074048,2019-11-01 14:32:03.355055927,3413040,T,IEX,135.020000,100
2019-11-01 14:32:10.403521024,2019-11-01 14:32:10.403501799,3418077,T,IEX,135.015000,2
2019-11-01 14:32:32.907004928,2019-11-01 14:32:32.906989793,3437862,T,IEX,134.965000,100
2019-11-01 14:33:36.76049920,2019-11-01 14:33:36.76033084,3481405,T,IEX,134.925000,3
2019-11-01 14:33:51.123502080,2019-11-01 14:33:51.123483708,3492094,T,IEX,134.925000,100
2019-11-01 14:35:54.340350976,2019-11-01 14:35:54.340336074,3578193,T,IEX,134.890000,1900
2019-11-01 14:36:01.876587008,2019-11-01 14:36:01.876567072,3583887,T,IEX,134.995000,2
2019-11-01 14:36:01.876600064,2019-11-01 14:36:01.876584787,3583888,T,IEX,134.995000,16
2019-11-01 14:36:06.30803968,2019-11-01 14:36:06.30784090,3586974,T,IEX,135.015000,100
2019-11-01 14:37:07.605730048,2019-11-01 14:37:07.605709976,3629759,T,IEX,135.090000,100
2019-11-01 14:37:07.605771008,2019-11-01 14:37:07.605753959,3629760,T,IEX,135.090000,100
2019-11-01 14:37:09.106748928,2019-11-01 14:37:09.106729977,3630769,T,IEX,135.150000,100
2019-11-01 14:37:09.127118080,2019-11-01 14:37:09.127098398,3630779,T,IEX,135.150000,100
2019-11-01 14:37:09.444208896,2019-11-01 14:37:09.444191921,3631040,T,IEX,135.160000,800
2019-11-01 14:37:11.564004096,2019-11-01 14:37:11.563981654,3631990,T,IEX,135.150000,2
2019-11-01 14:37:54.44665088,2019-11-01 14:37:54.44648222,3657190,T,IEX,135.160000,100
2019-11-01 14:38:10.87550976,2019-11-01 14:38:10.87536655,3666110,T,IEX,135.130000,100
2019-11-01 14:38:10.90365952,2019-11-01 14:38:10.90351096,3666113,T,IEX,135.120000,100
2019-11-01 14:39:51.272748032,2019-11-01 14:39:51.272730359,3726056,T,IEX,135.170000,2
2019-11-01 14:43:38.17745920,2019-11-01 14:43:38.17728558,3868843,T,IEX,135.280000,100
2019-11-01 14:43:39.603659008,2019-11-01 14:43:39.603639831,3869758,T,IEX,135.280000,100
2019-11-01 14:44:27.608091904,2019-11-01 14:44:27.608072305,3904693,T,IEX,135.340000,13
2019-11-01 14:47:12.813272064,2019-11-01 14:47:12.813256951,4001499,T,IEX,135.425000,100
2019-11-01 14:49:33.103553024,2019-11-01 14:49:33.103535387,4084043,T,IEX,135.350000,100
2019-11-01 14:49:43.765804032,2019-11-01 14:49:43.765786260,4089667,T,IEX,135.280000,2
2019-11-01 14:49:45.295396096,2019-11-01 14:49:45.295376555,4090707,T,IEX,135.310000,100
2019-11-01 14:49:57.38651904,2019-11-01 14:49:57.38635501,4097629,T,IEX,135.370000,100
2019-11-01 14:50:01.607609088,2019-11-01 14:50:01.607589678,4101469,T,IEX,135.350000,98
2019-11-01 14:50:21.418476032,2019-11-01 14:50:21.418456330,4117768,T,IEX,135.380000,100
2019-11-01 14:50:41.421643008,2019-11-01 14:50:41.421624114,4128935,T,IEX,135.365000,100
2019-11-01 14:53:05.418556928,2019-11-01 14:53:05.418540862,4205977,T,IEX,135.360000,100
2019-11-01 14:54:21.225896960,2019-11-01 14:54:21.225878923,4244119,T,IEX,135.360000,100
2019-11-01 14:56:19.290129920,2019-11-01 14:56:19.290113249,4316273,T,IEX,135.330000,100
2019-11-01 14:56:19.291557888,2019-11-01 14:56:19.291539222,4316274,T,IEX,135.330000,100
2019-11-01 14:56:20.188422912,2019-11-01 14:56:20.188407891,4316786,T,IEX,135.330000,100
2019-11-01 14:56:20.189384960,2019-11-01 14:56:20.189366737,4316787,T,IEX,135.330000,100
2019-11-01 14:56:58.475740928,2019-11-01 14:56:58.475723351,4334667,T,IEX,135.390000,1
2019-11-01 14:59:08.322042112,2019-11-01 14:59:08.322022799,4407155,T,IEX,135.345000,100
2019-11-01 14:59:33.466917120,2019-11-01 14:59:33.466896806,4420050,T,IEX,135.320000,100
2019-11-01 14:59:33.468179968,2019-11-01 14:59:33.468162619,4420051,T,IEX,135.320000,100
2019-11-01 15:03:18.429755904,2019-11-01 15:03:18.429738214,4552172,T,IEX,135.270000,4
2019-11-01 15:09:57.684513024,2019-11-01 15:09:57.684495120,4754008,T,IEX,135.300000,1
2019-11-01 15:10:27.630866944,2019-11-01 15:10:27.630850752,4770639,T,IEX,135.310000,100
2019-11-01 15:14:37.532648960,2019-11-01 15:14:37.532633402,4878466,T,IEX,135.370000,2
2019-11-01 15:14:38.691685120,2019-11-01 15:14:38.691665476,4879182,T,IEX,135.370000,200
2019-11-01 15:20:08.666828032,2019-11-01 15:20:08.666809774,5027942,T,IEX,135.370000,1
2019-11-01 15:20:09.679827968,2019-11-01 15:20:09.679808499,5028320,T,IEX,135.365000,99
2019-11-01 15:21:34.123867904,2019-11-01 15:21:34.123848473,5066934,T,IEX,135.385000,108
2019-11-01 15:23:57.180122880,2019-11-01 15:23:57.180103694,5130602,T,IEX,135.340000,29
2019-11-01 15:24:57.95824896,2019-11-01 15:24:57.95806156,5154380,T,IEX,135.320000,10
2019-11-01 15:25:24.647034112,2019-11-01 15:25:24.647011784,5166176,T,IEX,135.350000,100
2019-11-01 15:25:55.307542016,2019-11-01 15:25:55.307525724,5180313,T,IEX,135.350000,3
2019-11-01 15:25:57.670142976,2019-11-01 15:25:57.670124415,5181049,T,IEX,135.340000,7
2019-11-01 15:27:17.490014976,2019-11-01 15:27:17.489999258,5222410,T,IEX,135.320000,100
2019-11-01 15:27:17.499113984,2019-11-01 15:27:17.499095147,5222413,T,IEX,135.350000,100
2019-11-01 15:28:43.39420928,2019-11-01 15:28:43.39405899,5268851,T,IEX,135.280000,100
2019-11-01 15:28:54.955205888,2019-11-01 15:28:54.955187190,5274953,T,IEX,135.270000,9
2019-11-01 15:28:54.956192000,2019-11-01 15:28:54.956174453,5274954,T,IEX,135.270000,45
2019-11-01 15:29:27.785096960,2019-11-01 15:29:27.785076323,5290509,T,IEX,135.290000,100
2019-11-01 15:31:01.62726912,2019-11-01 15:31:01.62702834,5332594,T,IEX,135.330000,65
2019-11-01 15:31:57.517893120,2019-11-01 15:31:57.517874150,5359993,T,IEX,135.305000,100
2019-11-01 15:32:36.625584128,2019-11-01 15:32:36.625564746,5378742,T,IEX,135.305000,100
2019-11-01 15:36:59.466002944,2019-11-01 15:36:59.465983332,5496193,T,IEX,135.230000,1
2019-11-01 15:39:55.530642944,2019-11-01 15:39:55.530622660,5571686,T,IEX,135.210000,100
2019-11-01 15:46:50.737836032,2019-11-01 15:46:50.737819619,5745054,T,IEX,135.300000,100
2019-11-01 15:57:48.932528896,2019-11-01 15:57:48.932511027,6033779,T,IEX,135.250000,100
2019-11-01 15:57:49.495166976,2019-11-01 15:57:49.495148271,6033960,T,IEX,135.250000,100
2019-11-01 16:08:38.124281088,2019-11-01 16:08:38.124262777,6341586,T,IEX,135.015000,1
2019-11-01 16:08:38.124300032,2019-11-01 16:08:38.124282615,6341587,T,IEX,135.020000,1
2019-11-01 16:11:45.42108928,2019-11-01 16:11:45.42088666,6435255,T,IEX,134.980000,2
2019-11-01 16:11:45.106685952,2019-11-01 16:11:45.106667908,6436124,T,IEX,134.980000,4
2019-11-01 16:15:24.691287040,2019-11-01 16:15:24.691268951,6564626,T,IEX,135.000000,100
2019-11-01 16:15:40.28187904,2019-11-01 16:15:40.28169868,6572563,T,IEX,134.985000,100
2019-11-01 16:16:29.836331008,2019-11-01 16:16:29.836312134,6597915,T,IEX,134.910000,100
2019-11-01 16:18:38.147706880,2019-11-01 16:18:38.147687817,6665623,T,IEX,135.010000,24
2019-11-01 16:23:47.360666112,2019-11-01 16:23:47.360648761,6807709,T,IEX,135.120000,100
2019-11-01 16:25:58.975386112,2019-11-01 16:25:58.975369669,6872531,T,IEX,135.070000,100
2019-11-01 16:32:40.455993088,2019-11-01 16:32:40.455975205,7053725,T,IEX,135.070000,100
2019-11-01 16:32:40.456009984,2019-11-01 16:32:40.455993904,7053726,T,IEX,135.070000,100
2019-11-01 16:32:51.432453120,2019-11-01 16:32:51.432435357,7057881,T,IEX,135.120000,55
2019-11-01 16:35:00.243924992,2019-11-01 16:35:00.243907658,7111779,T,IEX,135.130000,1
2019-11-01 16:44:26.983759872,2019-11-01 16:44:26.983742065,7321245,T,IEX,135.040000,100
2019-11-01 16:46:39.38736896,2019-11-01 16:46:39.38717506,7364540,T,IEX,135.050000,2
2019-11-01 16:46:39.38752000,2019-11-01 16:46:39.38736699,7364541,T,IEX,135.050000,45
2019-11-01 16:46:57.799405056,2019-11-01 16:46:57.799387435,7371896,T,IEX,135.090000,200
2019-11-01 16:49:59.108823040,2019-11-01 16:49:59.108804260,7429935,T,IEX,135.020000,1
2019-11-01 16:51:07.771182080,2019-11-01 16:51:07.771164482,7452733,T,IEX,135.070000,100
2019-11-01 16:51:33.453836032,2019-11-01 16:51:33.453815211,7461507,T,IEX,135.070000,41
2019-11-01 16:54:45.779654912,2019-11-01 16:54:45.779634938,7530769,T,IEX,135.010000,8
2019-11-01 16:59:12.459475968,2019-11-01 16:59:12.459460474,7633520,T,IEX,135.035000,1
2019-11-01 16:59:12.469789952,2019-11-01 16:59:12.469767472,7633550,T,IEX,135.040000,100
2019-11-01 16:59:12.469798912,2019-11-01 16:59:12.469780854,7633551,T,IEX,135.040000,100
2019-11-01 16:59:12.469816064,2019-11-01 16:59:12.469799844,7633552,T,IEX,135.040000,500
2019-11-01 16:59:28.30973952,2019-11-01 16:59:28.30952920,7638966,T,IEX,135.045000,200
2019-11-01 16:59:39.108759040,2019-11-01 16:59:39.108740216,7645799,T,IEX,135.020000,100
2019-11-01 16:59:40.670942976,2019-11-01 16:59:40.670926721,7646344,T,IEX,135.030000,100
2019-11-01 17:01:45.14701056,2019-11-01 17:01:45.14683047,7691311,T,IEX,134.960000,1
2019-11-01 17:02:18.599899904,2019-11-01 17:02:18.599879605,7703936,T,IEX,135.000000,100
2019-11-01 17:02:31.613424128,2019-11-01 17:02:31.613408163,7707780,T,IEX,135.010000,100
2019-11-01 17:03:28.816254976,2019-11-01 17:03:28.816232288,7727654,T,IEX,135.010000,100
2019-11-01 17:04:29.834806016,2019-11-01 17:04:29.834785697,7747644,T,IEX,135.000000,100
2019-11-01 17:07:35.916328960,2019-11-01 17:07:35.916311446,7809689,T,IEX,135.010000,1
2019-11-01 17:07:50.915077888,2019-11-01 17:07:50.915058204,7813130,T,IEX,135.010000,100
2019-11-01 17:08:41.588992000,2019-11-01 17:08:41.588975407,7834065,T,IEX,135.010000,100
2019-11-01 17:09:57.633822976,2019-11-01 17:09:57.633802446,7866452,T,IEX,134.990000,100
2019-11-01 17:12:14.992478976,2019-11-01 17:12:14.992451649,7921159,T,IEX,134.975000,100
2019-11-01 17:13:05.875899904,2019-11-01 17:13:05.875878229,7942039,T,IEX,134.975000,200
2019-11-01 17:13:06.785927936,2019-11-01 17:13:06.785905509,7942712,T,IEX,134.980000,37
2019-11-01 17:13:06.786150912,2019-11-01 17:13:06.786133870,7942721,T,IEX,134.980000,63
2019-11-01 17:13:06.786163968,2019-11-01 17:13:06.786147219,7942722,T,IEX,134.980000,1
2019-11-01 17:13:07.665796096,2019-11-01 17:13:07.665778444,7943926,T,IEX,134.990000,100
2019-11-01 17:13:15.20600064,2019-11-01 17:13:15.20583921,7947828,T,IEX,134.980000,100
2019-11-01 17:13:15.20972032,2019-11-01 17:13:15.20953261,7947846,T,IEX,134.980000,2
2019-11-01 17:13:15.22097920,2019-11-01 17:13:15.22078821,7947867,T,IEX,134.990000,100
2019-11-01 17:13:15.297398016,2019-11-01 17:13:15.297380935,7948546,T,IEX,134.970000,100
2019-11-01 17:13:15.297413888,2019-11-01 17:13:15.297396677,7948547,T,IEX,134.970000,1
2019-11-01 17:13:20.718707968,2019-11-01 17:13:20.718688573,7950953,T,IEX,134.980000,100
2019-11-01 17:15:44.703076096,2019-11-01 17:15:44.703056107,8017303,T,IEX,135.010000,100
2019-11-01 17:16:10.374777088,2019-11-01 17:16:10.374756238,8030532,T,IEX,135.000000,100
2019-11-01 17:16:30.23414016,2019-11-01 17:16:30.23398164,8039848,T,IEX,135.010000,74
2019-11-01 17:17:54.607049984,2019-11-01 17:17:54.607032283,8074969,T,IEX,135.005000,1
2019-11-01 17:19:26.260899072,2019-11-01 17:19:26.260880939,8112714,T,IEX,134.960000,100
2019-11-01 17:19:26.260918016,2019-11-01 17:19:26.260900811,8112715,T,IEX,134.960000,1
2019-11-01 17:19:51.580677888,2019-11-01 17:19:51.580657572,8122937,T,IEX,134.980000,38
2019-11-01 17:20:07.164166912,2019-11-01 17:20:07.164145341,8132133,T,IEX,134.980000,62
2019-11-01 17:20:25.586907904,2019-11-01 17:20:25.586888572,8142054,T,IEX,135.000000,23
2019-11-01 17:20:25.588147968,2019-11-01 17:20:25.588130616,8142056,T,IEX,135.000000,77
2019-11-01 17:23:13.339003904,2019-11-01 17:23:13.338986250,8210898,T,IEX,134.975000,200
2019-11-01 17:23:39.571741952,2019-11-01 17:23:39.571714522,8220281,T,IEX,134.960000,100
2019-11-01 17:26:28.837876992,2019-11-01 17:26:28.837859799,8278827,T,IEX,135.010000,1
2019-11-01 17:26:28.840466944,2019-11-01 17:26:28.840450917,8278830,T,IEX,135.020000,56
2019-11-01 17:27:53.519419904,2019-11-01 17:27:53.519402876,8306476,T,IEX,134.990000,200
2019-11-01 17:28:07.965155072,2019-11-01 17:28:07.965133845,8311281,T,IEX,134.980000,100
2019-11-01 17:28:23.794831104,2019-11-01 17:28:23.794813101,8317864,T,IEX,134.990000,1
2019-11-01 17:29:01.66063872,2019-11-01 17:29:01.66044131,8333759,T,IEX,134.970000,1
2019-11-01 17:30:07.119600128,2019-11-01 17:30:07.119583120,8366035,T,IEX,134.985000,107
2019-11-01 17:32:11.746024960,2019-11-01 17:32:11.746005644,8409183,T,IEX,135.030000,100
2019-11-01 17:32:12.249050112,2019-11-01 17:32:12.249030274,8409281,T,IEX,135.035000,1
2019-11-01 17:32:16.518340096,2019-11-01 17:32:16.518321897,8410289,T,IEX,135.040000,100
2019-11-01 17:34:52.669957120,2019-11-01 17:34:52.669940524,8470026,T,IEX,135.150000,1
2019-11-01 17:39:56.811633920,2019-11-01 17:39:56.811613888,8585024,T,IEX,135.190000,1
2019-11-01 17:41:58.606000128,2019-11-01 17:41:58.605983005,8626569,T,IEX,135.175000,1
2019-11-01 17:43:55.368946944,2019-11-01 17:43:55.368928140,8663008,T,IEX,135.200000,1
2019-11-01 17:43:55.827136000,2019-11-01 17:43:55.827118541,8663070,T,IEX,135.210000,200
2019-11-01 17:44:53.276130048,2019-11-01 17:44:53.276109983,8680220,T,IEX,135.260000,1
2019-11-01 17:44:58.58887936,2019-11-01 17:44:58.58869519,8681813,T,IEX,135.260000,50
2019-11-01 17:47:32.27812096,2019-11-01 17:47:32.27791843,8744195,T,IEX,135.320000,44
2019-11-01 17:47:38.649401088,2019-11-01 17:47:38.649385611,8747764,T,IEX,135.315000,3
2019-11-01 17:51:33.913158912,2019-11-01 17:51:33.913139928,8833545,T,IEX,135.350000,2
2019-11-01 17:54:39.689213952,2019-11-01 17:54:39.689194873,8905805,T,IEX,135.290000,4
2019-11-01 17:56:01.173673984,2019-11-01 17:56:01.173654816,8933794,T,IEX,135.280000,28
2019-11-01 17:58:14.531438080,2019-11-01 17:58:14.531418079,8983765,T,IEX,135.280000,2
2019-11-01 17:58:17.197132032,2019-11-01 17:58:17.197114220,8984782,T,IEX,135.290000,13
2019-11-01 17:59:49.694594048,2019-11-01 17:59:49.694578286,9015472,T,IEX,135.310000,1
2019-11-01 18:00:00.367449088,2019-11-01 18:00:00.367433325,9020812,T,IEX,135.330000,1
2019-11-01 18:00:06.593388032,2019-11-01 18:00:06.593369711,9024147,T,IEX,135.350000,1
2019-11-01 18:00:21.643559936,2019-11-01 18:00:21.643537090,9030987,T,IEX,135.355000,1
2019-11-01 18:01:21.675112960,2019-11-01 18:01:21.675097032,9058528,T,IEX,135.355000,1
2019-11-01 18:03:05.918484992,2019-11-01 18:03:05.918465721,9101415,T,IEX,135.350000,100
2019-11-01 18:03:33.810816000,2019-11-01 18:03:33.810797246,9119315,T,IEX,135.335000,1
2019-11-01 18:03:33.818877952,2019-11-01 18:03:33.818859082,9119319,T,IEX,135.335000,4
2019-11-01 18:03:49.902518016,2019-11-01 18:03:49.902497609,9126372,T,IEX,135.355000,1
2019-11-01 18:04:17.478593024,2019-11-01 18:04:17.478572423,9138257,T,IEX,135.375000,1
2019-11-01 18:05:05.923744000,2019-11-01 18:05:05.923724471,9156400,T,IEX,135.385000,2
2019-11-01 18:05:27.763066880,2019-11-01 18:05:27.763051591,9167138,T,IEX,135.385000,2
2019-11-01 18:05:42.860169984,2019-11-01 18:05:42.860149826,9174359,T,IEX,135.380000,1
2019-11-01 18:05:47.7589888,2019-11-01 18:05:47.7574633,9175643,T,IEX,135.390000,4
2019-11-01 18:05:47.44416000,2019-11-01 18:05:47.44394860,9175654,T,IEX,135.390000,50
2019-11-01 18:05:48.914366976,2019-11-01 18:05:48.914347171,9176150,T,IEX,135.390000,1
2019-11-01 18:05:53.914264064,2019-11-01 18:05:53.914246916,9178246,T,IEX,135.380000,1
2019-11-01 18:06:04.926972928,2019-11-01 18:06:04.926952813,9184005,T,IEX,135.380000,53
2019-11-01 18:06:06.205902080,2019-11-01 18:06:06.205883665,9185592,T,IEX,135.385000,1
2019-11-01 18:06:46.51674880,2019-11-01 18:06:46.51656000,9203453,T,IEX,135.380000,1
2019-11-01 18:07:36.376476928,2019-11-01 18:07:36.376454486,9221209,T,IEX,135.380000,1
2019-11-01 18:07:36.376487936,2019-11-01 18:07:36.376469525,9221210,T,IEX,135.380000,58
2019-11-01 18:09:07.490298112,2019-11-01 18:09:07.490278984,9254986,T,IEX,135.380000,2
2019-11-01 18:09:07.490316032,2019-11-01 18:09:07.490299083,9254987,T,IEX,135.380000,1
2019-11-01 18:10:01.4801024,2019-11-01 18:10:01.4783133,9273157,T,IEX,135.390000,100
2019-11-01 18:11:52.904135936,2019-11-01 18:11:52.904116722,9320725,T,IEX,135.375000,4
2019-11-01 18:11:59.457406976,2019-11-01 18:11:59.457391401,9322752,T,IEX,135.370000,2
2019-11-01 18:12:07.902009088,2019-11-01 18:12:07.901991297,9325606,T,IEX,135.370000,1
2019-11-01 18:12:54.389830912,2019-11-01 18:12:54.389813319,9342217,T,IEX,135.355000,1
2019-11-01 18:13:30.150029056,2019-11-01 18:13:30.150011420,9355464,T,IEX,135.335000,1
2019-11-01 18:14:00.483002880,2019-11-01 18:14:00.482983599,9367652,T,IEX,135.370000,100
2019-11-01 18:14:02.51560960,2019-11-01 18:14:02.51545850,9368581,T,IEX,135.355000,1
2019-11-01 18:14:06.660218112,2019-11-01 18:14:06.660196778,9371046,T,IEX,135.355000,1
2019-11-01 18:15:07.708268032,2019-11-01 18:15:07.708246537,9397856,T,IEX,135.385000,1
2019-11-01 18:15:39.208082944,2019-11-01 18:15:39.208065525,9409273,T,IEX,135.385000,1
2019-11-01 18:17:01.308662016,2019-11-01 18:17:01.308644492,9440790,T,IEX,135.380000,1
2019-11-01 18:17:12.691043072,2019-11-01 18:17:12.691023368,9445336,T,IEX,135.370000,1
2019-11-01 18:17:27.698913024,2019-11-01 18:17:27.698892238,9452320,T,IEX,135.360000,1
2019-11-01 18:20:09.435738112,2019-11-01 18:20:09.435717887,9518935,T,IEX,135.400000,100
2019-11-01 18:20:11.49069056,2019-11-01 18:20:11.49049766,9519484,T,IEX,135.410000,13
2019-11-01 18:20:34.264889088,2019-11-01 18:20:34.264870193,9527436,T,IEX,135.435000,100
2019-11-01 18:20:58.555407104,2019-11-01 18:20:58.555388737,9536427,T,IEX,135.450000,100
2019-11-01 18:21:00.764879104,2019-11-01 18:21:00.764860645,9537845,T,IEX,135.450000,18
2019-11-01 18:22:16.831971072,2019-11-01 18:22:16.831951595,9567593,T,IEX,135.470000,3
2019-11-01 18:22:44.848948992,2019-11-01 18:22:44.848927579,9579521,T,IEX,135.500000,100
2019-11-01 18:22:59.650727936,2019-11-01 18:22:59.650707067,9587096,T,IEX,135.480000,1
2019-11-01 18:23:06.204000000,2019-11-01 18:23:06.203980248,9590616,T,IEX,135.500000,100
2019-11-01 18:23:07.4275968,2019-11-01 18:23:07.4256887,9591521,T,IEX,135.490000,1
2019-11-01 18:23:07.105754880,2019-11-01 18:23:07.105736016,9591710,T,IEX,135.500000,100
2019-11-01 18:23:17.94622976,2019-11-01 18:23:17.94604018,9597649,T,IEX,135.490000,1
2019-11-01 18:23:44.142873088,2019-11-01 18:23:44.142857522,9609242,T,IEX,135.475000,1
2019-11-01 18:23:59.142834944,2019-11-01 18:23:59.142816481,9617379,T,IEX,135.465000,1
2019-11-01 18:25:50.172979968,2019-11-01 18:25:50.172962160,9677523,T,IEX,135.435000,1
2019-11-01 18:27:44.605003008,2019-11-01 18:27:44.604983507,9733335,T,IEX,135.480000,3
2019-11-01 18:27:46.764567040,2019-11-01 18:27:46.764551088,9735859,T,IEX,135.480000,3
2019-11-01 18:28:38.546113024,2019-11-01 18:28:38.546094273,9758589,T,IEX,135.470000,1
2019-11-01 18:28:48.618615040,2019-11-01 18:28:48.618596122,9764794,T,IEX,135.480000,1
2019-11-01 18:29:02.54496000,2019-11-01 18:29:02.54477991,9771522,T,IEX,135.460000,2
2019-11-01 18:29:02.73558016,2019-11-01 18:29:02.73541473,9771530,T,IEX,135.460000,1
2019-11-01 18:29:35.594177024,2019-11-01 18:29:35.594156474,9786516,T,IEX,135.420000,2
2019-11-01 18:29:51.557145088,2019-11-01 18:29:51.557126160,9792837,T,IEX,135.440000,1
2019-11-01 18:30:42.761438976,2019-11-01 18:30:42.761423948,9818118,T,IEX,135.410000,166
2019-11-01 18:31:02.927443968,2019-11-01 18:31:02.927426690,9826899,T,IEX,135.410000,1
2019-11-01 18:35:14.854227968,2019-11-01 18:35:14.854210502,9930730,T,IEX,135.420000,5
2019-11-01 18:36:03.596955904,2019-11-01 18:36:03.596935531,9948946,T,IEX,135.410000,100
2019-11-01 18:37:02.841615104,2019-11-01 18:37:02.841597809,9969124,T,IEX,135.395000,100
2019-11-01 18:40:17.205193984,2019-11-01 18:40:17.205176641,10041981,T,IEX,135.390000,200
2019-11-01 18:40:17.208738048,2019-11-01 18:40:17.208718357,10042016,T,IEX,135.390000,22
2019-11-01 18:40:36.819936000,2019-11-01 18:40:36.819919124,10049583,T,IEX,135.395000,2
2019-11-01 18:42:06.188854016,2019-11-01 18:42:06.188836177,10080214,T,IEX,135.390000,3
2019-11-01 18:42:38.762267904,2019-11-01 18:42:38.762250573,10090168,T,IEX,135.390000,2
2019-11-01 18:43:38.570809088,2019-11-01 18:43:38.570791553,10110713,T,IEX,135.400000,1
2019-11-01 18:43:38.579173888,2019-11-01 18:43:38.579153007,10110714,T,IEX,135.400000,2
2019-11-01 18:48:42.30264064,2019-11-01 18:48:42.30247714,10211259,T,IEX,135.380000,7
2019-11-01 18:48:42.39123968,2019-11-01 18:48:42.39106375,10211262,T,IEX,135.380000,1
2019-11-01 18:48:49.727137024,2019-11-01 18:48:49.727119544,10213641,T,IEX,135.380000,100
2019-11-01 18:49:18.33006080,2019-11-01 18:49:18.32988277,10223144,T,IEX,135.370000,1
2019-11-01 18:50:10.204603904,2019-11-01 18:50:10.204584955,10241040,T,IEX,135.390000,1
2019-11-01 18:50:14.525490944,2019-11-01 18:50:14.525470923,10243817,T,IEX,135.370000,1
2019-11-01 18:51:12.29698048,2019-11-01 18:51:12.29683026,10264646,T,IEX,135.400000,1
2019-11-01 18:51:29.610917888,2019-11-01 18:51:29.610899564,10270882,T,IEX,135.405000,100
2019-11-01 18:51:41.26163968,2019-11-01 18:51:41.26145581,10273803,T,IEX,135.410000,100
2019-11-01 18:51:44.290033920,2019-11-01 18:51:44.290013627,10274775,T,IEX,135.400000,2
2019-11-01 18:51:47.472020992,2019-11-01 18:51:47.472004682,10276238,T,IEX,135.405000,100
2019-11-01 18:54:09.432057088,2019-11-01 18:54:09.432037919,10325984,T,IEX,135.380000,100
2019-11-01 18:54:21.21464064,2019-11-01 18:54:21.21445170,10331576,T,IEX,135.380000,100
2019-11-01 18:54:58.28459008,2019-11-01 18:54:58.28444224,10344471,T,IEX,135.380000,45
2019-11-01 18:55:16.902220032,2019-11-01 18:55:16.902201681,10351907,T,IEX,135.390000,100
2019-11-01 18:55:47.886832128,2019-11-01 18:55:47.886811612,10366661,T,IEX,135.395000,2
2019-11-01 18:56:08.890454016,2019-11-01 18:56:08.890436058,10373863,T,IEX,135.390000,100
2019-11-01 18:56:08.891431936,2019-11-01 18:56:08.891416753,10373866,T,IEX,135.390000,90
2019-11-01 18:57:09.382757888,2019-11-01 18:57:09.382740091,10397277,T,IEX,135.400000,100
2019-11-01 19:00:58.488643072,2019-11-01 19:00:58.488622663,10486796,T,IEX,135.440000,100
2019-11-01 19:03:29.816553984,2019-11-01 19:03:29.816532215,10543970,T,IEX,135.405000,100
2019-11-01 19:05:17.990540032,2019-11-01 19:05:17.990520123,10580652,T,IEX,135.400000,294
2019-11-01 19:06:57.169600000,2019-11-01 19:06:57.169581819,10612457,T,IEX,135.370000,11
2019-11-01 19:07:26.136696064,2019-11-01 19:07:26.136680357,10621189,T,IEX,135.390000,15
2019-11-01 19:08:57.108948992,2019-11-01 19:08:57.108932239,10649454,T,IEX,135.350000,2
2019-11-01 19:08:57.108965120,2019-11-01 19:08:57.108950347,10649455,T,IEX,135.350000,66
2019-11-01 19:09:07.889984000,2019-11-01 19:09:07.889963602,10652580,T,IEX,135.360000,1
2019-11-01 19:09:24.673204992,2019-11-01 19:09:24.673187362,10657686,T,IEX,135.340000,5
2019-11-01 19:09:24.674298112,2019-11-01 19:09:24.674278887,10657687,T,IEX,135.340000,100
2019-11-01 19:09:24.675212032,2019-11-01 19:09:24.675194325,10657688,T,IEX,135.340000,100
2019-11-01 19:10:39.905158912,2019-11-01 19:10:39.905142299,10680286,T,IEX,135.290000,100
2019-11-01 19:12:11.192886016,2019-11-01 19:12:11.192865950,10713184,T,IEX,135.310000,200
2019-11-01 19:12:11.761859072,2019-11-01 19:12:11.761841590,10713377,T,IEX,135.310000,300
2019-11-01 19:12:12.262524928,2019-11-01 19:12:12.262509518,10713791,T,IEX,135.310000,400
2019-11-01 19:13:11.245562880,2019-11-01 19:13:11.245544052,10732221,T,IEX,135.280000,1
2019-11-01 19:13:21.128401920,2019-11-01 19:13:21.128382083,10735299,T,IEX,135.290000,10
2019-11-01 19:13:52.889658112,2019-11-01 19:13:52.889639943,10749483,T,IEX,135.290000,3
2019-11-01 19:14:16.964768000,2019-11-01 19:14:16.964749891,10759693,T,IEX,135.290000,2
2019-11-01 19:14:45.244157952,2019-11-01 19:14:45.244139956,10770824,T,IEX,135.290000,1
2019-11-01 19:15:00.244195072,2019-11-01 19:15:00.244175378,10777989,T,IEX,135.290000,1
2019-11-01 19:16:08.990222080,2019-11-01 19:16:08.990203803,10813825,T,IEX,135.295000,1
2019-11-01 19:16:15.163667968,2019-11-01 19:16:15.163648227,10816456,T,IEX,135.310000,3
2019-11-01 19:16:23.327816960,2019-11-01 19:16:23.327797284,10820285,T,IEX,135.310000,2
2019-11-01 19:16:51.363700992,2019-11-01 19:16:51.363680794,10831812,T,IEX,135.295000,1
2019-11-01 19:16:59.444225024,2019-11-01 19:16:59.444207128,10835214,T,IEX,135.300000,100
2019-11-01 19:17:03.19915008,2019-11-01 19:17:03.19893751,10836409,T,IEX,135.300000,1
2019-11-01 19:17:06.363511040,2019-11-01 19:17:06.363488040,10837811,T,IEX,135.310000,1
2019-11-01 19:17:13.526938880,2019-11-01 19:17:13.526921394,10841292,T,IEX,135.310000,100
2019-11-01 19:18:06.663790080,2019-11-01 19:18:06.663771005,10861788,T,IEX,135.315000,1
2019-11-01 19:18:21.663543040,2019-11-01 19:18:21.663521845,10867622,T,IEX,135.315000,1
2019-11-01 19:18:41.78251008,2019-11-01 19:18:41.78231734,10874008,T,IEX,135.310000,1
2019-11-01 19:18:41.78268928,2019-11-01 19:18:41.78251566,10874009,T,IEX,135.310000,1
2019-11-01 19:19:33.429821952,2019-11-01 19:19:33.429804077,10894808,T,IEX,135.310000,3
2019-11-01 19:19:33.506008064,2019-11-01 19:19:33.505988439,10895168,T,IEX,135.315000,2
2019-11-01 19:19:37.92679936,2019-11-01 19:19:37.92661445,10897129,T,IEX,135.315000,1
2019-11-01 19:20:17.619704064,2019-11-01 19:20:17.619686315,10911057,T,IEX,135.290000,1
2019-11-01 19:20:18.19482880,2019-11-01 19:20:18.19461000,10911221,T,IEX,135.290000,5
2019-11-01 19:22:55.848498944,2019-11-01 19:22:55.848481836,10981882,T,IEX,135.210000,100
2019-11-01 19:23:16.397199872,2019-11-01 19:23:16.397181994,10990227,T,IEX,135.195000,2
2019-11-01 19:23:32.327532032,2019-11-01 19:23:32.327511423,10996265,T,IEX,135.185000,2
2019-11-01 19:23:39.866107904,2019-11-01 19:23:39.866088512,11000730,T,IEX,135.190000,6
2019-11-01 19:23:39.866124032,2019-11-01 19:23:39.866106556,11000731,T,IEX,135.190000,1
2019-11-01 19:23:46.405271040,2019-11-01 19:23:46.405250828,11002882,T,IEX,135.190000,2
2019-11-01 19:23:46.405281024,2019-11-01 19:23:46.405263633,11002883,T,IEX,135.190000,298
2019-11-01 19:23:52.761271040,2019-11-01 19:23:52.761238997,11004951,T,IEX,135.210000,100
2019-11-01 19:24:17.315227904,2019-11-01 19:24:17.315205259,11016474,T,IEX,135.195000,1
2019-11-01 19:25:07.35995904,2019-11-01 19:25:07.35981117,11042743,T,IEX,135.145000,1
2019-11-01 19:25:20.492873984,2019-11-01 19:25:20.492853345,11049135,T,IEX,135.145000,4
2019-11-01 19:25:35.870696960,2019-11-01 19:25:35.870677742,11054223,T,IEX,135.145000,1
2019-11-01 19:25:45.331653888,2019-11-01 19:25:45.331633952,11059196,T,IEX,135.155000,1
2019-11-01 19:25:45.961300992,2019-11-01 19:25:45.961285382,11059537,T,IEX,135.150000,100
2019-11-01 19:25:52.112560128,2019-11-01 19:25:52.112543599,11062992,T,IEX,135.160000,1
2019-11-01 19:26:11.671047936,2019-11-01 19:26:11.671030140,11074455,T,IEX,135.195000,2
2019-11-01 19:27:06.894467072,2019-11-01 19:27:06.894451229,11099111,T,IEX,135.190000,49
2019-11-01 19:27:06.895769088,2019-11-01 19:27:06.895750690,11099114,T,IEX,135.190000,50
2019-11-01 19:27:06.895785984,2019-11-01 19:27:06.895768583,11099115,T,IEX,135.190000,4
2019-11-01 19:27:17.162620928,2019-11-01 19:27:17.162602316,11104945,T,IEX,135.200000,1
2019-11-01 19:28:08.116566016,2019-11-01 19:28:08.116545343,11125298,T,IEX,135.225000,1
2019-11-01 19:28:08.116580096,2019-11-01 19:28:08.116564868,11125299,T,IEX,135.225000,2
2019-11-01 19:28:27.781307904,2019-11-01 19:28:27.781290063,11135316,T,IEX,135.240000,1
2019-11-01 19:28:38.573986048,2019-11-01 19:28:38.573965567,11140567,T,IEX,135.240000,2
2019-11-01 19:28:40.732654080,2019-11-01 19:28:40.732635348,11141197,T,IEX,135.240000,1
2019-11-01 19:30:42.173778944,2019-11-01 19:30:42.173759134,11203498,T,IEX,135.230000,1
2019-11-01 19:31:19.107915008,2019-11-01 19:31:19.107895376,11224545,T,IEX,135.240000,1
2019-11-01 19:31:19.120157952,2019-11-01 19:31:19.120140972,11224553,T,IEX,135.250000,99
2019-11-01 19:31:36.430407936,2019-11-01 19:31:36.430388486,11235147,T,IEX,135.220000,8
2019-11-01 19:34:37.145726976,2019-11-01 19:34:37.145706875,11319926,T,IEX,135.300000,1
2019-11-01 19:35:07.895986944,2019-11-01 19:35:07.895968812,11334820,T,IEX,135.305000,100
2019-11-01 19:35:57.353657088,2019-11-01 19:35:57.353636960,11364644,T,IEX,135.350000,2
2019-11-01 19:36:28.175149056,2019-11-01 19:36:28.175130729,11381880,T,IEX,135.345000,216
2019-11-01 19:37:03.117654016,2019-11-01 19:37:03.117633187,11399620,T,IEX,135.340000,100
2019-11-01 19:37:41.886126080,2019-11-01 19:37:41.886105971,11419654,T,IEX,135.355000,100
2019-11-01 19:37:41.886140928,2019-11-01 19:37:41.886124795,11419655,T,IEX,135.355000,5
2019-11-01 19:37:59.959569920,2019-11-01 19:37:59.959552917,11427331,T,IEX,135.345000,200
2019-11-01 19:38:16.651076096,2019-11-01 19:38:16.651058587,11436407,T,IEX,135.355000,100
2019-11-01 19:38:16.651092992,2019-11-01 19:38:16.651076500,11436408,T,IEX,135.355000,143
2019-11-01 19:38:17.843270912,2019-11-01 19:38:17.843251109,11436878,T,IEX,135.355000,201
2019-11-01 19:38:42.874364928,2019-11-01 19:38:42.874349760,11448413,T,IEX,135.355000,100
2019-11-01 19:38:58.980364032,2019-11-01 19:38:58.980345197,11456089,T,IEX,135.355000,100
2019-11-01 19:39:02.600824064,2019-11-01 19:39:02.600803133,11458302,T,IEX,135.350000,7
2019-11-01 19:39:21.35474944,2019-11-01 19:39:21.35455773,11469095,T,IEX,135.340000,2
2019-11-01 19:39:21.35488000,2019-11-01 19:39:21.35471655,11469096,T,IEX,135.340000,2
2019-11-01 19:39:21.89401088,2019-11-01 19:39:21.89379783,11469124,T,IEX,135.330000,1
2019-11-01 19:39:21.89413888,2019-11-01 19:39:21.89398039,11469125,T,IEX,135.330000,2
2019-11-01 19:39:52.696048896,2019-11-01 19:39:52.696030323,11484781,T,IEX,135.365000,100
2019-11-01 19:40:36.563051008,2019-11-01 19:40:36.563031307,11506172,T,IEX,135.365000,100
2019-11-01 19:41:14.656327936,2019-11-01 19:41:14.656309670,11524931,T,IEX,135.365000,200
2019-11-01 19:41:16.285058048,2019-11-01 19:41:16.285039889,11526628,T,IEX,135.385000,100
2019-11-01 19:41:25.965285888,2019-11-01 19:41:25.965267741,11533153,T,IEX,135.390000,100
2019-11-01 19:41:40.989358080,2019-11-01 19:41:40.989341104,11547040,T,IEX,135.375000,100
2019-11-01 19:42:18.731442944,2019-11-01 19:42:18.731423428,11566087,T,IEX,135.400000,100
2019-11-01 19:42:49.66259968,2019-11-01 19:42:49.66243664,11583082,T,IEX,135.405000,100
2019-11-01 19:42:50.511177984,2019-11-01 19:42:50.511158465,11583605,T,IEX,135.405000,25
2019-11-01 19:42:51.36066048,2019-11-01 19:42:51.36049913,11583776,T,IEX,135.405000,100
2019-11-01 19:42:56.684631040,2019-11-01 19:42:56.684610394,11586445,T,IEX,135.400000,198
2019-11-01 19:43:10.722317056,2019-11-01 19:43:10.722298228,11594990,T,IEX,135.390000,100
2019-11-01 19:43:24.153225984,2019-11-01 19:43:24.153206511,11600473,T,IEX,135.395000,300
2019-11-01 19:43:49.856592896,2019-11-01 19:43:49.856571796,11613724,T,IEX,135.380000,2
2019-11-01 19:45:59.170134016,2019-11-01 19:45:59.170113177,11694628,T,IEX,135.350000,3
2019-11-01 19:46:20.864886016,2019-11-01 19:46:20.864868089,11708951,T,IEX,135.350000,9
2019-11-01 19:46:36.677698048,2019-11-01 19:46:36.677675979,11717801,T,IEX,135.345000,91
2019-11-01 19:46:38.673477888,2019-11-01 19:46:38.673460882,11719076,T,IEX,135.345000,100
2019-11-01 19:47:40.711549952,2019-11-01 19:47:40.711532691,11761369,T,IEX,135.310000,100
2019-11-01 19:47:40.808985088,2019-11-01 19:47:40.808965151,11761402,T,IEX,135.315000,400
2019-11-01 19:48:31.249684992,2019-11-01 19:48:31.249665744,11790838,T,IEX,135.280000,100
2019-11-01 19:49:12.97509120,2019-11-01 19:49:12.97489004,11818432,T,IEX,135.260000,100
2019-11-01 19:49:12.97526016,2019-11-01 19:49:12.97506983,11818434,T,IEX,135.250000,100
2019-11-01 19:49:12.102164992,2019-11-01 19:49:12.102147005,11818577,T,IEX,135.260000,100
2019-11-01 19:49:12.102188032,2019-11-01 19:49:12.102167809,11818579,T,IEX,135.250000,100
2019-11-01 19:49:15.126967040,2019-11-01 19:49:15.126948996,11824719,T,IEX,135.245000,100
2019-11-01 19:49:16.124143104,2019-11-01 19:49:16.124126260,11825476,T,IEX,135.265000,74
2019-11-01 19:49:22.807104000,2019-11-01 19:49:22.807085833,11830665,T,IEX,135.230000,3
2019-11-01 19:49:22.811678976,2019-11-01 19:49:22.811661466,11830670,T,IEX,135.220000,4
2019-11-01 19:49:32.110521088,2019-11-01 19:49:32.110503041,11837653,T,IEX,135.210000,100
2019-11-01 19:50:29.390415872,2019-11-01 19:50:29.390397801,11886909,T,IEX,135.265000,3
2019-11-01 19:50:31.938548992,2019-11-01 19:50:31.938532567,11888660,T,IEX,135.260000,100
2019-11-01 19:50:35.214654976,2019-11-01 19:50:35.214634676,11890599,T,IEX,135.265000,97
2019-11-01 19:50:53.206395904,2019-11-01 19:50:53.206379545,11904688,T,IEX,135.280000,2
2019-11-01 19:50:54.363731968,2019-11-01 19:50:54.363712128,11905574,T,IEX,135.275000,100
2019-11-01 19:50:54.392011008,2019-11-01 19:50:54.391992772,11905598,T,IEX,135.275000,100
2019-11-01 19:51:00.2160896,2019-11-01 19:51:00.2141402,11910633,T,IEX,135.280000,2
2019-11-01 19:51:31.658004992,2019-11-01 19:51:31.657989458,11934233,T,IEX,135.280000,200
2019-11-01 19:51:31.658507008,2019-11-01 19:51:31.658489277,11934235,T,IEX,135.275000,100
2019-11-01 19:51:31.659170048,2019-11-01 19:51:31.659152449,11934236,T,IEX,135.275000,100
2019-11-01 19:51:32.334353920,2019-11-01 19:51:32.334334659,11934702,T,IEX,135.270000,100
2019-11-01 19:51:34.322501120,2019-11-01 19:51:34.322482636,11937567,T,IEX,135.265000,100
2019-11-01 19:51:40.484624896,2019-11-01 19:51:40.484608268,11944218,T,IEX,135.235000,100
2019-11-01 19:51:41.85329920,2019-11-01 19:51:41.85313628,11946096,T,IEX,135.245000,100
2019-11-01 19:51:45.780623872,2019-11-01 19:51:45.780605877,11951338,T,IEX,135.240000,100
2019-11-01 19:51:59.766839040,2019-11-01 19:51:59.766819655,11962123,T,IEX,135.245000,100
2019-11-01 19:52:06.773752064,2019-11-01 19:52:06.773733988,11967948,T,IEX,135.245000,100
2019-11-01 19:52:12.375473920,2019-11-01 19:52:12.375455389,11972570,T,IEX,135.255000,3
2019-11-01 19:52:15.285787904,2019-11-01 19:52:15.285768540,11975563,T,IEX,135.255000,100
2019-11-01 19:52:26.247672064,2019-11-01 19:52:26.247652534,11983173,T,IEX,135.255000,100
2019-11-01 19:52:26.349894912,2019-11-01 19:52:26.349875087,11983199,T,IEX,135.255000,100
2019-11-01 19:52:29.423898112,2019-11-01 19:52:29.423880404,11985071,T,IEX,135.250000,184
2019-11-01 19:52:38.915689984,2019-11-01 19:52:38.915673270,11992003,T,IEX,135.255000,100
2019-11-01 19:52:38.949000960,2019-11-01 19:52:38.948979857,11992023,T,IEX,135.255000,100
2019-11-01 19:52:49.920061952,2019-11-01 19:52:49.920041476,12000110,T,IEX,135.255000,100
2019-11-01 19:52:59.528027904,2019-11-01 19:52:59.528008541,12007590,T,IEX,135.265000,100
2019-11-01 19:53:05.780873984,2019-11-01 19:53:05.780855161,12013040,T,IEX,135.255000,100
2019-11-01 19:53:06.104275968,2019-11-01 19:53:06.104255629,12013323,T,IEX,135.255000,100
2019-11-01 19:53:24.824880128,2019-11-01 19:53:24.824858318,12025951,T,IEX,135.265000,100
2019-11-01 19:53:32.39165952,2019-11-01 19:53:32.39145946,12030502,T,IEX,135.265000,116
2019-11-01 19:53:33.657359104,2019-11-01 19:53:33.657340382,12031578,T,IEX,135.265000,100
2019-11-01 19:53:34.858513920,2019-11-01 19:53:34.858495194,12032443,T,IEX,135.265000,300
2019-11-01 19:53:39.848033024,2019-11-01 19:53:39.848011728,12035753,T,IEX,135.265000,2
2019-11-01 19:53:40.692756992,2019-11-01 19:53:40.692739525,12036248,T,IEX,135.265000,100
2019-11-01 19:53:40.701623040,2019-11-01 19:53:40.701602614,12036252,T,IEX,135.265000,104
2019-11-01 19:53:40.906878976,2019-11-01 19:53:40.906859666,12036443,T,IEX,135.265000,100
2019-11-01 19:53:44.132805120,2019-11-01 19:53:44.132786071,12038426,T,IEX,135.265000,100
2019-11-01 19:53:53.35877120,2019-11-01 19:53:53.35857664,12044265,T,IEX,135.265000,100
2019-11-01 19:53:56.562055936,2019-11-01 19:53:56.562039809,12047056,T,IEX,135.265000,100
2019-11-01 19:54:01.378334976,2019-11-01 19:54:01.378319229,12052231,T,IEX,135.265000,100
2019-11-01 19:54:01.520220928,2019-11-01 19:54:01.520203625,12052310,T,IEX,135.265000,200
2019-11-01 19:54:02.930163968,2019-11-01 19:54:02.930131507,12053640,T,IEX,135.260000,100
2019-11-01 19:54:02.930884096,2019-11-01 19:54:02.930864859,12053675,T,IEX,135.260000,2
2019-11-01 19:54:02.930899968,2019-11-01 19:54:02.930884151,12053676,T,IEX,135.260000,2
2019-11-01 19:54:02.932873984,2019-11-01 19:54:02.932855033,12053747,T,IEX,135.260000,100
2019-11-01 19:54:03.91299072,2019-11-01 19:54:03.91283086,12054411,T,IEX,135.260000,100
2019-11-01 19:54:03.565758976,2019-11-01 19:54:03.565734940,12054925,T,IEX,135.255000,100
2019-11-01 19:54:03.592713984,2019-11-01 19:54:03.592693674,12054955,T,IEX,135.255000,100
2019-11-01 19:54:03.683843072,2019-11-01 19:54:03.683824180,12055005,T,IEX,135.255000,100
2019-11-01 19:54:10.278290944,2019-11-01 19:54:10.278271389,12060107,T,IEX,135.255000,100
2019-11-01 19:54:12.422199040,2019-11-01 19:54:12.422178758,12061740,T,IEX,135.255000,128
2019-11-01 19:54:14.713586944,2019-11-01 19:54:14.713571535,12063471,T,IEX,135.255000,100
2019-11-01 19:54:14.717914880,2019-11-01 19:54:14.717897098,12063477,T,IEX,135.255000,700
2019-11-01 19:54:14.781904896,2019-11-01 19:54:14.781887087,12063525,T,IEX,135.255000,1300
2019-11-01 19:54:14.789723904,2019-11-01 19:54:14.789704025,12063530,T,IEX,135.265000,100
2019-11-01 19:54:18.586208000,2019-11-01 19:54:18.586190649,12066808,T,IEX,135.265000,100
2019-11-01 19:54:21.635902976,2019-11-01 19:54:21.635885825,12069458,T,IEX,135.265000,1000
2019-11-01 19:54:23.340759040,2019-11-01 19:54:23.340737488,12071465,T,IEX,135.265000,100
2019-11-01 19:54:33.819977984,2019-11-01 19:54:33.819955174,12080906,T,IEX,135.295000,1
2019-11-01 19:54:49.247577088,2019-11-01 19:54:49.247559241,12098604,T,IEX,135.345000,302
2019-11-01 19:55:00.213295104,2019-11-01 19:55:00.213276133,12117253,T,IEX,135.455000,34
2019-11-01 19:55:02.964984064,2019-11-01 19:55:02.964965695,12126745,T,IEX,135.415000,100
2019-11-01 19:55:05.864218880,2019-11-01 19:55:05.864200859,12132348,T,IEX,135.420000,100
2019-11-01 19:55:10.41083904,2019-11-01 19:55:10.41065329,12141056,T,IEX,135.415000,100
2019-11-01 19:55:13.628333056,2019-11-01 19:55:13.628313144,12146856,T,IEX,135.425000,106
2019-11-01 19:55:22.205090048,2019-11-01 19:55:22.205072163,12157321,T,IEX,135.415000,100
2019-11-01 19:55:24.430656000,2019-11-01 19:55:24.430638006,12159468,T,IEX,135.415000,100
2019-11-01 19:55:39.30957056,2019-11-01 19:55:39.30938976,12174254,T,IEX,135.415000,101
2019-11-01 19:55:51.469847040,2019-11-01 19:55:51.469828289,12189826,T,IEX,135.425000,208
2019-11-01 19:55:52.301369088,2019-11-01 19:55:52.301350131,12190576,T,IEX,135.425000,100
2019-11-01 19:55:54.16737024,2019-11-01 19:55:54.16718693,12192073,T,IEX,135.430000,4
2019-11-01 19:55:59.225646080,2019-11-01 19:55:59.225627419,12197086,T,IEX,135.420000,100
2019-11-01 19:56:01.426290944,2019-11-01 19:56:01.426275486,12200583,T,IEX,135.415000,200
2019-11-01 19:56:01.435732992,2019-11-01 19:56:01.435706859,12200601,T,IEX,135.415000,100
2019-11-01 19:56:09.47592960,2019-11-01 19:56:09.47576758,12210107,T,IEX,135.460000,4
2019-11-01 19:56:09.282296064,2019-11-01 19:56:09.282276245,12210474,T,IEX,135.445000,100
2019-11-01 19:56:11.826134016,2019-11-01 19:56:11.826116019,12213672,T,IEX,135.445000,100
2019-11-01 19:56:12.451235072,2019-11-01 19:56:12.451216586,12214334,T,IEX,135.445000,100
2019-11-01 19:56:13.626129920,2019-11-01 19:56:13.626110982,12216037,T,IEX,135.445000,100
2019-11-01 19:56:13.901262080,2019-11-01 19:56:13.901244497,12216357,T,IEX,135.445000,100
2019-11-01 19:56:27.100389120,2019-11-01 19:56:27.100371199,12229561,T,IEX,135.435000,2
2019-11-01 19:56:27.100407040,2019-11-01 19:56:27.100390693,12229562,T,IEX,135.435000,3
2019-11-01 19:56:27.954563072,2019-11-01 19:56:27.954543703,12230566,T,IEX,135.435000,2
2019-11-01 19:56:28.172451072,2019-11-01 19:56:28.172436006,12230794,T,IEX,135.435000,100
2019-11-01 19:56:30.905235968,2019-11-01 19:56:30.905218376,12233806,T,IEX,135.430000,100
2019-11-01 19:56:35.936249088,2019-11-01 19:56:35.936228454,12238673,T,IEX,135.440000,2
2019-11-01 19:56:50.707652096,2019-11-01 19:56:50.707636104,12254745,T,IEX,135.435000,100
2019-11-01 19:56:53.49609984,2019-11-01 19:56:53.49591705,12257572,T,IEX,135.430000,100
2019-11-01 19:56:53.50455040,2019-11-01 19:56:53.50434962,12257592,T,IEX,135.430000,10
2019-11-01 19:56:53.50477056,2019-11-01 19:56:53.50457845,12257593,T,IEX,135.430000,1
2019-11-01 19:56:53.997243904,2019-11-01 19:56:53.997224237,12258953,T,IEX,135.420000,13
2019-11-01 19:56:54.637768960,2019-11-01 19:56:54.637746857,12259705,T,IEX,135.405000,100
2019-11-01 19:56:56.322823936,2019-11-01 19:56:56.322805273,12263090,T,IEX,135.405000,100
2019-11-01 19:56:57.10703872,2019-11-01 19:56:57.10685299,12263692,T,IEX,135.410000,1
2019-11-01 19:56:57.601394944,2019-11-01 19:56:57.601375967,12264347,T,IEX,135.405000,100
2019-11-01 19:56:58.302868992,2019-11-01 19:56:58.302850047,12265785,T,IEX,135.395000,2
2019-11-01 19:57:01.492116992,2019-11-01 19:57:01.492100590,12272677,T,IEX,135.405000,100
2019-11-01 19:57:01.492776960,2019-11-01 19:57:01.492757797,12272678,T,IEX,135.405000,100
2019-11-01 19:57:01.492992000,2019-11-01 19:57:01.492972891,12272679,T,IEX,135.405000,100
2019-11-01 19:57:07.601254912,2019-11-01 19:57:07.601237575,12283293,T,IEX,135.410000,100
2019-11-01 19:57:09.464975872,2019-11-01 19:57:09.464960057,12286013,T,IEX,135.430000,1
2019-11-01 19:57:12.43791104,2019-11-01 19:57:12.43772263,12289569,T,IEX,135.430000,100
2019-11-01 19:57:16.815620096,2019-11-01 19:57:16.815601492,12295292,T,IEX,135.445000,1
2019-11-01 19:57:27.601059072,2019-11-01 19:57:27.601040584,12305973,T,IEX,135.425000,5
2019-11-01 19:57:27.601078016,2019-11-01 19:57:27.601060862,12305974,T,IEX,135.425000,46
2019-11-01 19:57:30.441419008,2019-11-01 19:57:30.441403801,12309285,T,IEX,135.435000,100
2019-11-01 19:57:38.911254016,2019-11-01 19:57:38.911233024,12318861,T,IEX,135.425000,105
2019-11-01 19:57:44.18816000,2019-11-01 19:57:44.18794664,12324463,T,IEX,135.400000,4
2019-11-01 19:57:51.55035904,2019-11-01 19:57:51.55015520,12332131,T,IEX,135.395000,100
2019-11-01 19:57:56.50428928,2019-11-01 19:57:56.50411140,12338760,T,IEX,135.395000,113
2019-11-01 19:57:56.50438912,2019-11-01 19:57:56.50420594,12338761,T,IEX,135.395000,87
2019-11-01 19:58:03.973218048,2019-11-01 19:58:03.973201464,12352381,T,IEX,135.385000,100
2019-11-01 19:58:07.525276928,2019-11-01 19:58:07.525261679,12357632,T,IEX,135.385000,100
2019-11-01 19:58:14.822337024,2019-11-01 19:58:14.822319377,12368406,T,IEX,135.390000,92
2019-11-01 19:58:18.497641984,2019-11-01 19:58:18.497626095,12372599,T,IEX,135.380000,3
2019-11-01 19:58:18.497686016,2019-11-01 19:58:18.497668508,12372600,T,IEX,135.380000,79
2019-11-01 19:58:18.497739008,2019-11-01 19:58:18.497720489,12372601,T,IEX,135.380000,2
2019-11-01 19:58:28.258767104,2019-11-01 19:58:28.258748912,12387132,T,IEX,135.385000,100
2019-11-01 19:58:31.20343040,2019-11-01 19:58:31.20326995,12392481,T,IEX,135.380000,30
2019-11-01 19:58:53.938350080,2019-11-01 19:58:53.938332114,12422688,T,IEX,135.375000,100
2019-11-01 19:59:02.283744000,2019-11-01 19:59:02.283722542,12436636,T,IEX,135.400000,100
2019-11-01 19:59:02.316413952,2019-11-01 19:59:02.316398396,12436892,T,IEX,135.420000,16
2019-11-01 19:59:04.508366080,2019-11-01 19:59:04.508347781,12442078,T,IEX,135.455000,100
2019-11-01 19:59:04.508378880,2019-11-01 19:59:04.508362214,12442079,T,IEX,135.455000,100
2019-11-01 19:59:04.519529984,2019-11-01 19:59:04.519515478,12442174,T,IEX,135.450000,100
2019-11-01 19:59:09.928145920,2019-11-01 19:59:09.928129168,12454033,T,IEX,135.490000,63
2019-11-01 19:59:27.848185088,2019-11-01 19:59:27.848168913,12484121,T,IEX,135.480000,100
2019-11-01 19:59:27.848672000,2019-11-01 19:59:27.848653119,12484123,T,IEX,135.470000,100
2019-11-01 19:59:28.851036928,2019-11-01 19:59:28.851020315,12485682,T,IEX,135.470000,100
2019-11-01 19:59:37.904651008,2019-11-01 19:59:37.904635588,12532941,T,IEX,135.490000,100
2019-11-01 19:59:58.61309952,2019-11-01 19:59:58.61293700,12658625,T,IEX,135.560000,60
