2019-10-08 12:06:10.139590912,2019-10-08 12:06:10.139540836,28957,T,IEX,145.510000,10
2019-10-08 12:08:50.351107072,2019-10-08 12:08:50.351061413,29889,T,IEX,145.450000,400
2019-10-08 12:08:54.356221952,2019-10-08 12:08:54.356175505,29898,T,IEX,145.450000,500
2019-10-08 12:33:40.537657088,2019-10-08 12:33:40.537617485,40059,T,IEX,145.680000,100
2019-10-08 12:44:33.563339008,2019-10-08 12:44:33.563296181,44912,T,IEX,145.490000,100
2019-10-08 13:06:12.68675072,2019-10-08 13:06:12.68634874,57904,T,IEX,145.670000,100
2019-10-08 13:07:17.992364032,2019-10-08 13:07:17.992324614,58843,T,IEX,145.590000,100
2019-10-08 13:30:06.848581120,2019-10-08 13:30:06.848556875,112183,T,IEX,145.890000,1
2019-10-08 13:30:06.921944064,2019-10-08 13:30:06.921917976,112412,T,IEX,145.890000,100
2019-10-08 13:30:20.675151872,2019-10-08 13:30:20.675124364,135873,T,IEX,145.860000,35
2019-10-08 13:30:52.287706880,2019-10-08 13:30:52.287683657,176360,T,IEX,145.860000,56
2019-10-08 13:32:32.158108928,2019-10-08 13:32:32.158085818,299582,T,IEX,145.830000,100
2019-10-08 13:33:26.670526976,2019-10-08 13:33:26.670505314,367073,T,IEX,145.750000,100
2019-10-08 13:34:54.714551040,2019-10-08 13:34:54.714532607,470135,T,IEX,145.760000,100
2019-10-08 13:35:01.17804032,2019-10-08 13:35:01.17785511,478410,T,IEX,145.780000,116
2019-10-08 13:35:01.141872128,2019-10-08 13:35:01.141854443,478766,T,IEX,145.780000,434
2019-10-08 13:35:29.291873024,2019-10-08 13:35:29.291856163,513375,T,IEX,145.750000,35
2019-10-08 13:36:58.668365056,2019-10-08 13:36:58.668350209,616332,T,IEX,145.830000,100
2019-10-08 13:37:03.48348928,2019-10-08 13:37:03.48331127,621952,T,IEX,145.835000,200
2019-10-08 13:37:03.50309888,2019-10-08 13:37:03.50295005,621956,T,IEX,145.835000,200
2019-10-08 13:37:15.38067968,2019-10-08 13:37:15.38050860,635302,T,IEX,145.865000,400
2019-10-08 13:37:15.313859072,2019-10-08 13:37:15.313844537,635545,T,IEX,145.865000,100
2019-10-08 13:37:15.321782016,2019-10-08 13:37:15.321763285,635557,T,IEX,145.880000,100
2019-10-08 13:37:15.321859072,2019-10-08 13:37:15.321841025,635559,T,IEX,145.880000,400
2019-10-08 13:38:12.772772096,2019-10-08 13:38:12.772754902,701479,T,IEX,145.800000,100
2019-10-08 13:38:13.343945984,2019-10-08 13:38:13.343930523,702574,T,IEX,145.800000,100
2019-10-08 13:38:16.511153920,2019-10-08 13:38:16.511135652,706846,T,IEX,145.760000,85
2019-10-08 13:38:18.38297088,2019-10-08 13:38:18.38279504,708325,T,IEX,145.740000,1
2019-10-08 13:38:19.731343872,2019-10-08 13:38:19.731328587,710638,T,IEX,145.735000,300
2019-10-08 13:38:31.578070016,2019-10-08 13:38:31.578052979,721337,T,IEX,145.770000,100
2019-10-08 13:38:37.776890112,2019-10-08 13:38:37.776875091,726011,T,IEX,145.780000,100
2019-10-08 13:38:37.789462016,2019-10-08 13:38:37.789445652,726036,T,IEX,145.780000,36
2019-10-08 13:39:18.516375040,2019-10-08 13:39:18.516356997,765181,T,IEX,145.810000,18
2019-10-08 13:39:18.516428032,2019-10-08 13:39:18.516406192,765184,T,IEX,145.810000,100
2019-10-08 13:39:18.516457984,2019-10-08 13:39:18.516441014,765186,T,IEX,145.810000,282
2019-10-08 13:39:20.74518016,2019-10-08 13:39:20.74499566,767977,T,IEX,145.805000,300
2019-10-08 13:39:21.33148928,2019-10-08 13:39:21.33129482,768747,T,IEX,145.805000,900
2019-10-08 13:39:24.910227968,2019-10-08 13:39:24.910210245,772409,T,IEX,145.820000,52
2019-10-08 13:40:25.131380992,2019-10-08 13:40:25.131361990,845963,T,IEX,145.850000,1000
2019-10-08 13:40:33.543912960,2019-10-08 13:40:33.543894579,856809,T,IEX,145.845000,1000
2019-10-08 13:40:48.177317888,2019-10-08 13:40:48.177302841,871404,T,IEX,145.800000,22
2019-10-08 13:41:08.371310080,2019-10-08 13:41:08.371294415,892123,T,IEX,145.785000,300
2019-10-08 13:41:08.371336960,2019-10-08 13:41:08.371322512,892124,T,IEX,145.785000,5400
2019-10-08 13:41:14.888346880,2019-10-08 13:41:14.888327510,900232,T,IEX,145.750000,100
2019-10-08 13:41:27.806558976,2019-10-08 13:41:27.806540626,915657,T,IEX,145.735000,54
2019-10-08 13:41:27.816614912,2019-10-08 13:41:27.816596835,915663,T,IEX,145.735000,124
2019-10-08 13:41:52.803102976,2019-10-08 13:41:52.803086014,940834,T,IEX,145.700000,100
2019-10-08 13:42:34.558030080,2019-10-08 13:42:34.558015297,987048,T,IEX,145.710000,100
2019-10-08 13:44:50.416864000,2019-10-08 13:44:50.416846816,1112488,T,IEX,145.700000,100
2019-10-08 13:44:50.416889088,2019-10-08 13:44:50.416872951,1112489,T,IEX,145.700000,1000
2019-10-08 13:44:50.679895040,2019-10-08 13:44:50.679874602,1112658,T,IEX,145.700000,100
2019-10-08 13:45:00.218888960,2019-10-08 13:45:00.218867652,1123316,T,IEX,145.720000,1300
2019-10-08 13:45:00.219956992,2019-10-08 13:45:00.219933536,1123342,T,IEX,145.720000,100
2019-10-08 13:45:00.221126912,2019-10-08 13:45:00.221107531,1123355,T,IEX,145.720000,270
2019-10-08 13:45:03.992666112,2019-10-08 13:45:03.992645841,1130834,T,IEX,145.720000,1100
2019-10-08 13:45:07.256772096,2019-10-08 13:45:07.256755749,1134641,T,IEX,145.690000,500
2019-10-08 13:45:07.373337088,2019-10-08 13:45:07.373321073,1135154,T,IEX,145.680000,500
2019-10-08 13:45:07.426729984,2019-10-08 13:45:07.426710109,1135511,T,IEX,145.680000,500
2019-10-08 13:45:15.276881920,2019-10-08 13:45:15.276862731,1142198,T,IEX,145.640000,100
2019-10-08 13:45:16.379526912,2019-10-08 13:45:16.379511624,1143269,T,IEX,145.645000,200
2019-10-08 13:45:16.384920064,2019-10-08 13:45:16.384903378,1143273,T,IEX,145.645000,900
2019-10-08 13:45:16.387270912,2019-10-08 13:45:16.387251774,1143275,T,IEX,145.645000,1100
2019-10-08 13:45:16.388722944,2019-10-08 13:45:16.388703932,1143276,T,IEX,145.645000,300
2019-10-08 13:45:16.397915904,2019-10-08 13:45:16.397899347,1143281,T,IEX,145.645000,700
2019-10-08 13:45:17.827956992,2019-10-08 13:45:17.827931059,1144808,T,IEX,145.650000,700
2019-10-08 13:45:18.724687872,2019-10-08 13:45:18.724672578,1145715,T,IEX,145.650000,700
2019-10-08 13:45:19.714872064,2019-10-08 13:45:19.714853548,1147010,T,IEX,145.655000,1100
2019-10-08 13:45:20.630339072,2019-10-08 13:45:20.630321649,1148474,T,IEX,145.650000,200
2019-10-08 13:45:22.68361984,2019-10-08 13:45:22.68342355,1150109,T,IEX,145.665000,100
2019-10-08 13:45:24.131296000,2019-10-08 13:45:24.131279377,1152328,T,IEX,145.660000,100
2019-10-08 13:45:39.335355904,2019-10-08 13:45:39.335340629,1169370,T,IEX,145.620000,5
2019-10-08 13:45:39.441026048,2019-10-08 13:45:39.441009283,1169576,T,IEX,145.610000,100
2019-10-08 13:46:18.131172096,2019-10-08 13:46:18.131152626,1210199,T,IEX,145.605000,100
2019-10-08 13:46:54.494092032,2019-10-08 13:46:54.494074855,1249106,T,IEX,145.660000,100
2019-10-08 13:46:58.900276992,2019-10-08 13:46:58.900254012,1254069,T,IEX,145.650000,68
2019-10-08 13:47:00.615305984,2019-10-08 13:47:00.615290833,1255769,T,IEX,145.660000,100
2019-10-08 13:47:21.8891904,2019-10-08 13:47:21.8873748,1275875,T,IEX,145.620000,100
2019-10-08 13:47:50.16377088,2019-10-08 13:47:50.16361361,1297359,T,IEX,145.670000,100
2019-10-08 13:47:50.328918016,2019-10-08 13:47:50.328896485,1297676,T,IEX,145.640000,100
2019-10-08 13:48:01.189829888,2019-10-08 13:48:01.189813523,1309757,T,IEX,145.640000,100
2019-10-08 13:50:13.586769920,2019-10-08 13:50:13.586752631,1441924,T,IEX,145.680000,7
2019-10-08 13:51:01.768112896,2019-10-08 13:51:01.768096420,1508522,T,IEX,145.710000,100
2019-10-08 13:51:11.202868992,2019-10-08 13:51:11.202853776,1520189,T,IEX,145.720000,100
2019-10-08 13:51:16.966821120,2019-10-08 13:51:16.966800189,1525761,T,IEX,145.720000,72
2019-10-08 13:52:40.747689984,2019-10-08 13:52:40.747671398,1620785,T,IEX,145.700000,100
2019-10-08 13:53:33.482760960,2019-10-08 13:53:33.482742633,1677256,T,IEX,145.720000,100
2019-10-08 13:54:00.357256960,2019-10-08 13:54:00.357238923,1705515,T,IEX,145.740000,100
2019-10-08 13:54:20.29114880,2019-10-08 13:54:20.29097114,1727135,T,IEX,145.740000,100
2019-10-08 13:54:45.829607936,2019-10-08 13:54:45.829591189,1752648,T,IEX,145.740000,100
2019-10-08 13:55:21.302534912,2019-10-08 13:55:21.302517677,1796812,T,IEX,145.720000,100
2019-10-08 13:55:29.737423872,2019-10-08 13:55:29.737402683,1805507,T,IEX,145.740000,100
2019-10-08 13:57:29.894752000,2019-10-08 13:57:29.894732568,1941899,T,IEX,145.800000,100
2019-10-08 13:57:53.274834944,2019-10-08 13:57:53.274817305,1965800,T,IEX,145.800000,18
2019-10-08 13:58:15.921427968,2019-10-08 13:58:15.921407096,1989856,T,IEX,145.830000,100
2019-10-08 13:58:35.989526016,2019-10-08 13:58:35.989508123,2016930,T,IEX,145.810000,100
2019-10-08 13:59:01.472425984,2019-10-08 13:59:01.472404295,2044128,T,IEX,145.830000,900
2019-10-08 13:59:08.281427968,2019-10-08 13:59:08.281409087,2052015,T,IEX,145.830000,100
2019-10-08 13:59:08.281722880,2019-10-08 13:59:08.281704234,2052019,T,IEX,145.820000,1000
2019-10-08 13:59:08.834085888,2019-10-08 13:59:08.834068887,2052766,T,IEX,145.830000,152
2019-10-08 13:59:57.110577920,2019-10-08 13:59:57.110562279,2095335,T,IEX,145.800000,100
2019-10-08 14:01:06.757041920,2019-10-08 14:01:06.757026300,2190517,T,IEX,145.800000,100
2019-10-08 14:01:22.435305984,2019-10-08 14:01:22.435290965,2212860,T,IEX,145.740000,100
2019-10-08 14:01:33.147227904,2019-10-08 14:01:33.147211472,2225655,T,IEX,145.785000,300
2019-10-08 14:01:33.148069120,2019-10-08 14:01:33.148049729,2225657,T,IEX,145.785000,300
2019-10-08 14:01:33.148887040,2019-10-08 14:01:33.148867731,2225658,T,IEX,145.785000,118
2019-10-08 14:02:08.725528064,2019-10-08 14:02:08.725512303,2274972,T,IEX,145.790000,100
2019-10-08 14:02:12.877148928,2019-10-08 14:02:12.877131581,2282050,T,IEX,145.820000,100
2019-10-08 14:02:29.562288128,2019-10-08 14:02:29.562272928,2302972,T,IEX,145.825000,300
2019-10-08 14:02:45.104726016,2019-10-08 14:02:45.104708375,2321384,T,IEX,145.835000,300
2019-10-08 14:02:45.116228096,2019-10-08 14:02:45.116209661,2321398,T,IEX,145.840000,100
2019-10-08 14:02:46.315126016,2019-10-08 14:02:46.315109288,2322992,T,IEX,145.840000,100
2019-10-08 14:02:46.679280128,2019-10-08 14:02:46.679264172,2324782,T,IEX,145.840000,100
2019-10-08 14:02:58.656387072,2019-10-08 14:02:58.656370884,2339638,T,IEX,145.820000,100
2019-10-08 14:03:03.756100096,2019-10-08 14:03:03.756083757,2347055,T,IEX,145.800000,100
2019-10-08 14:03:51.294626048,2019-10-08 14:03:51.294608868,2408301,T,IEX,145.820000,100
2019-10-08 14:03:51.294941952,2019-10-08 14:03:51.294924300,2408307,T,IEX,145.820000,443
2019-10-08 14:04:04.326953984,2019-10-08 14:04:04.326937851,2431869,T,IEX,145.785000,300
2019-10-08 14:04:04.459346944,2019-10-08 14:04:04.459325649,2432410,T,IEX,145.775000,100
2019-10-08 14:04:04.468088064,2019-10-08 14:04:04.468070811,2432482,T,IEX,145.775000,100
2019-10-08 14:04:04.468123904,2019-10-08 14:04:04.468107561,2432484,T,IEX,145.775000,100
2019-10-08 14:04:04.468235008,2019-10-08 14:04:04.468217620,2432485,T,IEX,145.775000,100
2019-10-08 14:05:04.49252096,2019-10-08 14:05:04.49229334,2502085,T,IEX,145.775000,300
2019-10-08 14:05:17.136250112,2019-10-08 14:05:17.136233749,2523336,T,IEX,145.760000,7
2019-10-08 14:06:46.548154880,2019-10-08 14:06:46.548136190,2639747,T,IEX,145.860000,100
2019-10-08 14:07:09.732274944,2019-10-08 14:07:09.732249975,2671014,T,IEX,145.860000,100
2019-10-08 14:07:50.578555904,2019-10-08 14:07:50.578536616,2721802,T,IEX,145.840000,100
2019-10-08 14:07:57.607965952,2019-10-08 14:07:57.607948639,2730712,T,IEX,145.810000,100
2019-10-08 14:08:00.185897984,2019-10-08 14:08:00.185880384,2733783,T,IEX,145.835000,26
2019-10-08 14:08:04.358245888,2019-10-08 14:08:04.358229927,2737988,T,IEX,145.835000,74
2019-10-08 14:08:10.655255040,2019-10-08 14:08:10.655238663,2743735,T,IEX,145.830000,30
2019-10-08 14:08:49.785498112,2019-10-08 14:08:49.785479165,2781436,T,IEX,145.800000,100
2019-10-08 14:08:58.517830912,2019-10-08 14:08:58.517811413,2790315,T,IEX,145.800000,100
2019-10-08 14:09:35.76333056,2019-10-08 14:09:35.76316463,2832486,T,IEX,145.780000,100
2019-10-08 14:10:57.47122944,2019-10-08 14:10:57.47106287,2961319,T,IEX,145.780000,100
2019-10-08 14:10:58.965116928,2019-10-08 14:10:58.965094187,2964470,T,IEX,145.780000,100
2019-10-08 14:11:05.595382016,2019-10-08 14:11:05.595363159,2972798,T,IEX,145.780000,100
2019-10-08 14:11:35.90766080,2019-10-08 14:11:35.90747827,3012734,T,IEX,145.760000,91
2019-10-08 14:13:17.450342912,2019-10-08 14:13:17.450325937,3135381,T,IEX,145.650000,100
2019-10-08 14:14:15.956375040,2019-10-08 14:14:15.956356982,3199156,T,IEX,145.640000,100
2019-10-08 14:14:15.956388096,2019-10-08 14:14:15.956370078,3199157,T,IEX,145.640000,117
2019-10-08 14:14:27.25679872,2019-10-08 14:14:27.25661997,3209728,T,IEX,145.610000,100
2019-10-08 14:14:27.95872000,2019-10-08 14:14:27.95853683,3210089,T,IEX,145.610000,22
2019-10-08 14:15:02.889370880,2019-10-08 14:15:02.889354988,3250082,T,IEX,145.610000,100
2019-10-08 14:15:14.140275968,2019-10-08 14:15:14.140260035,3262518,T,IEX,145.620000,10
2019-10-08 14:15:15.570383872,2019-10-08 14:15:15.570366681,3264439,T,IEX,145.640000,100
2019-10-08 14:15:15.571735040,2019-10-08 14:15:15.571714139,3264443,T,IEX,145.640000,100
2019-10-08 14:15:15.573000960,2019-10-08 14:15:15.572982695,3264446,T,IEX,145.640000,100
2019-10-08 14:15:15.574315008,2019-10-08 14:15:15.574298785,3264449,T,IEX,145.640000,100
2019-10-08 14:15:15.575595008,2019-10-08 14:15:15.575579552,3264454,T,IEX,145.640000,100
2019-10-08 14:15:51.192941056,2019-10-08 14:15:51.192925132,3299772,T,IEX,145.640000,700
2019-10-08 14:15:51.192978944,2019-10-08 14:15:51.192961489,3299773,T,IEX,145.640000,100
2019-10-08 14:15:51.193252096,2019-10-08 14:15:51.193234671,3299779,T,IEX,145.640000,100
2019-10-08 14:15:51.194012928,2019-10-08 14:15:51.193995239,3299786,T,IEX,145.650000,1100
2019-10-08 14:16:05.592475904,2019-10-08 14:16:05.592458012,3314430,T,IEX,145.650000,100
2019-10-08 14:16:12.144115968,2019-10-08 14:16:12.144095787,3322539,T,IEX,145.670000,900
2019-10-08 14:16:13.62413056,2019-10-08 14:16:13.62397282,3323192,T,IEX,145.670000,300
2019-10-08 14:16:13.92397056,2019-10-08 14:16:13.92376923,3323216,T,IEX,145.670000,1000
2019-10-08 14:16:13.258683904,2019-10-08 14:16:13.258661624,3323380,T,IEX,145.670000,700
2019-10-08 14:16:13.612651008,2019-10-08 14:16:13.612634980,3323689,T,IEX,145.670000,500
2019-10-08 14:16:13.612665088,2019-10-08 14:16:13.612648084,3323690,T,IEX,145.670000,1000
2019-10-08 14:16:13.619811072,2019-10-08 14:16:13.619793191,3323707,T,IEX,145.675000,800
2019-10-08 14:16:13.631734016,2019-10-08 14:16:13.631714989,3323724,T,IEX,145.670000,2000
2019-10-08 14:16:13.632581888,2019-10-08 14:16:13.632566013,3323726,T,IEX,145.670000,200
2019-10-08 14:16:13.647731968,2019-10-08 14:16:13.647712077,3323735,T,IEX,145.670000,2000
2019-10-08 14:16:13.648583936,2019-10-08 14:16:13.648567791,3323737,T,IEX,145.670000,500
2019-10-08 14:16:13.679682048,2019-10-08 14:16:13.679663821,3323787,T,IEX,145.680000,100
2019-10-08 14:16:13.679689984,2019-10-08 14:16:13.679671849,3323788,T,IEX,145.680000,1400
2019-10-08 14:16:17.235250944,2019-10-08 14:16:17.235234286,3326416,T,IEX,145.680000,300
2019-10-08 14:16:17.235374080,2019-10-08 14:16:17.235357306,3326417,T,IEX,145.680000,100
2019-10-08 14:16:17.246362880,2019-10-08 14:16:17.246345147,3326438,T,IEX,145.685000,1600
2019-10-08 14:16:17.246832896,2019-10-08 14:16:17.246814546,3326439,T,IEX,145.680000,1475
2019-10-08 14:16:24.219074048,2019-10-08 14:16:24.219054910,3332623,T,IEX,145.700000,200
2019-10-08 14:16:24.230618112,2019-10-08 14:16:24.230599705,3332665,T,IEX,145.700000,100
2019-10-08 14:16:35.619240960,2019-10-08 14:16:35.619224241,3345551,T,IEX,145.700000,100
2019-10-08 14:17:02.44758016,2019-10-08 14:17:02.44739827,3368691,T,IEX,145.710000,100
2019-10-08 14:17:05.424982016,2019-10-08 14:17:05.424932444,3370663,T,IEX,145.720000,100
2019-10-08 14:17:46.674100992,2019-10-08 14:17:46.674081775,3407294,T,IEX,145.660000,100
2019-10-08 14:17:46.683104000,2019-10-08 14:17:46.683086497,3407388,T,IEX,145.670000,100
2019-10-08 14:18:18.169601024,2019-10-08 14:18:18.169584958,3437969,T,IEX,145.640000,100
2019-10-08 14:20:05.993735936,2019-10-08 14:20:05.993717966,3547852,T,IEX,145.670000,100
2019-10-08 14:21:17.175302912,2019-10-08 14:21:17.175279828,3607409,T,IEX,145.660000,100
2019-10-08 14:21:55.70320128,2019-10-08 14:21:55.70302859,3635471,T,IEX,145.680000,100
2019-10-08 14:22:36.189644032,2019-10-08 14:22:36.189626973,3676193,T,IEX,145.690000,206
2019-10-08 14:24:11.996806912,2019-10-08 14:24:11.996789846,3761069,T,IEX,145.670000,100
2019-10-08 14:24:32.541370112,2019-10-08 14:24:32.541351449,3779027,T,IEX,145.650000,100
2019-10-08 14:24:36.48295936,2019-10-08 14:24:36.48276149,3781890,T,IEX,145.680000,100
2019-10-08 14:26:02.356577024,2019-10-08 14:26:02.356561635,3861149,T,IEX,145.650000,1000
2019-10-08 14:27:36.933529088,2019-10-08 14:27:36.933509035,3942710,T,IEX,145.640000,100
2019-10-08 14:27:57.605090048,2019-10-08 14:27:57.605071100,3959249,T,IEX,145.680000,900
2019-10-08 14:28:31.766732032,2019-10-08 14:28:31.766712667,3983786,T,IEX,145.650000,68
2019-10-08 14:28:31.767130112,2019-10-08 14:28:31.767113092,3983787,T,IEX,145.650000,53
2019-10-08 14:28:31.767461888,2019-10-08 14:28:31.767446486,3983788,T,IEX,145.650000,9
2019-10-08 14:28:54.319734016,2019-10-08 14:28:54.319716185,4000406,T,IEX,145.740000,100
2019-10-08 14:30:33.429626112,2019-10-08 14:30:33.429609007,4102100,T,IEX,145.770000,100
2019-10-08 14:30:33.430170112,2019-10-08 14:30:33.430153447,4102105,T,IEX,145.770000,100
2019-10-08 14:30:58.131639040,2019-10-08 14:30:58.131623100,4148758,T,IEX,145.760000,100
2019-10-08 14:30:58.162813952,2019-10-08 14:30:58.162793618,4148819,T,IEX,145.750000,100
2019-10-08 14:30:59.750262016,2019-10-08 14:30:59.750246478,4151166,T,IEX,145.760000,100
2019-10-08 14:31:00.191132928,2019-10-08 14:31:00.191116492,4152576,T,IEX,145.760000,100
2019-10-08 14:31:01.16361984,2019-10-08 14:31:01.16344968,4155139,T,IEX,145.760000,100
2019-10-08 14:31:16.879450112,2019-10-08 14:31:16.879431348,4171060,T,IEX,145.780000,24
2019-10-08 14:31:40.887610880,2019-10-08 14:31:40.887588970,4193489,T,IEX,145.780000,100
2019-10-08 14:32:53.601392128,2019-10-08 14:32:53.601375305,4267064,T,IEX,145.820000,100
2019-10-08 14:33:07.449280000,2019-10-08 14:33:07.449263329,4285384,T,IEX,145.840000,100
2019-10-08 14:33:07.450396928,2019-10-08 14:33:07.450379552,4285402,T,IEX,145.840000,200
2019-10-08 14:35:07.426635008,2019-10-08 14:35:07.426615540,4410747,T,IEX,145.850000,100
2019-10-08 14:35:30.197317120,2019-10-08 14:35:30.197294806,4432807,T,IEX,145.930000,14
2019-10-08 14:35:38.905093120,2019-10-08 14:35:38.905075374,4440949,T,IEX,145.920000,136
2019-10-08 14:35:48.942949120,2019-10-08 14:35:48.942930966,4451625,T,IEX,145.900000,81
2019-10-08 14:36:14.815011072,2019-10-08 14:36:14.814993752,4475303,T,IEX,145.900000,100
2019-10-08 14:38:37.653487104,2019-10-08 14:38:37.653469710,4623360,T,IEX,145.880000,100
2019-10-08 14:38:48.370226944,2019-10-08 14:38:48.370211510,4631630,T,IEX,145.870000,100
2019-10-08 14:38:48.370315008,2019-10-08 14:38:48.370297601,4631631,T,IEX,145.870000,100
2019-10-08 14:40:04.866380032,2019-10-08 14:40:04.866365089,4705656,T,IEX,145.880000,100
2019-10-08 14:40:54.3768064,2019-10-08 14:40:54.3748807,4753981,T,IEX,145.830000,100
2019-10-08 14:41:01.79514880,2019-10-08 14:41:01.79494296,4758666,T,IEX,145.820000,100
2019-10-08 14:41:09.352047104,2019-10-08 14:41:09.352026888,4765832,T,IEX,145.800000,100
2019-10-08 14:41:12.292716032,2019-10-08 14:41:12.292697099,4768264,T,IEX,145.820000,9
2019-10-08 14:41:32.956096000,2019-10-08 14:41:32.956080867,4787018,T,IEX,145.810000,100
2019-10-08 14:41:32.958074880,2019-10-08 14:41:32.958055478,4787022,T,IEX,145.820000,100
2019-10-08 14:41:46.36450048,2019-10-08 14:41:46.36431654,4798670,T,IEX,145.840000,100
2019-10-08 14:42:53.854562048,2019-10-08 14:42:53.854542290,4846957,T,IEX,145.880000,100
2019-10-08 14:42:58.844023040,2019-10-08 14:42:58.844003862,4850337,T,IEX,145.890000,100
2019-10-08 14:43:27.658224128,2019-10-08 14:43:27.658209005,4877741,T,IEX,145.880000,100
2019-10-08 14:43:27.787622912,2019-10-08 14:43:27.787602308,4878044,T,IEX,145.860000,100
2019-10-08 14:43:49.873793024,2019-10-08 14:43:49.873775076,4898212,T,IEX,145.820000,1300
2019-10-08 14:43:49.880869120,2019-10-08 14:43:49.880848108,4898219,T,IEX,145.820000,100
2019-10-08 14:44:10.484433920,2019-10-08 14:44:10.484418432,4917054,T,IEX,145.880000,100
2019-10-08 14:45:47.255633920,2019-10-08 14:45:47.255618860,4996388,T,IEX,145.790000,100
2019-10-08 14:45:49.252805888,2019-10-08 14:45:49.252787629,4997857,T,IEX,145.800000,100
2019-10-08 14:46:02.569839104,2019-10-08 14:46:02.569818089,5008455,T,IEX,145.820000,100
2019-10-08 14:46:06.298708992,2019-10-08 14:46:06.298691374,5011727,T,IEX,145.820000,100
2019-10-08 14:46:21.955895040,2019-10-08 14:46:21.955876269,5022079,T,IEX,145.840000,100
2019-10-08 14:46:25.262231040,2019-10-08 14:46:25.262212298,5026150,T,IEX,145.840000,100
2019-10-08 14:46:26.193264128,2019-10-08 14:46:26.193248122,5026927,T,IEX,145.830000,100
2019-10-08 14:46:31.673328896,2019-10-08 14:46:31.673312439,5031844,T,IEX,145.820000,100
2019-10-08 14:46:35.568246016,2019-10-08 14:46:35.568228629,5034600,T,IEX,145.820000,100
2019-10-08 14:46:35.569088000,2019-10-08 14:46:35.569069703,5034605,T,IEX,145.820000,100
2019-10-08 14:46:51.790883072,2019-10-08 14:46:51.790864481,5045292,T,IEX,145.870000,100
2019-10-08 14:47:22.186137088,2019-10-08 14:47:22.186116436,5069219,T,IEX,145.850000,100
2019-10-08 14:48:27.869551104,2019-10-08 14:48:27.869533094,5135163,T,IEX,145.850000,100
2019-10-08 14:49:07.886169088,2019-10-08 14:49:07.886149685,5170738,T,IEX,145.825000,100
2019-10-08 14:50:14.505784064,2019-10-08 14:50:14.505765583,5221139,T,IEX,145.860000,1
2019-10-08 14:50:34.570050048,2019-10-08 14:50:34.570029796,5236642,T,IEX,145.860000,100
2019-10-08 14:50:35.341239040,2019-10-08 14:50:35.341220154,5237247,T,IEX,145.860000,100
2019-10-08 14:50:41.544243968,2019-10-08 14:50:41.544227420,5241369,T,IEX,145.870000,100
2019-10-08 14:50:48.918415872,2019-10-08 14:50:48.918401025,5246089,T,IEX,145.865000,100
2019-10-08 14:51:24.173308928,2019-10-08 14:51:24.173290363,5272497,T,IEX,145.900000,100
2019-10-08 14:51:41.475068928,2019-10-08 14:51:41.475053000,5281324,T,IEX,145.890000,100
2019-10-08 14:52:11.464252928,2019-10-08 14:52:11.464234692,5303953,T,IEX,145.880000,100
2019-10-08 14:52:11.929559040,2019-10-08 14:52:11.929542417,5304772,T,IEX,145.840000,100
2019-10-08 14:52:16.257964032,2019-10-08 14:52:16.257946274,5310625,T,IEX,145.840000,100
2019-10-08 14:52:33.967451904,2019-10-08 14:52:33.967436863,5325950,T,IEX,145.855000,100
2019-10-08 14:54:03.646874112,2019-10-08 14:54:03.646853329,5397459,T,IEX,145.890000,67
2019-10-08 14:54:17.399648000,2019-10-08 14:54:17.399632410,5408453,T,IEX,145.870000,100
2019-10-08 14:55:21.500741888,2019-10-08 14:55:21.500721502,5515905,T,IEX,145.640000,200
2019-10-08 14:55:25.34004992,2019-10-08 14:55:25.33986372,5534514,T,IEX,145.595000,200
2019-10-08 14:55:25.80935936,2019-10-08 14:55:25.80918429,5534958,T,IEX,145.620000,100
2019-10-08 14:55:25.362493952,2019-10-08 14:55:25.362474871,5536107,T,IEX,145.640000,100
2019-10-08 14:55:27.97118976,2019-10-08 14:55:27.97101030,5543827,T,IEX,145.675000,400
2019-10-08 14:55:29.950276096,2019-10-08 14:55:29.950257899,5549858,T,IEX,145.700000,100
2019-10-08 14:55:35.875811072,2019-10-08 14:55:35.875793356,5560676,T,IEX,145.720000,100
2019-10-08 14:55:42.883796992,2019-10-08 14:55:42.883779808,5575677,T,IEX,145.700000,100
2019-10-08 14:55:46.770251008,2019-10-08 14:55:46.770235801,5581864,T,IEX,145.680000,52
2019-10-08 14:56:01.154696960,2019-10-08 14:56:01.154678914,5609646,T,IEX,145.700000,100
2019-10-08 14:56:01.193811968,2019-10-08 14:56:01.193794478,5610101,T,IEX,145.710000,100
2019-10-08 14:56:03.277106944,2019-10-08 14:56:03.277089882,5617033,T,IEX,145.680000,100
2019-10-08 14:56:04.722396928,2019-10-08 14:56:04.722375226,5620144,T,IEX,145.700000,34
2019-10-08 14:56:33.299059968,2019-10-08 14:56:33.299041703,5666781,T,IEX,145.700000,100
2019-10-08 14:57:52.255444992,2019-10-08 14:57:52.255428402,5750544,T,IEX,145.710000,100
2019-10-08 14:57:52.269314048,2019-10-08 14:57:52.269295564,5750828,T,IEX,145.710000,100
2019-10-08 14:57:52.282247936,2019-10-08 14:57:52.282230992,5750923,T,IEX,145.710000,100
2019-10-08 14:58:51.488696064,2019-10-08 14:58:51.488677118,5815614,T,IEX,145.670000,7
2019-10-08 14:59:15.523579904,2019-10-08 14:59:15.523563525,5837693,T,IEX,145.670000,100
2019-10-08 15:00:17.712037888,2019-10-08 15:00:17.712018428,5891097,T,IEX,145.680000,100
2019-10-08 15:00:19.309899008,2019-10-08 15:00:19.309883053,5894400,T,IEX,145.700000,100
2019-10-08 15:00:38.667364096,2019-10-08 15:00:38.667344218,5915666,T,IEX,145.695000,100
2019-10-08 15:01:11.2427904,2019-10-08 15:01:11.2406636,5952988,T,IEX,145.700000,100
2019-10-08 15:02:26.843182080,2019-10-08 15:02:26.843162331,6024341,T,IEX,145.690000,100
2019-10-08 15:02:30.897893120,2019-10-08 15:02:30.897873496,6028495,T,IEX,145.720000,7
2019-10-08 15:03:03.388448000,2019-10-08 15:03:03.388426727,6052607,T,IEX,145.760000,100
2019-10-08 15:04:05.59446016,2019-10-08 15:04:05.59431775,6097255,T,IEX,145.720000,100
2019-10-08 15:04:08.337858048,2019-10-08 15:04:08.337839724,6101356,T,IEX,145.740000,98
2019-10-08 15:04:08.343365120,2019-10-08 15:04:08.343348913,6101387,T,IEX,145.740000,2
2019-10-08 15:04:18.199223040,2019-10-08 15:04:18.199207061,6107424,T,IEX,145.730000,100
2019-10-08 15:06:00.887521024,2019-10-08 15:06:00.887505010,6185608,T,IEX,145.685000,100
2019-10-08 15:06:43.57635072,2019-10-08 15:06:43.57618771,6216606,T,IEX,145.710000,100
2019-10-08 15:06:43.58484992,2019-10-08 15:06:43.58466523,6216612,T,IEX,145.710000,100
2019-10-08 15:07:10.265590016,2019-10-08 15:07:10.265570846,6232990,T,IEX,145.720000,100
2019-10-08 15:08:27.45483008,2019-10-08 15:08:27.45462340,6291236,T,IEX,145.760000,8
2019-10-08 15:08:47.793393920,2019-10-08 15:08:47.793378479,6305786,T,IEX,145.750000,126
2019-10-08 15:08:47.796328960,2019-10-08 15:08:47.796313173,6305795,T,IEX,145.750000,100
2019-10-08 15:08:56.853701888,2019-10-08 15:08:56.853684289,6311923,T,IEX,145.735000,10
2019-10-08 15:09:42.381754112,2019-10-08 15:09:42.381735930,6340863,T,IEX,145.740000,15
2019-10-08 15:10:08.824585984,2019-10-08 15:10:08.824569428,6358777,T,IEX,145.760000,100
2019-10-08 15:10:46.358715904,2019-10-08 15:10:46.358698192,6385271,T,IEX,145.750000,100
2019-10-08 15:11:09.426393088,2019-10-08 15:11:09.426370034,6399592,T,IEX,145.780000,100
2019-10-08 15:12:09.778682880,2019-10-08 15:12:09.778667752,6445174,T,IEX,145.720000,100
2019-10-08 15:12:23.656868096,2019-10-08 15:12:23.656850993,6455509,T,IEX,145.720000,83
2019-10-08 15:13:25.84894976,2019-10-08 15:13:25.84877342,6496810,T,IEX,145.710000,100
2019-10-08 15:13:44.829797888,2019-10-08 15:13:44.829780878,6508947,T,IEX,145.700000,100
2019-10-08 15:13:48.791878912,2019-10-08 15:13:48.791860023,6510820,T,IEX,145.710000,100
2019-10-08 15:13:48.801652992,2019-10-08 15:13:48.801635362,6510833,T,IEX,145.710000,100
2019-10-08 15:13:48.808950016,2019-10-08 15:13:48.808932736,6510870,T,IEX,145.710000,100
2019-10-08 15:13:50.560964096,2019-10-08 15:13:50.560946277,6512440,T,IEX,145.720000,100
2019-10-08 15:13:56.511333120,2019-10-08 15:13:56.511316245,6515466,T,IEX,145.730000,100
2019-10-08 15:13:56.573296896,2019-10-08 15:13:56.573278501,6515780,T,IEX,145.730000,100
2019-10-08 15:14:03.764519936,2019-10-08 15:14:03.764502607,6524932,T,IEX,145.740000,100
2019-10-08 15:14:17.530259968,2019-10-08 15:14:17.530245031,6536952,T,IEX,145.720000,100
2019-10-08 15:14:22.74690048,2019-10-08 15:14:22.74674778,6540443,T,IEX,145.730000,100
2019-10-08 15:14:25.243143936,2019-10-08 15:14:25.243125067,6542160,T,IEX,145.720000,100
2019-10-08 15:14:27.744032000,2019-10-08 15:14:27.744016224,6544289,T,IEX,145.720000,100
2019-10-08 15:15:53.736908032,2019-10-08 15:15:53.736891995,6609417,T,IEX,145.700000,100
2019-10-08 15:16:56.539354112,2019-10-08 15:16:56.539334780,6666209,T,IEX,145.670000,27
2019-10-08 15:17:33.649679872,2019-10-08 15:17:33.649662824,6701123,T,IEX,145.630000,100
2019-10-08 15:17:37.801036032,2019-10-08 15:17:37.801019629,6704254,T,IEX,145.630000,100
2019-10-08 15:17:38.480930048,2019-10-08 15:17:38.480914965,6704981,T,IEX,145.620000,100
2019-10-08 15:17:59.53178880,2019-10-08 15:17:59.53161790,6723818,T,IEX,145.630000,100
2019-10-08 15:17:59.66970880,2019-10-08 15:17:59.66954737,6723855,T,IEX,145.630000,100
2019-10-08 15:18:01.28841984,2019-10-08 15:18:01.28824678,6725979,T,IEX,145.650000,82
2019-10-08 15:18:10.910949120,2019-10-08 15:18:10.910931586,6735780,T,IEX,145.690000,100
2019-10-08 15:18:12.183270912,2019-10-08 15:18:12.183252795,6737220,T,IEX,145.700000,3
2019-10-08 15:18:36.617501952,2019-10-08 15:18:36.617485447,6757542,T,IEX,145.700000,100
2019-10-08 15:18:54.803011072,2019-10-08 15:18:54.802993560,6769303,T,IEX,145.690000,100
2019-10-08 15:19:05.96270080,2019-10-08 15:19:05.96251021,6775988,T,IEX,145.700000,100
2019-10-08 15:19:49.894016000,2019-10-08 15:19:49.893997454,6808440,T,IEX,145.680000,100
2019-10-08 15:20:26.56224000,2019-10-08 15:20:26.56204724,6838349,T,IEX,145.710000,100
2019-10-08 15:20:26.58635008,2019-10-08 15:20:26.58617991,6838356,T,IEX,145.705000,100
2019-10-08 15:20:37.776687104,2019-10-08 15:20:37.776665713,6847920,T,IEX,145.720000,100
2019-10-08 15:20:37.776696064,2019-10-08 15:20:37.776678709,6847921,T,IEX,145.720000,117
2019-10-08 15:20:43.951055872,2019-10-08 15:20:43.951036624,6853970,T,IEX,145.710000,22
2019-10-08 15:20:44.110491904,2019-10-08 15:20:44.110474100,6854149,T,IEX,145.720000,100
2019-10-08 15:20:45.152108032,2019-10-08 15:20:45.152090016,6856309,T,IEX,145.730000,100
2019-10-08 15:21:00.830834944,2019-10-08 15:21:00.830817871,6869025,T,IEX,145.700000,100
2019-10-08 15:21:39.732626944,2019-10-08 15:21:39.732611422,6907523,T,IEX,145.740000,100
2019-10-08 15:22:10.117693952,2019-10-08 15:22:10.117675675,6952755,T,IEX,145.735000,100
2019-10-08 15:22:12.889633024,2019-10-08 15:22:12.889615226,6955117,T,IEX,145.730000,100
2019-10-08 15:22:22.123561984,2019-10-08 15:22:22.123542032,6967252,T,IEX,145.770000,100
2019-10-08 15:22:35.221721088,2019-10-08 15:22:35.221699662,6977599,T,IEX,145.760000,100
2019-10-08 15:22:45.65696000,2019-10-08 15:22:45.65680642,6986839,T,IEX,145.750000,100
2019-10-08 15:22:45.65711104,2019-10-08 15:22:45.65693536,6986840,T,IEX,145.750000,50
2019-10-08 15:22:56.580915968,2019-10-08 15:22:56.580897506,6993943,T,IEX,145.750000,100
2019-10-08 15:23:08.697753088,2019-10-08 15:23:08.697734925,7005761,T,IEX,145.730000,100
2019-10-08 15:23:21.619584000,2019-10-08 15:23:21.619562826,7019057,T,IEX,145.720000,100
2019-10-08 15:23:21.619599872,2019-10-08 15:23:21.619582785,7019058,T,IEX,145.720000,700
2019-10-08 15:23:21.619612928,2019-10-08 15:23:21.619595917,7019059,T,IEX,145.720000,1000
2019-10-08 15:23:21.619632128,2019-10-08 15:23:21.619616871,7019060,T,IEX,145.720000,200
2019-10-08 15:23:21.621043968,2019-10-08 15:23:21.621026081,7019067,T,IEX,145.720000,100
2019-10-08 15:23:22.91269888,2019-10-08 15:23:22.91254156,7019326,T,IEX,145.720000,100
2019-10-08 15:23:22.93065984,2019-10-08 15:23:22.93047973,7019330,T,IEX,145.730000,100
2019-10-08 15:23:22.122454016,2019-10-08 15:23:22.122435820,7019339,T,IEX,145.740000,100
2019-10-08 15:23:22.122467072,2019-10-08 15:23:22.122450907,7019340,T,IEX,145.740000,1000
2019-10-08 15:23:22.126894080,2019-10-08 15:23:22.126876868,7019352,T,IEX,145.740000,1000
2019-10-08 15:23:26.573212928,2019-10-08 15:23:26.573197692,7023139,T,IEX,145.730000,100
2019-10-08 15:23:27.68182016,2019-10-08 15:23:27.68163063,7023700,T,IEX,145.720000,100
2019-10-08 15:23:33.611735040,2019-10-08 15:23:33.611713759,7028049,T,IEX,145.730000,100
2019-10-08 15:23:43.990444032,2019-10-08 15:23:43.990427841,7034706,T,IEX,145.720000,100
2019-10-08 15:23:55.129114880,2019-10-08 15:23:55.129098971,7042004,T,IEX,145.720000,100
2019-10-08 15:23:57.94928896,2019-10-08 15:23:57.94909873,7043566,T,IEX,145.730000,100
2019-10-08 15:24:16.1793024,2019-10-08 15:24:16.1774616,7056084,T,IEX,145.740000,100
2019-10-08 15:24:40.172434944,2019-10-08 15:24:40.172417374,7075961,T,IEX,145.740000,100
2019-10-08 15:24:40.203241984,2019-10-08 15:24:40.203223164,7076713,T,IEX,145.730000,100
2019-10-08 15:24:40.323012096,2019-10-08 15:24:40.322993756,7078026,T,IEX,145.740000,100
2019-10-08 15:24:41.76254976,2019-10-08 15:24:41.76237714,7079269,T,IEX,145.730000,100
2019-10-08 15:24:41.704345088,2019-10-08 15:24:41.704326937,7080272,T,IEX,145.730000,100
2019-10-08 15:24:52.931875072,2019-10-08 15:24:52.931857523,7090803,T,IEX,145.730000,100
2019-10-08 15:25:18.601766912,2019-10-08 15:25:18.601748874,7112079,T,IEX,145.720000,100
2019-10-08 15:25:24.109874944,2019-10-08 15:25:24.109857658,7114726,T,IEX,145.740000,100
2019-10-08 15:25:54.715290112,2019-10-08 15:25:54.715271328,7133796,T,IEX,145.735000,100
2019-10-08 15:25:58.427629056,2019-10-08 15:25:58.427608641,7139640,T,IEX,145.770000,100
2019-10-08 15:26:05.555121920,2019-10-08 15:26:05.555104174,7146093,T,IEX,145.800000,100
2019-10-08 15:26:08.521255936,2019-10-08 15:26:08.521240907,7147483,T,IEX,145.800000,100
2019-10-08 15:26:10.165317888,2019-10-08 15:26:10.165298969,7148492,T,IEX,145.780000,100
2019-10-08 15:26:10.172421888,2019-10-08 15:26:10.172406299,7148552,T,IEX,145.780000,100
2019-10-08 15:26:39.588985088,2019-10-08 15:26:39.588968820,7171828,T,IEX,145.760000,100
2019-10-08 15:28:06.145766912,2019-10-08 15:28:06.145749128,7228384,T,IEX,145.810000,100
2019-10-08 15:28:19.621332992,2019-10-08 15:28:19.621317322,7236899,T,IEX,145.800000,100
2019-10-08 15:28:33.803667968,2019-10-08 15:28:33.803652552,7249889,T,IEX,145.790000,100
2019-10-08 15:28:48.732472064,2019-10-08 15:28:48.732457141,7262480,T,IEX,145.780000,2
2019-10-08 15:29:00.737734912,2019-10-08 15:29:00.737717602,7276883,T,IEX,145.800000,100
2019-10-08 15:29:00.752109056,2019-10-08 15:29:00.752090443,7276947,T,IEX,145.810000,100
2019-10-08 15:30:02.35028992,2019-10-08 15:30:02.35010315,7324542,T,IEX,145.770000,100
2019-10-08 15:30:15.913899008,2019-10-08 15:30:15.913884158,7335276,T,IEX,145.760000,100
2019-10-08 15:30:17.354864128,2019-10-08 15:30:17.354845649,7336396,T,IEX,145.750000,100
2019-10-08 15:30:17.617105920,2019-10-08 15:30:17.617088498,7336596,T,IEX,145.760000,100
2019-10-08 15:31:04.572380928,2019-10-08 15:31:04.572365684,7369594,T,IEX,145.770000,100
2019-10-08 15:31:27.223713024,2019-10-08 15:31:27.223695296,7382944,T,IEX,145.780000,100
2019-10-08 15:31:43.288274944,2019-10-08 15:31:43.288257722,7392444,T,IEX,145.760000,100
2019-10-08 15:31:57.755854080,2019-10-08 15:31:57.755834974,7400384,T,IEX,145.760000,10
2019-10-08 15:33:10.136196096,2019-10-08 15:33:10.136175258,7468538,T,IEX,145.800000,100
2019-10-08 15:33:44.397253888,2019-10-08 15:33:44.397237172,7520390,T,IEX,145.785000,100
2019-10-08 15:33:44.397782016,2019-10-08 15:33:44.397763600,7520394,T,IEX,145.780000,14
2019-10-08 15:33:56.791390976,2019-10-08 15:33:56.791375197,7531924,T,IEX,145.765000,175
2019-10-08 15:35:53.868403968,2019-10-08 15:35:53.868384426,7640206,T,IEX,145.710000,100
2019-10-08 15:36:00.2586112,2019-10-08 15:36:00.2571426,7649262,T,IEX,145.720000,7
2019-10-08 15:36:36.508032000,2019-10-08 15:36:36.508014398,7674520,T,IEX,145.720000,267
2019-10-08 15:38:47.131654912,2019-10-08 15:38:47.131636640,7765984,T,IEX,145.710000,100
2019-10-08 15:39:16.295576064,2019-10-08 15:39:16.295558170,7784689,T,IEX,145.690000,100
2019-10-08 15:39:45.27109888,2019-10-08 15:39:45.27091611,7803648,T,IEX,145.680000,100
2019-10-08 15:39:45.33323008,2019-10-08 15:39:45.33307132,7803662,T,IEX,145.680000,100
2019-10-08 15:41:57.573251072,2019-10-08 15:41:57.573235168,7886330,T,IEX,145.710000,100
2019-10-08 15:42:51.142960128,2019-10-08 15:42:51.142940796,7917683,T,IEX,145.730000,100
2019-10-08 15:43:11.171462912,2019-10-08 15:43:11.171447179,7929406,T,IEX,145.660000,100
2019-10-08 15:43:36.898170112,2019-10-08 15:43:36.898148839,7942864,T,IEX,145.660000,100
2019-10-08 15:44:56.790507008,2019-10-08 15:44:56.790489645,7999732,T,IEX,145.620000,100
2019-10-08 15:45:07.312097024,2019-10-08 15:45:07.312080516,8010373,T,IEX,145.590000,15
2019-10-08 15:45:36.240978944,2019-10-08 15:45:36.240961260,8036744,T,IEX,145.600000,20
2019-10-08 15:46:01.849383936,2019-10-08 15:46:01.849366265,8056670,T,IEX,145.540000,100
2019-10-08 15:46:01.849392896,2019-10-08 15:46:01.849375722,8056671,T,IEX,145.540000,200
2019-10-08 15:46:04.559079936,2019-10-08 15:46:04.559064100,8059580,T,IEX,145.550000,300
2019-10-08 15:46:05.704472064,2019-10-08 15:46:05.704452527,8060994,T,IEX,145.550000,100
2019-10-08 15:46:05.848144896,2019-10-08 15:46:05.848127221,8061114,T,IEX,145.550000,100
2019-10-08 15:46:34.763206912,2019-10-08 15:46:34.763190207,8078300,T,IEX,145.565000,500
2019-10-08 15:46:37.937969920,2019-10-08 15:46:37.937947113,8080246,T,IEX,145.565000,500
2019-10-08 15:46:42.541925888,2019-10-08 15:46:42.541908801,8084151,T,IEX,145.570000,100
2019-10-08 15:47:05.737124096,2019-10-08 15:47:05.737105151,8097848,T,IEX,145.560000,100
2019-10-08 15:47:36.534775040,2019-10-08 15:47:36.534755899,8119629,T,IEX,145.530000,100
2019-10-08 15:48:16.661261056,2019-10-08 15:48:16.661243452,8143538,T,IEX,145.550000,100
2019-10-08 15:49:50.668952064,2019-10-08 15:49:50.668932620,8210511,T,IEX,145.580000,70
2019-10-08 15:50:00.368115968,2019-10-08 15:50:00.368096959,8215829,T,IEX,145.580000,15
2019-10-08 15:50:10.830988032,2019-10-08 15:50:10.830968299,8227068,T,IEX,145.580000,2
2019-10-08 15:50:23.23642880,2019-10-08 15:50:23.23622281,8236686,T,IEX,145.580000,100
2019-10-08 15:51:31.268847104,2019-10-08 15:51:31.268829464,8274549,T,IEX,145.590000,100
2019-10-08 15:51:56.944907008,2019-10-08 15:51:56.944889438,8294666,T,IEX,145.600000,100
2019-10-08 15:57:05.242302976,2019-10-08 15:57:05.242285132,8479525,T,IEX,145.610000,31
2019-10-08 15:58:28.242139904,2019-10-08 15:58:28.242120347,8529857,T,IEX,145.610000,5
2019-10-08 15:59:16.805647872,2019-10-08 15:59:16.805627907,8563951,T,IEX,145.625000,300
2019-10-08 15:59:24.838580992,2019-10-08 15:59:24.838564686,8567946,T,IEX,145.620000,300
2019-10-08 15:59:45.745310976,2019-10-08 15:59:45.745291384,8577925,T,IEX,145.620000,200
2019-10-08 15:59:49.878695936,2019-10-08 15:59:49.878677575,8580546,T,IEX,145.625000,100
2019-10-08 15:59:49.886061056,2019-10-08 15:59:49.886041539,8580547,T,IEX,145.620000,100
2019-10-08 16:00:07.259478016,2019-10-08 16:00:07.259460489,8593539,T,IEX,145.610000,100
2019-10-08 16:00:59.999705088,2019-10-08 16:00:59.999685980,8626406,T,IEX,145.650000,30
2019-10-08 16:03:46.664627968,2019-10-08 16:03:46.664611447,8711477,T,IEX,145.650000,100
2019-10-08 16:03:54.559662080,2019-10-08 16:03:54.559643655,8716157,T,IEX,145.670000,23
2019-10-08 16:04:12.987627008,2019-10-08 16:04:12.987609221,8728412,T,IEX,145.660000,47
2019-10-08 16:05:15.697250048,2019-10-08 16:05:15.697230062,8756826,T,IEX,145.670000,100
2019-10-08 16:05:20.392112128,2019-10-08 16:05:20.392090982,8759706,T,IEX,145.670000,20
2019-10-08 16:05:42.496083968,2019-10-08 16:05:42.496066791,8772077,T,IEX,145.650000,100
2019-10-08 16:06:16.84011008,2019-10-08 16:06:16.83992094,8791645,T,IEX,145.660000,100
2019-10-08 16:06:16.186266880,2019-10-08 16:06:16.186252076,8791748,T,IEX,145.660000,100
2019-10-08 16:06:16.469388032,2019-10-08 16:06:16.469372455,8791836,T,IEX,145.660000,100
2019-10-08 16:06:16.803753984,2019-10-08 16:06:16.803735640,8792126,T,IEX,145.660000,100
2019-10-08 16:06:28.395153920,2019-10-08 16:06:28.395135390,8798259,T,IEX,145.660000,100
2019-10-08 16:08:44.514784000,2019-10-08 16:08:44.514764406,8858491,T,IEX,145.650000,100
2019-10-08 16:14:01.555441920,2019-10-08 16:14:01.555423991,9011120,T,IEX,145.610000,9
2019-10-08 16:14:44.898460928,2019-10-08 16:14:44.898441183,9028040,T,IEX,145.600000,100
2019-10-08 16:14:59.234588928,2019-10-08 16:14:59.234572473,9035348,T,IEX,145.590000,100
2019-10-08 16:16:43.363713024,2019-10-08 16:16:43.363693202,9077640,T,IEX,145.590000,160
2019-10-08 16:18:04.235290880,2019-10-08 16:18:04.235275558,9115048,T,IEX,145.600000,100
2019-10-08 16:20:19.941466112,2019-10-08 16:20:19.941445099,9183453,T,IEX,145.540000,100
2019-10-08 16:22:55.391047936,2019-10-08 16:22:55.391029693,9273158,T,IEX,145.520000,100
2019-10-08 16:23:10.5419008,2019-10-08 16:23:10.5403428,9279488,T,IEX,145.500000,4
2019-10-08 16:26:55.988174080,2019-10-08 16:26:55.988156254,9385690,T,IEX,145.530000,100
2019-10-08 16:29:11.518804992,2019-10-08 16:29:11.518786064,9444006,T,IEX,145.500000,100
2019-10-08 16:29:12.306842880,2019-10-08 16:29:12.306826582,9444625,T,IEX,145.495000,100
2019-10-08 16:29:24.61401088,2019-10-08 16:29:24.61384358,9449330,T,IEX,145.510000,800
2019-10-08 16:29:53.214512896,2019-10-08 16:29:53.214496447,9464480,T,IEX,145.485000,300
2019-10-08 16:30:01.698651904,2019-10-08 16:30:01.698633996,9469822,T,IEX,145.480000,100
2019-10-08 16:30:12.563932928,2019-10-08 16:30:12.563914708,9477434,T,IEX,145.500000,25
2019-10-08 16:30:34.590771968,2019-10-08 16:30:34.590750930,9487714,T,IEX,145.500000,1
2019-10-08 16:30:56.869940992,2019-10-08 16:30:56.869924440,9497182,T,IEX,145.515000,300
2019-10-08 16:30:57.457216000,2019-10-08 16:30:57.457196271,9497319,T,IEX,145.500000,90
2019-10-08 16:32:40.824549888,2019-10-08 16:32:40.824532114,9536402,T,IEX,145.515000,100
2019-10-08 16:32:40.824676096,2019-10-08 16:32:40.824658473,9536404,T,IEX,145.515000,200
2019-10-08 16:32:40.991343104,2019-10-08 16:32:40.991323971,9536502,T,IEX,145.530000,100
2019-10-08 16:32:47.806358016,2019-10-08 16:32:47.806339291,9539092,T,IEX,145.520000,100
2019-10-08 16:35:24.288168960,2019-10-08 16:35:24.288150577,9602680,T,IEX,145.465000,300
2019-10-08 16:35:24.288188928,2019-10-08 16:35:24.288171407,9602681,T,IEX,145.470000,100
2019-10-08 16:38:07.413470976,2019-10-08 16:38:07.413452162,9662853,T,IEX,145.490000,100
2019-10-08 16:40:16.853193984,2019-10-08 16:40:16.853176386,9703645,T,IEX,145.440000,1000
2019-10-08 16:40:51.961542912,2019-10-08 16:40:51.961523164,9714626,T,IEX,145.440000,100
2019-10-08 16:41:04.141460992,2019-10-08 16:41:04.141445418,9721010,T,IEX,145.430000,100
2019-10-08 16:41:04.582551040,2019-10-08 16:41:04.582530716,9721135,T,IEX,145.435000,19
2019-10-08 16:42:11.568459008,2019-10-08 16:42:11.568440835,9744636,T,IEX,145.450000,100
2019-10-08 16:42:11.568482048,2019-10-08 16:42:11.568462833,9744637,T,IEX,145.460000,100
2019-10-08 16:42:11.569157888,2019-10-08 16:42:11.569138691,9744666,T,IEX,145.500000,500
2019-10-08 16:42:11.571143936,2019-10-08 16:42:11.571124363,9744734,T,IEX,145.435000,100
2019-10-08 16:42:11.571412992,2019-10-08 16:42:11.571388974,9744743,T,IEX,145.435000,100
2019-10-08 16:42:11.571441920,2019-10-08 16:42:11.571424723,9744745,T,IEX,145.435000,100
2019-10-08 16:42:11.587214080,2019-10-08 16:42:11.587196420,9744991,T,IEX,145.630000,100
2019-10-08 16:42:30.757605888,2019-10-08 16:42:30.757590005,9752136,T,IEX,145.565000,200
2019-10-08 16:42:30.759020032,2019-10-08 16:42:30.758999376,9752138,T,IEX,145.570000,100
2019-10-08 16:42:41.360346880,2019-10-08 16:42:41.360330704,9756403,T,IEX,145.560000,100
2019-10-08 16:44:32.279040000,2019-10-08 16:44:32.279022643,9797758,T,IEX,145.560000,100
2019-10-08 16:44:33.298042112,2019-10-08 16:44:33.298023474,9798749,T,IEX,145.560000,56
2019-10-08 16:44:47.947282944,2019-10-08 16:44:47.947266952,9806970,T,IEX,145.570000,27
2019-10-08 16:44:47.948055040,2019-10-08 16:44:47.948038331,9806973,T,IEX,145.570000,8
2019-10-08 16:44:56.478779904,2019-10-08 16:44:56.478746484,9816947,T,IEX,145.550000,100
2019-10-08 16:45:01.812144128,2019-10-08 16:45:01.812128765,9830218,T,IEX,145.550000,100
2019-10-08 16:45:04.269843968,2019-10-08 16:45:04.269824664,9833511,T,IEX,145.550000,100
2019-10-08 16:45:04.269853952,2019-10-08 16:45:04.269836699,9833512,T,IEX,145.550000,100
2019-10-08 16:45:20.104549120,2019-10-08 16:45:20.104531512,9861539,T,IEX,145.530000,100
2019-10-08 16:46:03.265580032,2019-10-08 16:46:03.265563618,9950734,T,IEX,145.455000,145
2019-10-08 16:46:17.208173056,2019-10-08 16:46:17.208157843,9991715,T,IEX,145.425000,100
2019-10-08 16:46:17.208215040,2019-10-08 16:46:17.208198918,9991716,T,IEX,145.425000,100
2019-10-08 16:51:23.494158080,2019-10-08 16:51:23.494139505,10211068,T,IEX,145.470000,100
2019-10-08 16:52:16.796410880,2019-10-08 16:52:16.796392746,10243233,T,IEX,145.450000,5
2019-10-08 16:53:20.948240896,2019-10-08 16:53:20.948221750,10276214,T,IEX,145.425000,200
2019-10-08 16:53:36.163742976,2019-10-08 16:53:36.163724251,10286548,T,IEX,145.405000,300
2019-10-08 16:53:36.264549120,2019-10-08 16:53:36.264534040,10287138,T,IEX,145.405000,400
2019-10-08 16:53:40.197704960,2019-10-08 16:53:40.197687503,10291974,T,IEX,145.405000,25
2019-10-08 16:54:19.107747072,2019-10-08 16:54:19.107723696,10314733,T,IEX,145.430000,28
2019-10-08 16:54:36.515393024,2019-10-08 16:54:36.515377015,10323925,T,IEX,145.440000,72
2019-10-08 16:54:36.515412992,2019-10-08 16:54:36.515397449,10323927,T,IEX,145.440000,28
2019-10-08 16:55:42.135755008,2019-10-08 16:55:42.135733953,10368753,T,IEX,145.440000,100
2019-10-08 16:56:04.831951872,2019-10-08 16:56:04.831935521,10382729,T,IEX,145.385000,100
2019-10-08 16:56:37.765870080,2019-10-08 16:56:37.765852826,10405780,T,IEX,145.430000,100
2019-10-08 16:56:54.872879104,2019-10-08 16:56:54.872862395,10415914,T,IEX,145.440000,100
2019-10-08 16:57:33.325518080,2019-10-08 16:57:33.325501828,10436790,T,IEX,145.450000,100
2019-10-08 16:57:58.165262080,2019-10-08 16:57:58.165247421,10449835,T,IEX,145.450000,100
2019-10-08 16:58:12.852004096,2019-10-08 16:58:12.851987957,10459887,T,IEX,145.425000,300
2019-10-08 16:58:51.140611072,2019-10-08 16:58:51.140592739,10478654,T,IEX,145.470000,500
2019-10-08 16:59:43.577050112,2019-10-08 16:59:43.577030423,10509255,T,IEX,145.475000,500
2019-10-08 17:00:01.737977088,2019-10-08 17:00:01.737959332,10517644,T,IEX,145.485000,500
2019-10-08 17:00:01.828389120,2019-10-08 17:00:01.828367770,10517664,T,IEX,145.485000,500
2019-10-08 17:00:02.821071104,2019-10-08 17:00:02.821052542,10518354,T,IEX,145.485000,500
2019-10-08 17:00:02.861058048,2019-10-08 17:00:02.861038946,10518363,T,IEX,145.485000,500
2019-10-08 17:00:04.739742976,2019-10-08 17:00:04.739723990,10519170,T,IEX,145.480000,100
2019-10-08 17:00:04.748310016,2019-10-08 17:00:04.748293662,10519195,T,IEX,145.485000,300
2019-10-08 17:00:27.962494976,2019-10-08 17:00:27.962473067,10533910,T,IEX,145.480000,100
2019-10-08 17:00:27.987067904,2019-10-08 17:00:27.987050102,10533971,T,IEX,145.470000,100
2019-10-08 17:00:28.14885888,2019-10-08 17:00:28.14867794,10534016,T,IEX,145.470000,100
2019-10-08 17:01:51.489682944,2019-10-08 17:01:51.489666362,10581119,T,IEX,145.390000,100
2019-10-08 17:02:11.25114880,2019-10-08 17:02:11.25098926,10593763,T,IEX,145.410000,100
2019-10-08 17:02:46.854199040,2019-10-08 17:02:46.854183368,10612774,T,IEX,145.390000,100
2019-10-08 17:03:28.868195072,2019-10-08 17:03:28.868178393,10634614,T,IEX,145.435000,100
2019-10-08 17:05:10.406733056,2019-10-08 17:05:10.406713904,10685389,T,IEX,145.390000,100
2019-10-08 17:05:51.423950080,2019-10-08 17:05:51.423931962,10708556,T,IEX,145.350000,100
2019-10-08 17:05:51.436050944,2019-10-08 17:05:51.436032058,10708570,T,IEX,145.350000,100
2019-10-08 17:06:38.682185984,2019-10-08 17:06:38.682168974,10734295,T,IEX,145.340000,100
2019-10-08 17:06:59.751802880,2019-10-08 17:06:59.751784480,10740380,T,IEX,145.360000,100
2019-10-08 17:10:02.4236032,2019-10-08 17:10:02.4217414,10832229,T,IEX,145.290000,100
2019-10-08 17:10:24.19803904,2019-10-08 17:10:24.19784759,10844963,T,IEX,145.300000,100
2019-10-08 17:10:50.193989120,2019-10-08 17:10:50.193971450,10861738,T,IEX,145.310000,100
2019-10-08 17:10:57.848477952,2019-10-08 17:10:57.848454770,10865546,T,IEX,145.310000,100
2019-10-08 17:11:27.395444992,2019-10-08 17:11:27.395422922,10880716,T,IEX,145.290000,38
2019-10-08 17:11:58.523328000,2019-10-08 17:11:58.523310860,10897504,T,IEX,145.290000,94
2019-10-08 17:12:03.414031872,2019-10-08 17:12:03.414014388,10900975,T,IEX,145.290000,100
2019-10-08 17:13:03.591831040,2019-10-08 17:13:03.591811474,10928143,T,IEX,145.310000,100
2019-10-08 17:13:07.876819968,2019-10-08 17:13:07.876802194,10929997,T,IEX,145.290000,100
2019-10-08 17:13:53.718712064,2019-10-08 17:13:53.718695036,10950201,T,IEX,145.300000,100
2019-10-08 17:16:37.495924992,2019-10-08 17:16:37.495905519,11016579,T,IEX,145.240000,100
2019-10-08 17:16:37.504293120,2019-10-08 17:16:37.504275501,11016614,T,IEX,145.230000,100
2019-10-08 17:16:37.504307968,2019-10-08 17:16:37.504288948,11016616,T,IEX,145.230000,200
2019-10-08 17:16:45.134758912,2019-10-08 17:16:45.134740337,11021909,T,IEX,145.200000,100
2019-10-08 17:17:37.221904896,2019-10-08 17:17:37.221888256,11045848,T,IEX,145.210000,10
2019-10-08 17:18:59.961758976,2019-10-08 17:18:59.961743887,11079191,T,IEX,145.180000,100
2019-10-08 17:19:11.170723072,2019-10-08 17:19:11.170699977,11082375,T,IEX,145.170000,100
2019-10-08 17:20:57.909076992,2019-10-08 17:20:57.909059329,11137409,T,IEX,145.095000,100
2019-10-08 17:21:02.696769024,2019-10-08 17:21:02.696751470,11141475,T,IEX,145.110000,100
2019-10-08 17:21:02.812436992,2019-10-08 17:21:02.812418925,11141512,T,IEX,145.100000,100
2019-10-08 17:21:46.483685120,2019-10-08 17:21:46.483668501,11158066,T,IEX,145.110000,1
2019-10-08 17:21:49.118400000,2019-10-08 17:21:49.118383962,11158823,T,IEX,145.110000,85
2019-10-08 17:21:49.118603008,2019-10-08 17:21:49.118584683,11158826,T,IEX,145.110000,15
2019-10-08 17:22:06.437211904,2019-10-08 17:22:06.437189976,11165757,T,IEX,145.120000,4
2019-10-08 17:23:00.588472064,2019-10-08 17:23:00.588455761,11188147,T,IEX,145.090000,100
2019-10-08 17:23:23.321265920,2019-10-08 17:23:23.321250206,11197192,T,IEX,145.115000,100
2019-10-08 17:23:58.414241024,2019-10-08 17:23:58.414226049,11212324,T,IEX,145.115000,100
2019-10-08 17:23:59.624064000,2019-10-08 17:23:59.624046693,11212778,T,IEX,145.105000,100
2019-10-08 17:23:59.624082944,2019-10-08 17:23:59.624066029,11212779,T,IEX,145.105000,74
2019-10-08 17:23:59.626616064,2019-10-08 17:23:59.626597571,11212780,T,IEX,145.100000,100
2019-10-08 17:25:00.676667904,2019-10-08 17:25:00.676652838,11243446,T,IEX,145.150000,100
2019-10-08 17:25:12.693100032,2019-10-08 17:25:12.693081843,11249156,T,IEX,145.150000,100
2019-10-08 17:26:41.219350016,2019-10-08 17:26:41.219333031,11290449,T,IEX,145.140000,125
2019-10-08 17:28:08.973876992,2019-10-08 17:28:08.973860950,11326326,T,IEX,145.140000,100
2019-10-08 17:28:08.994255104,2019-10-08 17:28:08.994237687,11326373,T,IEX,145.135000,149
2019-10-08 17:28:09.245731072,2019-10-08 17:28:09.245709711,11326477,T,IEX,145.130000,100
2019-10-08 17:28:24.653910016,2019-10-08 17:28:24.653887257,11331101,T,IEX,145.110000,100
2019-10-08 17:28:29.706560000,2019-10-08 17:28:29.706541514,11334088,T,IEX,145.100000,200
2019-10-08 17:28:29.710757120,2019-10-08 17:28:29.710739365,11334096,T,IEX,145.105000,200
2019-10-08 17:28:29.716446976,2019-10-08 17:28:29.716426255,11334101,T,IEX,145.105000,900
2019-10-08 17:28:29.716456960,2019-10-08 17:28:29.716441237,11334102,T,IEX,145.100000,200
2019-10-08 17:28:40.103813888,2019-10-08 17:28:40.103795355,11338809,T,IEX,145.120000,2500
2019-10-08 17:28:54.984516096,2019-10-08 17:28:54.984494416,11344058,T,IEX,145.110000,100
2019-10-08 17:28:54.995610112,2019-10-08 17:28:54.995592216,11344111,T,IEX,145.110000,100
2019-10-08 17:29:39.137679872,2019-10-08 17:29:39.137663694,11361824,T,IEX,145.080000,100
2019-10-08 17:29:55.421064960,2019-10-08 17:29:55.421044713,11369311,T,IEX,145.070000,100
2019-10-08 17:29:56.397998080,2019-10-08 17:29:56.397978730,11369662,T,IEX,145.070000,100
2019-10-08 17:30:20.537214976,2019-10-08 17:30:20.537200301,11378817,T,IEX,145.050000,100
2019-10-08 17:30:50.615333120,2019-10-08 17:30:50.615314990,11401670,T,IEX,145.030000,100
2019-10-08 17:30:56.937171968,2019-10-08 17:30:56.937154627,11405044,T,IEX,145.040000,100
2019-10-08 17:31:01.393506048,2019-10-08 17:31:01.393491042,11408091,T,IEX,145.050000,22
2019-10-08 17:31:02.270536960,2019-10-08 17:31:02.270519682,11408813,T,IEX,145.070000,100
2019-10-08 17:31:20.677640960,2019-10-08 17:31:20.677624483,11418467,T,IEX,145.125000,100
2019-10-08 17:31:26.899963904,2019-10-08 17:31:26.899946734,11420957,T,IEX,145.110000,100
2019-10-08 17:31:26.904395008,2019-10-08 17:31:26.904377710,11420973,T,IEX,145.115000,1100
2019-10-08 17:31:26.904407040,2019-10-08 17:31:26.904391211,11420974,T,IEX,145.110000,200
2019-10-08 17:32:08.225949952,2019-10-08 17:32:08.225934070,11443273,T,IEX,145.245000,100
2019-10-08 17:32:08.226793984,2019-10-08 17:32:08.226776748,11443275,T,IEX,145.245000,100
2019-10-08 17:32:08.227380992,2019-10-08 17:32:08.227365440,11443278,T,IEX,145.245000,100
2019-10-08 17:32:08.227617024,2019-10-08 17:32:08.227598795,11443279,T,IEX,145.245000,100
2019-10-08 17:32:12.677829888,2019-10-08 17:32:12.677811746,11445451,T,IEX,145.235000,300
2019-10-08 17:33:44.695887872,2019-10-08 17:33:44.695869988,11482739,T,IEX,145.240000,100
2019-10-08 17:35:35.678836992,2019-10-08 17:35:35.678818664,11525912,T,IEX,145.280000,14
2019-10-08 17:35:53.835869952,2019-10-08 17:35:53.835855573,11531416,T,IEX,145.310000,100
2019-10-08 17:35:53.852741888,2019-10-08 17:35:53.852723329,11531497,T,IEX,145.320000,100
2019-10-08 17:36:36.588119040,2019-10-08 17:36:36.588100464,11567326,T,IEX,145.370000,100
2019-10-08 17:37:05.709506048,2019-10-08 17:37:05.709491288,11589728,T,IEX,145.340000,100
2019-10-08 17:37:18.265074944,2019-10-08 17:37:18.265057470,11595066,T,IEX,145.340000,25
2019-10-08 17:38:25.876798976,2019-10-08 17:38:25.876778961,11624011,T,IEX,145.340000,100
2019-10-08 17:39:18.299475968,2019-10-08 17:39:18.299461067,11643345,T,IEX,145.300000,100
2019-10-08 17:39:34.787938048,2019-10-08 17:39:34.787918718,11648487,T,IEX,145.280000,10
2019-10-08 17:40:13.233661952,2019-10-08 17:40:13.233644217,11667452,T,IEX,145.290000,100
2019-10-08 17:42:01.521153024,2019-10-08 17:42:01.521134412,11713812,T,IEX,145.300000,100
2019-10-08 17:44:59.201576960,2019-10-08 17:44:59.201562202,11779011,T,IEX,145.300000,100
2019-10-08 17:44:59.201627904,2019-10-08 17:44:59.201609994,11779013,T,IEX,145.300000,100
2019-10-08 17:45:41.690268928,2019-10-08 17:45:41.690248582,11799984,T,IEX,145.340000,5
2019-10-08 17:46:08.506476032,2019-10-08 17:46:08.506460388,11809581,T,IEX,145.320000,100
2019-10-08 17:46:50.303472896,2019-10-08 17:46:50.303454006,11827449,T,IEX,145.330000,100
2019-10-08 17:47:02.966181888,2019-10-08 17:47:02.966165017,11832571,T,IEX,145.310000,73
2019-10-08 17:49:11.979173888,2019-10-08 17:49:11.979156702,11879319,T,IEX,145.290000,70
2019-10-08 17:53:24.818330112,2019-10-08 17:53:24.818308286,11958077,T,IEX,145.260000,700
2019-10-08 17:54:47.223126016,2019-10-08 17:54:47.223107713,11983791,T,IEX,145.280000,15
2019-10-08 17:54:47.225061888,2019-10-08 17:54:47.225043980,11983794,T,IEX,145.280000,15
2019-10-08 17:55:19.506924032,2019-10-08 17:55:19.506906646,12009136,T,IEX,145.300000,14
2019-10-08 17:55:25.205500928,2019-10-08 17:55:25.205480082,12012781,T,IEX,145.290000,12
2019-10-08 17:57:05.854347008,2019-10-08 17:57:05.854330161,12056424,T,IEX,145.260000,100
2019-10-08 17:57:49.232475904,2019-10-08 17:57:49.232461431,12070884,T,IEX,145.280000,100
2019-10-08 17:57:55.635557120,2019-10-08 17:57:55.635537549,12072626,T,IEX,145.250000,100
2019-10-08 17:59:44.843334912,2019-10-08 17:59:44.843317451,12113646,T,IEX,145.280000,15
2019-10-08 18:00:50.610522880,2019-10-08 18:00:50.610507533,12154931,T,IEX,145.320000,6
2019-10-08 18:01:05.271258880,2019-10-08 18:01:05.271240489,12166479,T,IEX,145.310000,29
2019-10-08 18:01:34.221757952,2019-10-08 18:01:34.221738840,12187498,T,IEX,145.360000,50
2019-10-08 18:02:40.518802944,2019-10-08 18:02:40.518787052,12230179,T,IEX,145.350000,100
2019-10-08 18:03:20.8945920,2019-10-08 18:03:20.8930279,12254215,T,IEX,145.330000,100
2019-10-08 18:04:02.752946944,2019-10-08 18:04:02.752929150,12279754,T,IEX,145.220000,100
2019-10-08 18:04:02.914160128,2019-10-08 18:04:02.914142576,12280020,T,IEX,145.230000,233
2019-10-08 18:04:27.844858880,2019-10-08 18:04:27.844839701,12306110,T,IEX,145.260000,100
2019-10-08 18:04:37.65594880,2019-10-08 18:04:37.65576291,12328464,T,IEX,145.260000,25
2019-10-08 18:05:23.779258112,2019-10-08 18:05:23.779237985,12375519,T,IEX,145.250000,18
2019-10-08 18:05:24.132992000,2019-10-08 18:05:24.132974554,12375759,T,IEX,145.250000,2
2019-10-08 18:05:40.965872896,2019-10-08 18:05:40.965855085,12389040,T,IEX,145.250000,68
2019-10-08 18:08:03.966995968,2019-10-08 18:08:03.966972932,12469382,T,IEX,145.180000,100
2019-10-08 18:09:42.176726016,2019-10-08 18:09:42.176657754,12525406,T,IEX,145.240000,2
2019-10-08 18:11:05.154318080,2019-10-08 18:11:05.154299665,12568593,T,IEX,145.130000,100
2019-10-08 18:11:10.381165056,2019-10-08 18:11:10.381149401,12571340,T,IEX,145.145000,200
2019-10-08 18:11:34.687138048,2019-10-08 18:11:34.687120004,12583813,T,IEX,145.150000,100
2019-10-08 18:11:34.694337024,2019-10-08 18:11:34.694318276,12583927,T,IEX,145.100000,300
2019-10-08 18:11:34.694482944,2019-10-08 18:11:34.694467522,12583931,T,IEX,145.100000,100
2019-10-08 18:11:34.695185920,2019-10-08 18:11:34.695170439,12583949,T,IEX,145.100000,100
2019-10-08 18:11:34.736748032,2019-10-08 18:11:34.736728701,12584290,T,IEX,145.075000,100
2019-10-08 18:11:34.736796928,2019-10-08 18:11:34.736781304,12584291,T,IEX,145.075000,100
2019-10-08 18:15:12.84696064,2019-10-08 18:15:12.84679650,12696050,T,IEX,145.100000,100
2019-10-08 18:15:12.85106944,2019-10-08 18:15:12.85090316,12696053,T,IEX,145.100000,46
2019-10-08 18:15:12.85415936,2019-10-08 18:15:12.85399533,12696056,T,IEX,145.100000,100
2019-10-08 18:15:14.811535872,2019-10-08 18:15:14.811517286,12697288,T,IEX,145.100000,98
2019-10-08 18:17:25.730247936,2019-10-08 18:17:25.730229850,12752867,T,IEX,145.090000,2
2019-10-08 18:17:58.918882048,2019-10-08 18:17:58.918864466,12766656,T,IEX,145.120000,7
2019-10-08 18:18:00.787457024,2019-10-08 18:18:00.787440980,12768402,T,IEX,145.140000,8
2019-10-08 18:18:05.305199104,2019-10-08 18:18:05.305178538,12769900,T,IEX,145.150000,100
2019-10-08 18:18:23.930233088,2019-10-08 18:18:23.930213782,12779381,T,IEX,145.110000,2
2019-10-08 18:18:24.493744128,2019-10-08 18:18:24.493724823,12780294,T,IEX,145.110000,100
2019-10-08 18:19:04.882255104,2019-10-08 18:19:04.882239231,12803979,T,IEX,145.080000,1
2019-10-08 18:19:17.416446976,2019-10-08 18:19:17.416431105,12811952,T,IEX,145.080000,100
2019-10-08 18:20:01.159517952,2019-10-08 18:20:01.159498183,12831123,T,IEX,145.090000,100
2019-10-08 18:20:03.241112064,2019-10-08 18:20:03.241094441,12831957,T,IEX,145.100000,100
2019-10-08 18:20:39.384762112,2019-10-08 18:20:39.384743588,12854766,T,IEX,145.130000,100
2019-10-08 18:20:53.550206976,2019-10-08 18:20:53.550190250,12860806,T,IEX,145.150000,49
2019-10-08 18:22:17.349543936,2019-10-08 18:22:17.349526005,12896991,T,IEX,145.180000,100
2019-10-08 18:22:21.113880064,2019-10-08 18:22:21.113860564,12898254,T,IEX,145.180000,100
2019-10-08 18:22:23.323412992,2019-10-08 18:22:23.323397925,12898922,T,IEX,145.190000,100
2019-10-08 18:23:42.320931072,2019-10-08 18:23:42.320913015,12934361,T,IEX,145.180000,41
2019-10-08 18:25:06.371408896,2019-10-08 18:25:06.371391556,12975731,T,IEX,145.160000,100
2019-10-08 18:30:02.746740992,2019-10-08 18:30:02.746720033,13119684,T,IEX,145.140000,100
2019-10-08 18:30:03.18455040,2019-10-08 18:30:03.18435845,13125747,T,IEX,145.100000,100
2019-10-08 18:30:03.22478080,2019-10-08 18:30:03.22460112,13125894,T,IEX,145.100000,100
2019-10-08 18:30:03.26587904,2019-10-08 18:30:03.26569995,13126032,T,IEX,145.100000,87
2019-10-08 18:30:03.28477952,2019-10-08 18:30:03.28458885,13126089,T,IEX,145.100000,100
2019-10-08 18:30:03.37128960,2019-10-08 18:30:03.37110827,13126369,T,IEX,145.100000,3100
2019-10-08 18:30:03.77300992,2019-10-08 18:30:03.77283380,13127668,T,IEX,145.080000,100
2019-10-08 18:30:03.144092928,2019-10-08 18:30:03.144073025,13129297,T,IEX,145.080000,100
2019-10-08 18:30:03.544148992,2019-10-08 18:30:03.544128501,13134228,T,IEX,145.100000,100
2019-10-08 18:30:03.565157120,2019-10-08 18:30:03.565131345,13135040,T,IEX,145.130000,100
2019-10-08 18:30:03.575042048,2019-10-08 18:30:03.575023969,13135473,T,IEX,145.170000,100
2019-10-08 18:30:03.575141888,2019-10-08 18:30:03.575123358,13135477,T,IEX,145.170000,100
2019-10-08 18:30:03.575780096,2019-10-08 18:30:03.575758581,13135493,T,IEX,145.160000,100
2019-10-08 18:30:03.578664960,2019-10-08 18:30:03.578643076,13135619,T,IEX,145.200000,100
2019-10-08 18:30:03.596654080,2019-10-08 18:30:03.596636092,13136006,T,IEX,145.210000,100
2019-10-08 18:30:03.599941120,2019-10-08 18:30:03.599922210,13136064,T,IEX,145.220000,100
2019-10-08 18:30:03.643017984,2019-10-08 18:30:03.643000627,13136755,T,IEX,145.290000,100
2019-10-08 18:30:03.648406016,2019-10-08 18:30:03.648386482,13136864,T,IEX,145.300000,100
2019-10-08 18:30:05.504012032,2019-10-08 18:30:05.503988524,13155295,T,IEX,145.440000,100
2019-10-08 18:30:08.955109120,2019-10-08 18:30:08.955091456,13171861,T,IEX,145.370000,100
2019-10-08 18:30:09.215488000,2019-10-08 18:30:09.215470882,13173420,T,IEX,145.390000,100
2019-10-08 18:30:14.863602944,2019-10-08 18:30:14.863585792,13200438,T,IEX,145.310000,100
2019-10-08 18:30:14.895810048,2019-10-08 18:30:14.895791802,13200577,T,IEX,145.340000,100
2019-10-08 18:30:16.469969920,2019-10-08 18:30:16.469953607,13206820,T,IEX,145.360000,300
2019-10-08 18:30:18.525142016,2019-10-08 18:30:18.525126669,13221503,T,IEX,145.280000,100
2019-10-08 18:30:19.260018944,2019-10-08 18:30:19.259992101,13226286,T,IEX,145.245000,100
2019-10-08 18:30:21.23945984,2019-10-08 18:30:21.23927791,13232820,T,IEX,145.200000,60
2019-10-08 18:30:26.583663104,2019-10-08 18:30:26.583645658,13264054,T,IEX,145.140000,100
2019-10-08 18:30:27.531866880,2019-10-08 18:30:27.531847627,13268398,T,IEX,145.080000,100
2019-10-08 18:30:27.716628992,2019-10-08 18:30:27.716611552,13268991,T,IEX,145.070000,1000
2019-10-08 18:30:27.716641024,2019-10-08 18:30:27.716623359,13268992,T,IEX,145.070000,100
2019-10-08 18:30:27.796164096,2019-10-08 18:30:27.796146254,13269396,T,IEX,145.060000,100
2019-10-08 18:30:31.815920896,2019-10-08 18:30:31.815902586,13282580,T,IEX,145.110000,200
2019-10-08 18:30:31.817487872,2019-10-08 18:30:31.817470773,13282582,T,IEX,145.110000,100
2019-10-08 18:30:32.169489920,2019-10-08 18:30:32.169473715,13283632,T,IEX,145.120000,200
2019-10-08 18:30:32.172058112,2019-10-08 18:30:32.172040294,13283638,T,IEX,145.120000,500
2019-10-08 18:30:32.172066048,2019-10-08 18:30:32.172049569,13283639,T,IEX,145.120000,100
2019-10-08 18:30:33.254970880,2019-10-08 18:30:33.254954889,13285983,T,IEX,145.110000,100
2019-10-08 18:30:33.662331904,2019-10-08 18:30:33.662315495,13286893,T,IEX,145.120000,100
2019-10-08 18:30:33.970681088,2019-10-08 18:30:33.970663483,13287999,T,IEX,145.130000,100
2019-10-08 18:30:38.989069056,2019-10-08 18:30:38.989052407,13299202,T,IEX,145.145000,300
2019-10-08 18:30:38.994733056,2019-10-08 18:30:38.994715021,13299221,T,IEX,145.145000,219
2019-10-08 18:30:39.922322944,2019-10-08 18:30:39.922305208,13300321,T,IEX,145.145000,280
2019-10-08 18:30:39.922755072,2019-10-08 18:30:39.922736220,13300322,T,IEX,145.145000,100
2019-10-08 18:30:39.933210880,2019-10-08 18:30:39.933193942,13300335,T,IEX,145.145000,100
2019-10-08 18:30:42.597504000,2019-10-08 18:30:42.597488059,13303477,T,IEX,145.140000,100
2019-10-08 18:30:43.107493120,2019-10-08 18:30:43.107475925,13305329,T,IEX,145.120000,100
2019-10-08 18:30:50.415904000,2019-10-08 18:30:50.415886964,13321537,T,IEX,145.120000,100
2019-10-08 18:30:50.601658112,2019-10-08 18:30:50.601641781,13322531,T,IEX,145.140000,100
2019-10-08 18:30:51.394184960,2019-10-08 18:30:51.394167910,13327458,T,IEX,145.130000,100
2019-10-08 18:30:51.839162112,2019-10-08 18:30:51.839145064,13331037,T,IEX,145.110000,100
2019-10-08 18:30:56.346548992,2019-10-08 18:30:56.346529099,13345110,T,IEX,145.170000,100
2019-10-08 18:30:56.346572032,2019-10-08 18:30:56.346555984,13345111,T,IEX,145.170000,100
2019-10-08 18:30:56.348314112,2019-10-08 18:30:56.348297123,13345117,T,IEX,145.170000,100
2019-10-08 18:30:56.349644032,2019-10-08 18:30:56.349623557,13345118,T,IEX,145.170000,500
2019-10-08 18:31:05.985243904,2019-10-08 18:31:05.985229129,13369605,T,IEX,145.105000,40
2019-10-08 18:31:07.294647040,2019-10-08 18:31:07.294631580,13372588,T,IEX,145.080000,100
2019-10-08 18:31:07.295517952,2019-10-08 18:31:07.295501393,13372604,T,IEX,145.080000,100
2019-10-08 18:31:15.88264960,2019-10-08 18:31:15.88250079,13390233,T,IEX,145.050000,57
2019-10-08 18:31:15.336531968,2019-10-08 18:31:15.336514514,13390578,T,IEX,145.050000,100
2019-10-08 18:31:39.995793920,2019-10-08 18:31:39.995777138,13431454,T,IEX,145.070000,100
2019-10-08 18:31:43.206443008,2019-10-08 18:31:43.206425843,13436329,T,IEX,145.090000,100
2019-10-08 18:32:06.860564992,2019-10-08 18:32:06.860547630,13470193,T,IEX,145.130000,100
2019-10-08 18:32:15.235058944,2019-10-08 18:32:15.235039391,13483864,T,IEX,145.150000,100
2019-10-08 18:32:15.235075072,2019-10-08 18:32:15.235059340,13483865,T,IEX,145.150000,300
2019-10-08 18:32:15.965253888,2019-10-08 18:32:15.965237630,13484805,T,IEX,145.170000,100
2019-10-08 18:32:21.310785024,2019-10-08 18:32:21.310765281,13493956,T,IEX,145.190000,100
2019-10-08 18:32:40.562850048,2019-10-08 18:32:40.562832799,13520608,T,IEX,145.155000,100
2019-10-08 18:32:41.51493888,2019-10-08 18:32:41.51479118,13521304,T,IEX,145.160000,50
2019-10-08 18:32:41.52208128,2019-10-08 18:32:41.52192529,13521308,T,IEX,145.160000,9
2019-10-08 18:32:41.227836928,2019-10-08 18:32:41.227817140,13521423,T,IEX,145.160000,41
2019-10-08 18:32:46.282614016,2019-10-08 18:32:46.282593173,13526693,T,IEX,145.190000,100
2019-10-08 18:32:50.254824960,2019-10-08 18:32:50.254806443,13531182,T,IEX,145.220000,8
2019-10-08 18:32:54.819635968,2019-10-08 18:32:54.819616884,13537531,T,IEX,145.220000,100
2019-10-08 18:33:05.589224960,2019-10-08 18:33:05.589208384,13552689,T,IEX,145.160000,100
2019-10-08 18:33:06.341523968,2019-10-08 18:33:06.341505123,13553734,T,IEX,145.135000,100
2019-10-08 18:33:12.810503936,2019-10-08 18:33:12.810487341,13558802,T,IEX,145.135000,100
2019-10-08 18:33:27.997300992,2019-10-08 18:33:27.997282626,13574789,T,IEX,145.140000,100
2019-10-08 18:34:51.222201088,2019-10-08 18:34:51.222179559,13659827,T,IEX,144.960000,44
2019-10-08 18:34:51.533318912,2019-10-08 18:34:51.533302886,13660148,T,IEX,144.960000,8
2019-10-08 18:35:43.429315072,2019-10-08 18:35:43.429291924,13708722,T,IEX,144.900000,100
2019-10-08 18:35:45.740207104,2019-10-08 18:35:45.740188465,13710074,T,IEX,144.910000,100
2019-10-08 18:36:36.138690048,2019-10-08 18:36:36.138672280,13768233,T,IEX,144.790000,100
2019-10-08 18:36:52.890772992,2019-10-08 18:36:52.890754328,13789421,T,IEX,144.800000,100
2019-10-08 18:36:53.591419904,2019-10-08 18:36:53.591401321,13790063,T,IEX,144.790000,100
2019-10-08 18:37:02.466496000,2019-10-08 18:37:02.466479743,13805416,T,IEX,144.800000,100
2019-10-08 18:37:38.230104064,2019-10-08 18:37:38.230086563,13852632,T,IEX,144.800000,60
2019-10-08 18:37:42.897357056,2019-10-08 18:37:42.897337451,13857455,T,IEX,144.820000,100
2019-10-08 18:37:59.181026048,2019-10-08 18:37:59.181010679,13869482,T,IEX,144.870000,48
2019-10-08 18:37:59.181083904,2019-10-08 18:37:59.181067479,13869484,T,IEX,144.870000,52
2019-10-08 18:38:12.281449984,2019-10-08 18:38:12.281430596,13882926,T,IEX,144.880000,100
2019-10-08 18:38:12.282707968,2019-10-08 18:38:12.282691230,13882928,T,IEX,144.880000,600
2019-10-08 18:38:12.284081920,2019-10-08 18:38:12.284064814,13882932,T,IEX,144.880000,300
2019-10-08 18:39:06.256785920,2019-10-08 18:39:06.256770191,13928224,T,IEX,144.835000,300
2019-10-08 18:39:15.899128064,2019-10-08 18:39:15.899110298,13936517,T,IEX,144.805000,100
2019-10-08 18:40:03.417076992,2019-10-08 18:40:03.417057911,13972106,T,IEX,144.875000,3
2019-10-08 18:40:03.418364928,2019-10-08 18:40:03.418348940,13972108,T,IEX,144.875000,31
2019-10-08 18:40:03.419069952,2019-10-08 18:40:03.419052961,13972109,T,IEX,144.875000,26
2019-10-08 18:40:14.467218944,2019-10-08 18:40:14.467199525,13980695,T,IEX,144.875000,44
2019-10-08 18:40:14.722298880,2019-10-08 18:40:14.722283528,13981559,T,IEX,144.875000,100
2019-10-08 18:40:16.235834880,2019-10-08 18:40:16.235816632,13984114,T,IEX,144.875000,100
2019-10-08 18:40:16.414512128,2019-10-08 18:40:16.414492781,13984275,T,IEX,144.875000,100
2019-10-08 18:41:06.502098944,2019-10-08 18:41:06.502081285,14021189,T,IEX,144.725000,200
2019-10-08 18:41:08.780252928,2019-10-08 18:41:08.780236704,14024919,T,IEX,144.715000,100
2019-10-08 18:41:08.780534016,2019-10-08 18:41:08.780517012,14024921,T,IEX,144.715000,428
2019-10-08 18:41:42.440153088,2019-10-08 18:41:42.440138113,14052546,T,IEX,144.690000,100
2019-10-08 18:41:49.38635008,2019-10-08 18:41:49.38617779,14056358,T,IEX,144.720000,1300
2019-10-08 18:41:49.41110016,2019-10-08 18:41:49.41093204,14056387,T,IEX,144.710000,100
2019-10-08 18:41:49.43147008,2019-10-08 18:41:49.43129077,14056410,T,IEX,144.710000,100
2019-10-08 18:41:49.49389056,2019-10-08 18:41:49.49372278,14056431,T,IEX,144.710000,100
2019-10-08 18:41:49.49401088,2019-10-08 18:41:49.49384263,14056432,T,IEX,144.710000,1000
2019-10-08 18:42:13.157477120,2019-10-08 18:42:13.157460733,14074139,T,IEX,144.700000,300
2019-10-08 18:42:48.402853888,2019-10-08 18:42:48.402832726,14094490,T,IEX,144.670000,100
2019-10-08 18:42:48.404947968,2019-10-08 18:42:48.404930773,14094497,T,IEX,144.670000,100
2019-10-08 18:43:03.573630976,2019-10-08 18:43:03.573613543,14103985,T,IEX,144.670000,100
2019-10-08 18:43:34.165191936,2019-10-08 18:43:34.165169998,14124679,T,IEX,144.720000,10
2019-10-08 18:44:12.162106112,2019-10-08 18:44:12.162087555,14147717,T,IEX,144.690000,100
2019-10-08 18:44:26.17746944,2019-10-08 18:44:26.17728678,14157657,T,IEX,144.750000,19
2019-10-08 18:44:26.603132928,2019-10-08 18:44:26.603116091,14158074,T,IEX,144.760000,100
2019-10-08 18:47:16.994672896,2019-10-08 18:47:16.994655676,14268348,T,IEX,144.780000,100
2019-10-08 18:47:57.283009024,2019-10-08 18:47:57.282989702,14304482,T,IEX,144.750000,100
2019-10-08 18:47:58.292542976,2019-10-08 18:47:58.292522399,14305547,T,IEX,144.760000,100
2019-10-08 18:48:31.438654976,2019-10-08 18:48:31.438636922,14334188,T,IEX,144.710000,100
2019-10-08 18:48:49.100506112,2019-10-08 18:48:49.100490603,14347983,T,IEX,144.705000,100
2019-10-08 18:51:24.455226112,2019-10-08 18:51:24.455209008,14477163,T,IEX,144.690000,100
2019-10-08 18:51:38.430075904,2019-10-08 18:51:38.430058887,14485839,T,IEX,144.700000,1300
2019-10-08 18:52:19.510812928,2019-10-08 18:52:19.510795961,14505515,T,IEX,144.730000,14
2019-10-08 18:52:34.151621120,2019-10-08 18:52:34.151603683,14512244,T,IEX,144.750000,100
2019-10-08 18:53:00.226810112,2019-10-08 18:53:00.226789867,14528336,T,IEX,144.760000,58
2019-10-08 18:53:00.226876928,2019-10-08 18:53:00.226860545,14528339,T,IEX,144.760000,42
2019-10-08 18:53:10.721112064,2019-10-08 18:53:10.721093236,14537004,T,IEX,144.755000,300
2019-10-08 18:53:26.930944000,2019-10-08 18:53:26.930926913,14546147,T,IEX,144.750000,12
2019-10-08 18:53:27.810588928,2019-10-08 18:53:27.810571335,14546450,T,IEX,144.760000,89
2019-10-08 18:53:27.810767104,2019-10-08 18:53:27.810748890,14546452,T,IEX,144.760000,11
2019-10-08 18:53:38.171789056,2019-10-08 18:53:38.171771109,14552405,T,IEX,144.780000,12
2019-10-08 18:53:53.887336960,2019-10-08 18:53:53.887320147,14560374,T,IEX,144.790000,100
2019-10-08 18:53:53.887686912,2019-10-08 18:53:53.887669928,14560376,T,IEX,144.800000,100
2019-10-08 18:55:25.766279936,2019-10-08 18:55:25.766261231,14613578,T,IEX,144.800000,177
2019-10-08 18:55:29.731119104,2019-10-08 18:55:29.731101748,14616048,T,IEX,144.810000,100
2019-10-08 18:55:43.906124032,2019-10-08 18:55:43.906107562,14625576,T,IEX,144.740000,100
2019-10-08 18:55:47.995976960,2019-10-08 18:55:47.995961406,14628911,T,IEX,144.725000,188
2019-10-08 18:55:47.996018944,2019-10-08 18:55:47.996001089,14628912,T,IEX,144.725000,12
2019-10-08 18:57:16.129519104,2019-10-08 18:57:16.129499932,14677067,T,IEX,144.790000,100
2019-10-08 18:57:31.171813888,2019-10-08 18:57:31.171795474,14690642,T,IEX,144.820000,100
2019-10-08 18:57:31.458426880,2019-10-08 18:57:31.458409131,14699685,T,IEX,145.070000,131
2019-10-08 18:57:31.459122944,2019-10-08 18:57:31.459105196,14699697,T,IEX,145.070000,200
2019-10-08 18:57:31.478426880,2019-10-08 18:57:31.478408340,14700073,T,IEX,145.100000,200
2019-10-08 18:57:31.478797056,2019-10-08 18:57:31.478776459,14700079,T,IEX,145.100000,131
2019-10-08 18:57:31.481644032,2019-10-08 18:57:31.481624533,14700142,T,IEX,145.100000,38
2019-10-08 18:57:31.481857024,2019-10-08 18:57:31.481838069,14700150,T,IEX,145.100000,100
2019-10-08 18:57:31.538331904,2019-10-08 18:57:31.538313057,14701254,T,IEX,145.060000,100
2019-10-08 18:57:31.538653952,2019-10-08 18:57:31.538634953,14701264,T,IEX,145.110000,800
2019-10-08 18:57:31.612857088,2019-10-08 18:57:31.612822865,14702664,T,IEX,145.210000,100
2019-10-08 18:57:31.684645888,2019-10-08 18:57:31.684627744,14703876,T,IEX,145.250000,1000
2019-10-08 18:57:31.684667904,2019-10-08 18:57:31.684651327,14703877,T,IEX,145.250000,100
2019-10-08 18:57:31.709241088,2019-10-08 18:57:31.709222482,14704260,T,IEX,145.255000,100
2019-10-08 18:57:31.709263872,2019-10-08 18:57:31.709245579,14704261,T,IEX,145.255000,100
2019-10-08 18:57:31.718215936,2019-10-08 18:57:31.718197976,14704361,T,IEX,145.260000,100
2019-10-08 18:57:31.724285952,2019-10-08 18:57:31.724267673,14704451,T,IEX,145.265000,1000
2019-10-08 18:57:31.906052096,2019-10-08 18:57:31.906034352,14706568,T,IEX,145.285000,300
2019-10-08 18:57:31.911016960,2019-10-08 18:57:31.911000005,14706599,T,IEX,145.290000,300
2019-10-08 18:57:32.653800960,2019-10-08 18:57:32.653782580,14715717,T,IEX,145.500000,500
2019-10-08 18:57:33.91267072,2019-10-08 18:57:33.91246179,14719868,T,IEX,145.550000,100
2019-10-08 18:57:33.750543104,2019-10-08 18:57:33.750525685,14727402,T,IEX,145.590000,100
2019-10-08 18:57:33.851545088,2019-10-08 18:57:33.851525868,14728761,T,IEX,145.580000,100
2019-10-08 18:57:34.17202944,2019-10-08 18:57:34.17185408,14730548,T,IEX,145.590000,100
2019-10-08 18:57:34.102487040,2019-10-08 18:57:34.102469735,14731310,T,IEX,145.580000,100
2019-10-08 18:57:36.216218112,2019-10-08 18:57:36.216201765,14750099,T,IEX,145.550000,86
2019-10-08 18:57:36.383756032,2019-10-08 18:57:36.383736737,14751927,T,IEX,145.580000,100
2019-10-08 18:57:36.708627968,2019-10-08 18:57:36.708610025,14754584,T,IEX,145.550000,71
2019-10-08 18:57:36.708728064,2019-10-08 18:57:36.708708070,14754587,T,IEX,145.550000,29
2019-10-08 18:57:36.795661056,2019-10-08 18:57:36.795642591,14756444,T,IEX,145.590000,71
2019-10-08 18:57:41.890880000,2019-10-08 18:57:41.890861444,14784381,T,IEX,145.590000,600
2019-10-08 18:57:45.579165952,2019-10-08 18:57:45.579148758,14821592,T,IEX,145.370000,200
2019-10-08 18:57:46.849953024,2019-10-08 18:57:46.849937992,14831194,T,IEX,145.480000,700
2019-10-08 18:57:48.742107904,2019-10-08 18:57:48.742091634,14841757,T,IEX,145.290000,600
2019-10-08 18:57:53.732972032,2019-10-08 18:57:53.732953094,14866178,T,IEX,145.380000,100
2019-10-08 18:57:53.767315968,2019-10-08 18:57:53.767296387,14867319,T,IEX,145.310000,50
2019-10-08 18:57:53.768666112,2019-10-08 18:57:53.768646671,14867364,T,IEX,145.310000,10
2019-10-08 18:57:53.786324992,2019-10-08 18:57:53.786307111,14867998,T,IEX,145.310000,40
2019-10-08 18:57:53.786339072,2019-10-08 18:57:53.786322291,14867999,T,IEX,145.310000,300
2019-10-08 18:57:54.484617984,2019-10-08 18:57:54.484599970,14874044,T,IEX,145.290000,1000
2019-10-08 18:57:54.532485888,2019-10-08 18:57:54.532466314,14875267,T,IEX,145.310000,100
2019-10-08 18:57:59.304508928,2019-10-08 18:57:59.304490975,14899527,T,IEX,145.145000,300
2019-10-08 18:58:06.590075904,2019-10-08 18:58:06.590058591,14932988,T,IEX,145.280000,100
2019-10-08 18:58:06.679155968,2019-10-08 18:58:06.679139552,14933986,T,IEX,145.220000,100
2019-10-08 18:58:11.636976128,2019-10-08 18:58:11.636960640,14959498,T,IEX,145.150000,100
2019-10-08 18:58:17.955361024,2019-10-08 18:58:17.955343425,14982132,T,IEX,145.170000,300
2019-10-08 18:58:23.525079040,2019-10-08 18:58:23.525055052,14994390,T,IEX,145.170000,100
2019-10-08 18:58:33.759975936,2019-10-08 18:58:33.759961017,15025295,T,IEX,145.050000,1300
2019-10-08 18:58:33.772384000,2019-10-08 18:58:33.772367882,15025340,T,IEX,145.040000,100
2019-10-08 18:58:33.772414976,2019-10-08 18:58:33.772398397,15025341,T,IEX,145.040000,100
2019-10-08 18:58:41.715706880,2019-10-08 18:58:41.715687807,15051573,T,IEX,144.990000,48
2019-10-08 18:58:55.554604032,2019-10-08 18:58:55.554586952,15093122,T,IEX,145.030000,84
2019-10-08 18:58:55.566533888,2019-10-08 18:58:55.566516624,15093299,T,IEX,144.950000,100
2019-10-08 18:58:55.655610880,2019-10-08 18:58:55.655593498,15093688,T,IEX,144.950000,50
2019-10-08 18:59:02.223971072,2019-10-08 18:59:02.223952788,15116082,T,IEX,145.070000,100
2019-10-08 19:00:35.642176000,2019-10-08 19:00:35.642156160,15302586,T,IEX,145.010000,1000
2019-10-08 19:00:36.201669888,2019-10-08 19:00:36.201651646,15305004,T,IEX,144.950000,100
2019-10-08 19:00:44.537723904,2019-10-08 19:00:44.537700965,15333664,T,IEX,144.990000,57
2019-10-08 19:00:44.537890048,2019-10-08 19:00:44.537872183,15333673,T,IEX,144.990000,100
2019-10-08 19:00:44.538040064,2019-10-08 19:00:44.538022089,15333678,T,IEX,144.990000,100
2019-10-08 19:00:44.538447104,2019-10-08 19:00:44.538421470,15333698,T,IEX,144.990000,100
2019-10-08 19:00:44.538544896,2019-10-08 19:00:44.538526355,15333701,T,IEX,144.990000,43
2019-10-08 19:00:44.538714112,2019-10-08 19:00:44.538692587,15333705,T,IEX,144.990000,57
2019-10-08 19:00:44.538757120,2019-10-08 19:00:44.538735015,15333707,T,IEX,144.990000,50
2019-10-08 19:00:44.538870016,2019-10-08 19:00:44.538838533,15333710,T,IEX,144.990000,100
2019-10-08 19:00:44.539217920,2019-10-08 19:00:44.539200068,15333724,T,IEX,144.990000,100
2019-10-08 19:00:44.539301120,2019-10-08 19:00:44.539282196,15333727,T,IEX,144.990000,100
2019-10-08 19:00:44.539454976,2019-10-08 19:00:44.539435099,15333733,T,IEX,144.990000,100
2019-10-08 19:00:44.539495936,2019-10-08 19:00:44.539479691,15333734,T,IEX,144.990000,100
2019-10-08 19:00:44.539598080,2019-10-08 19:00:44.539580226,15333735,T,IEX,144.990000,100
2019-10-08 19:00:44.539983104,2019-10-08 19:00:44.539965506,15333750,T,IEX,144.990000,100
2019-10-08 19:00:44.540022016,2019-10-08 19:00:44.540003211,15333754,T,IEX,144.990000,100
2019-10-08 19:00:44.540201984,2019-10-08 19:00:44.540183865,15333758,T,IEX,144.990000,93
2019-10-08 19:01:33.892514048,2019-10-08 19:01:33.892495534,15400233,T,IEX,145.085000,200
2019-10-08 19:01:49.48843008,2019-10-08 19:01:49.48822858,15417211,T,IEX,145.085000,300
2019-10-08 19:02:32.918513920,2019-10-08 19:02:32.918497967,15463051,T,IEX,145.010000,500
2019-10-08 19:02:58.684623104,2019-10-08 19:02:58.684602127,15495133,T,IEX,144.950000,100
2019-10-08 19:03:18.10490880,2019-10-08 19:03:18.10475617,15522550,T,IEX,144.990000,100
2019-10-08 19:03:47.872466944,2019-10-08 19:03:47.872449304,15565215,T,IEX,145.130000,100
2019-10-08 19:04:17.150908928,2019-10-08 19:04:17.150891638,15597928,T,IEX,145.100000,100
2019-10-08 19:04:32.244378112,2019-10-08 19:04:32.244360963,15613686,T,IEX,145.180000,100
2019-10-08 19:04:34.804475904,2019-10-08 19:04:34.804453739,15617219,T,IEX,145.190000,100
2019-10-08 19:04:36.716128000,2019-10-08 19:04:36.716109238,15620361,T,IEX,145.170000,83
2019-10-08 19:04:41.939065088,2019-10-08 19:04:41.939048100,15626582,T,IEX,145.210000,100
2019-10-08 19:04:58.833900032,2019-10-08 19:04:58.833884267,15646796,T,IEX,145.130000,100
2019-10-08 19:05:34.954237952,2019-10-08 19:05:34.954208650,15689761,T,IEX,145.070000,100
2019-10-08 19:05:49.939492096,2019-10-08 19:05:49.939476176,15708373,T,IEX,145.100000,100
2019-10-08 19:06:53.365541120,2019-10-08 19:06:53.365520663,15775413,T,IEX,145.145000,185
2019-10-08 19:07:27.375238912,2019-10-08 19:07:27.375218122,15814517,T,IEX,145.090000,100
2019-10-08 19:07:35.508308992,2019-10-08 19:07:35.508292416,15824116,T,IEX,145.085000,300
2019-10-08 19:07:47.834562048,2019-10-08 19:07:47.834545683,15833312,T,IEX,145.030000,100
2019-10-08 19:07:47.835395072,2019-10-08 19:07:47.835375101,15833313,T,IEX,145.030000,120
2019-10-08 19:07:50.962671104,2019-10-08 19:07:50.962655468,15836415,T,IEX,144.955000,100
2019-10-08 19:07:56.849210880,2019-10-08 19:07:56.849194548,15844946,T,IEX,144.895000,234
2019-10-08 19:08:07.508568064,2019-10-08 19:08:07.508549351,15857882,T,IEX,144.880000,900
2019-10-08 19:08:08.212456960,2019-10-08 19:08:08.212438877,15858294,T,IEX,144.885000,1100
2019-10-08 19:08:08.974208000,2019-10-08 19:08:08.974192307,15858960,T,IEX,144.900000,100
2019-10-08 19:08:20.154757120,2019-10-08 19:08:20.154738983,15867557,T,IEX,144.940000,100
2019-10-08 19:08:20.154913024,2019-10-08 19:08:20.154894444,15867564,T,IEX,144.930000,1000
2019-10-08 19:08:32.481739008,2019-10-08 19:08:32.481721330,15879298,T,IEX,144.880000,100
2019-10-08 19:08:46.762289920,2019-10-08 19:08:46.762271612,15894007,T,IEX,144.870000,100
2019-10-08 19:09:03.313094912,2019-10-08 19:09:03.313076631,15910127,T,IEX,144.860000,100
2019-10-08 19:09:08.851842048,2019-10-08 19:09:08.851826075,15916979,T,IEX,144.840000,100
2019-10-08 19:09:19.625903104,2019-10-08 19:09:19.625885989,15925396,T,IEX,144.880000,100
2019-10-08 19:09:20.407983104,2019-10-08 19:09:20.407962781,15926157,T,IEX,144.860000,100
2019-10-08 19:09:20.407997952,2019-10-08 19:09:20.407982965,15926158,T,IEX,144.860000,100
2019-10-08 19:09:28.723542016,2019-10-08 19:09:28.723524830,15932327,T,IEX,144.930000,100
2019-10-08 19:09:32.72880896,2019-10-08 19:09:32.72863899,15937141,T,IEX,144.930000,100
2019-10-08 19:10:38.553915904,2019-10-08 19:10:38.553900478,15993581,T,IEX,144.940000,100
2019-10-08 19:10:43.125633024,2019-10-08 19:10:43.125614915,16001940,T,IEX,144.910000,100
2019-10-08 19:10:44.445430016,2019-10-08 19:10:44.445414480,16003848,T,IEX,144.910000,100
2019-10-08 19:10:48.125236992,2019-10-08 19:10:48.125218047,16010017,T,IEX,144.890000,100
2019-10-08 19:11:03.542298112,2019-10-08 19:11:03.542280789,16028168,T,IEX,144.910000,100
2019-10-08 19:12:39.694148096,2019-10-08 19:12:39.694132348,16130392,T,IEX,145.000000,100
2019-10-08 19:12:58.702019072,2019-10-08 19:12:58.702001304,16145468,T,IEX,145.000000,700
2019-10-08 19:13:34.281661952,2019-10-08 19:13:34.281643694,16177386,T,IEX,145.000000,800
2019-10-08 19:13:34.552026112,2019-10-08 19:13:34.552007031,16177776,T,IEX,145.000000,1000
2019-10-08 19:13:36.246221056,2019-10-08 19:13:36.246204081,16179406,T,IEX,145.000000,300
2019-10-08 19:13:41.461711104,2019-10-08 19:13:41.461692267,16182774,T,IEX,145.040000,100
2019-10-08 19:13:41.461729024,2019-10-08 19:13:41.461711427,16182775,T,IEX,145.040000,400
2019-10-08 19:13:46.572592128,2019-10-08 19:13:46.572574649,16185146,T,IEX,145.010000,20
2019-10-08 19:13:46.573210112,2019-10-08 19:13:46.573192351,16185147,T,IEX,145.010000,41
2019-10-08 19:14:21.999397120,2019-10-08 19:14:21.999379172,16213594,T,IEX,145.040000,100
2019-10-08 19:14:24.472186880,2019-10-08 19:14:24.472170504,16215448,T,IEX,145.020000,100
2019-10-08 19:15:15.424662016,2019-10-08 19:15:15.424645884,16257925,T,IEX,144.960000,100
2019-10-08 19:15:56.139960064,2019-10-08 19:15:56.139939876,16281581,T,IEX,144.960000,100
2019-10-08 19:22:52.94592000,2019-10-08 19:22:52.94576561,16598458,T,IEX,145.085000,3
2019-10-08 19:25:32.946294016,2019-10-08 19:25:32.946278820,16702385,T,IEX,145.005000,2
2019-10-08 19:25:34.928955904,2019-10-08 19:25:34.928939406,16703703,T,IEX,145.000000,100
2019-10-08 19:26:03.959248896,2019-10-08 19:26:03.959230789,16717073,T,IEX,145.035000,100
2019-10-08 19:26:04.678640896,2019-10-08 19:26:04.678620961,16717514,T,IEX,145.035000,100
2019-10-08 19:26:05.181780992,2019-10-08 19:26:05.181759234,16717710,T,IEX,145.035000,100
2019-10-08 19:26:05.682556928,2019-10-08 19:26:05.682533272,16717871,T,IEX,145.035000,100
2019-10-08 19:31:01.973168896,2019-10-08 19:31:01.973149080,16901522,T,IEX,145.180000,11
2019-10-08 19:31:54.791344896,2019-10-08 19:31:54.791328769,16945509,T,IEX,145.155000,225
2019-10-08 19:32:02.435763968,2019-10-08 19:32:02.435745379,16950566,T,IEX,145.170000,26
2019-10-08 19:32:02.436059904,2019-10-08 19:32:02.436041675,16950568,T,IEX,145.170000,474
2019-10-08 19:33:13.8303104,2019-10-08 19:33:13.8285124,17006219,T,IEX,145.210000,100
2019-10-08 19:33:22.505555968,2019-10-08 19:33:22.505540941,17011549,T,IEX,145.210000,500
2019-10-08 19:36:22.725558016,2019-10-08 19:36:22.725540328,17158711,T,IEX,145.260000,134
2019-10-08 19:37:11.498665984,2019-10-08 19:37:11.498343813,17200439,T,IEX,145.180000,246
2019-10-08 19:38:37.265600000,2019-10-08 19:38:37.265584043,17276559,T,IEX,145.200000,100
2019-10-08 19:38:37.265623040,2019-10-08 19:38:37.265604332,17276560,T,IEX,145.200000,400
2019-10-08 19:41:37.980215040,2019-10-08 19:41:37.980192092,17464938,T,IEX,145.180000,100
2019-10-08 19:45:42.909817088,2019-10-08 19:45:42.909797154,17708695,T,IEX,145.125000,100
2019-10-08 19:46:12.957839104,2019-10-08 19:46:12.957820386,17738743,T,IEX,145.125000,100
2019-10-08 19:46:50.280553984,2019-10-08 19:46:50.280536534,17767182,T,IEX,145.130000,100
2019-10-08 19:47:26.743419904,2019-10-08 19:47:26.743403199,17796819,T,IEX,145.200000,100
2019-10-08 19:52:34.763309056,2019-10-08 19:52:34.763289056,18177463,T,IEX,145.225000,100
2019-10-08 19:53:06.831367936,2019-10-08 19:53:06.831347328,18206784,T,IEX,145.205000,100
2019-10-08 19:53:32.698667008,2019-10-08 19:53:32.698646026,18231589,T,IEX,145.220000,100
2019-10-08 19:53:52.725191936,2019-10-08 19:53:52.725173943,18253597,T,IEX,145.200000,100
2019-10-08 19:53:58.668694016,2019-10-08 19:53:58.668671289,18258414,T,IEX,145.190000,100
2019-10-08 19:54:09.691877120,2019-10-08 19:54:09.691860107,18271813,T,IEX,145.185000,100
2019-10-08 19:54:44.68434944,2019-10-08 19:54:44.68416063,18307970,T,IEX,145.155000,3
2019-10-08 19:54:44.68449024,2019-10-08 19:54:44.68432254,18307971,T,IEX,145.155000,2
2019-10-08 19:55:00.174906880,2019-10-08 19:55:00.174885679,18335187,T,IEX,145.140000,200
2019-10-08 19:55:00.210831104,2019-10-08 19:55:00.210810987,18335659,T,IEX,145.150000,100
2019-10-08 19:55:07.404386048,2019-10-08 19:55:07.404367115,18356648,T,IEX,145.150000,100
2019-10-08 19:55:27.652495872,2019-10-08 19:55:27.652480275,18392531,T,IEX,145.130000,100
2019-10-08 19:55:29.235063040,2019-10-08 19:55:29.235046168,18394232,T,IEX,145.135000,100
2019-10-08 19:55:33.381457920,2019-10-08 19:55:33.381438567,18399571,T,IEX,145.140000,11
2019-10-08 19:55:47.1541120,2019-10-08 19:55:47.1525733,18417885,T,IEX,145.150000,6
2019-10-08 19:55:51.837424128,2019-10-08 19:55:51.837408230,18423470,T,IEX,145.160000,100
2019-10-08 19:56:02.873776128,2019-10-08 19:56:02.873756709,18441254,T,IEX,145.150000,100
2019-10-08 19:56:03.738625024,2019-10-08 19:56:03.738608810,18442425,T,IEX,145.160000,200
2019-10-08 19:56:03.738640896,2019-10-08 19:56:03.738623499,18442426,T,IEX,145.160000,100
2019-10-08 19:56:03.738654976,2019-10-08 19:56:03.738639355,18442427,T,IEX,145.160000,4
2019-10-08 19:56:03.738673920,2019-10-08 19:56:03.738657260,18442428,T,IEX,145.160000,4
2019-10-08 19:56:06.96715008,2019-10-08 19:56:06.96695742,18445597,T,IEX,145.140000,100
2019-10-08 19:56:10.377775104,2019-10-08 19:56:10.377756952,18451511,T,IEX,145.160000,100
2019-10-08 19:56:10.378607104,2019-10-08 19:56:10.378584660,18451545,T,IEX,145.150000,100
2019-10-08 19:56:10.382107904,2019-10-08 19:56:10.382090909,18451642,T,IEX,145.160000,100
2019-10-08 19:56:13.386672896,2019-10-08 19:56:13.386655001,18455860,T,IEX,145.160000,3
2019-10-08 19:56:30.349707008,2019-10-08 19:56:30.349691622,18479118,T,IEX,145.160000,1000
2019-10-08 19:56:30.351842048,2019-10-08 19:56:30.351823536,18479122,T,IEX,145.160000,82
2019-10-08 19:56:44.678969088,2019-10-08 19:56:44.678951130,18497218,T,IEX,145.145000,100
2019-10-08 19:56:47.22095104,2019-10-08 19:56:47.22077754,18500841,T,IEX,145.155000,100
2019-10-08 19:56:47.785708032,2019-10-08 19:56:47.785689451,18501975,T,IEX,145.180000,100
2019-10-08 19:56:47.785722880,2019-10-08 19:56:47.785704426,18501976,T,IEX,145.180000,900
2019-10-08 19:56:52.676173056,2019-10-08 19:56:52.676153102,18508526,T,IEX,145.180000,100
2019-10-08 19:56:52.676211968,2019-10-08 19:56:52.676194791,18508528,T,IEX,145.180000,1000
2019-10-08 19:56:52.676587008,2019-10-08 19:56:52.676569394,18508532,T,IEX,145.180000,100
2019-10-08 19:57:02.642096128,2019-10-08 19:57:02.642078785,18523849,T,IEX,145.185000,100
2019-10-08 19:57:12.445114112,2019-10-08 19:57:12.445098623,18537904,T,IEX,145.180000,100
2019-10-08 19:57:18.138683904,2019-10-08 19:57:18.138666132,18545300,T,IEX,145.175000,100
2019-10-08 19:57:18.588529920,2019-10-08 19:57:18.588511918,18545907,T,IEX,145.175000,100
2019-10-08 19:57:19.598961920,2019-10-08 19:57:19.598945368,18547090,T,IEX,145.175000,100
2019-10-08 19:57:20.599284992,2019-10-08 19:57:20.599265415,18547955,T,IEX,145.175000,100
2019-10-08 19:57:21.603272960,2019-10-08 19:57:21.603257671,18549711,T,IEX,145.175000,100
2019-10-08 19:57:22.604111104,2019-10-08 19:57:22.604094261,18551234,T,IEX,145.175000,100
2019-10-08 19:57:23.638600960,2019-10-08 19:57:23.638576543,18552174,T,IEX,145.175000,200
2019-10-08 19:57:24.685910016,2019-10-08 19:57:24.685891367,18554368,T,IEX,145.175000,100
2019-10-08 19:57:25.732716032,2019-10-08 19:57:25.732696761,18555841,T,IEX,145.175000,100
2019-10-08 19:57:29.43918080,2019-10-08 19:57:29.43898714,18560639,T,IEX,145.180000,2
2019-10-08 19:57:29.46380032,2019-10-08 19:57:29.46364073,18560653,T,IEX,145.175000,100
2019-10-08 19:57:30.562699008,2019-10-08 19:57:30.562681734,18563051,T,IEX,145.175000,100
2019-10-08 19:57:31.593890048,2019-10-08 19:57:31.593872828,18564679,T,IEX,145.175000,100
2019-10-08 19:57:32.589575936,2019-10-08 19:57:32.589557269,18565898,T,IEX,145.175000,100
2019-10-08 19:57:33.447435008,2019-10-08 19:57:33.447415885,18566786,T,IEX,145.210000,100
2019-10-08 19:57:33.473090048,2019-10-08 19:57:33.473068383,18566868,T,IEX,145.200000,100
2019-10-08 19:57:39.827553024,2019-10-08 19:57:39.827526195,18578401,T,IEX,145.220000,100
2019-10-08 19:57:51.573154048,2019-10-08 19:57:51.573138074,18593692,T,IEX,145.200000,100
2019-10-08 19:57:55.54013952,2019-10-08 19:57:55.53995053,18597076,T,IEX,145.195000,100
2019-10-08 19:57:59.880752128,2019-10-08 19:57:59.880733997,18602004,T,IEX,145.200000,2
2019-10-08 19:57:59.880772096,2019-10-08 19:57:59.880753810,18602005,T,IEX,145.200000,2
2019-10-08 19:58:10.13806080,2019-10-08 19:58:10.13788025,18623834,T,IEX,145.190000,100
2019-10-08 19:58:12.406284032,2019-10-08 19:58:12.406264657,18627876,T,IEX,145.200000,100
2019-10-08 19:58:25.838062080,2019-10-08 19:58:25.838043241,18649317,T,IEX,145.200000,100
2019-10-08 19:58:25.838080000,2019-10-08 19:58:25.838063409,18649318,T,IEX,145.200000,100
2019-10-08 19:58:31.349571072,2019-10-08 19:58:31.349551961,18660935,T,IEX,145.190000,1000
2019-10-08 19:58:31.349584896,2019-10-08 19:58:31.349566111,18660936,T,IEX,145.190000,100
2019-10-08 19:58:35.544965888,2019-10-08 19:58:35.544949245,18670133,T,IEX,145.180000,100
2019-10-08 19:58:35.557213952,2019-10-08 19:58:35.557197586,18670204,T,IEX,145.150000,100
2019-10-08 19:59:07.555283968,2019-10-08 19:59:07.555264747,18734130,T,IEX,145.135000,100
2019-10-08 19:59:07.556599040,2019-10-08 19:59:07.556583009,18734136,T,IEX,145.135000,37
2019-10-08 19:59:07.557146880,2019-10-08 19:59:07.557129128,18734139,T,IEX,145.135000,7
2019-10-08 19:59:07.557161984,2019-10-08 19:59:07.557145225,18734140,T,IEX,145.135000,4
2019-10-08 19:59:07.558320896,2019-10-08 19:59:07.558301801,18734141,T,IEX,145.135000,63
2019-10-08 19:59:09.106639104,2019-10-08 19:59:09.106621116,18737185,T,IEX,145.135000,106
2019-10-08 19:59:10.924570880,2019-10-08 19:59:10.924555404,18740947,T,IEX,145.135000,100
2019-10-08 19:59:10.925885952,2019-10-08 19:59:10.925869690,18740955,T,IEX,145.135000,100
2019-10-08 19:59:14.991450112,2019-10-08 19:59:14.991434129,18748656,T,IEX,145.135000,100
2019-10-08 19:59:17.984613888,2019-10-08 19:59:17.984597586,18753958,T,IEX,145.140000,23
2019-10-08 19:59:17.984748032,2019-10-08 19:59:17.984729526,18753961,T,IEX,145.140000,237
2019-10-08 19:59:17.985262080,2019-10-08 19:59:17.985243634,18753965,T,IEX,145.140000,345
2019-10-08 19:59:17.985326080,2019-10-08 19:59:17.985307977,18753967,T,IEX,145.140000,395
2019-10-08 19:59:23.444626944,2019-10-08 19:59:23.444609627,18761684,T,IEX,145.135000,100
2019-10-08 19:59:23.445628928,2019-10-08 19:59:23.445607461,18761685,T,IEX,145.135000,100
2019-10-08 19:59:25.95329024,2019-10-08 19:59:25.95313495,18764257,T,IEX,145.135000,90
2019-10-08 19:59:27.460689920,2019-10-08 19:59:27.460670365,18768465,T,IEX,145.135000,200
2019-10-08 19:59:28.770884096,2019-10-08 19:59:28.770863080,18770791,T,IEX,145.135000,109
2019-10-08 19:59:31.849960960,2019-10-08 19:59:31.849942823,18783994,T,IEX,145.135000,300
2019-10-08 19:59:33.771237120,2019-10-08 19:59:33.771217320,18794777,T,IEX,145.135000,109
2019-10-08 19:59:36.181372928,2019-10-08 19:59:36.181355398,18807157,T,IEX,145.135000,300
2019-10-08 19:59:41.768663040,2019-10-08 19:59:41.768646160,18831678,T,IEX,145.135000,434
2019-10-08 19:59:41.768672000,2019-10-08 19:59:41.768655863,18831679,T,IEX,145.135000,26
2019-10-08 19:59:41.768686080,2019-10-08 19:59:41.768669151,18831680,T,IEX,145.135000,6
2019-10-08 19:59:41.768698880,2019-10-08 19:59:41.768682395,18831681,T,IEX,145.135000,100
2019-10-08 19:59:41.768719872,2019-10-08 19:59:41.768701292,18831682,T,IEX,145.135000,34
2019-10-08 19:59:43.712681984,2019-10-08 19:59:43.712664215,18842981,T,IEX,145.145000,33
2019-10-08 19:59:45.920509952,2019-10-08 19:59:45.920482016,18856407,T,IEX,145.150000,100
2019-10-08 19:59:45.922022912,2019-10-08 19:59:45.922004267,18856507,T,IEX,145.145000,25
2019-10-08 19:59:45.922040064,2019-10-08 19:59:45.922020556,18856508,T,IEX,145.145000,75
2019-10-08 19:59:54.952932096,2019-10-08 19:59:54.952914253,18918890,T,IEX,145.180000,100
2019-10-08 19:59:56.352783104,2019-10-08 19:59:56.352764088,18929340,T,IEX,145.190000,100
