2019-10-24 13:30:36.931558912,2019-10-24 13:30:36.931531974,155768,T,IEX,134.940000,100
2019-10-24 13:31:04.472283904,2019-10-24 13:31:04.472259094,189408,T,IEX,134.980000,37
2019-10-24 13:31:17.891289088,2019-10-24 13:31:17.891268204,205392,T,IEX,134.980000,4
2019-10-24 13:32:34.935808000,2019-10-24 13:32:34.935790193,290145,T,IEX,134.810000,100
2019-10-24 13:32:46.175997952,2019-10-24 13:32:46.175978492,304205,T,IEX,134.830000,1
2019-10-24 13:34:25.527563008,2019-10-24 13:34:25.527545725,424004,T,IEX,134.810000,40
2019-10-24 13:35:57.228850944,2019-10-24 13:35:57.228835298,530714,T,IEX,134.790000,100
2019-10-24 13:36:00.720247040,2019-10-24 13:36:00.720227910,535395,T,IEX,134.730000,100
2019-10-24 13:36:01.394012928,2019-10-24 13:36:01.393996346,536751,T,IEX,134.700000,37
2019-10-24 13:36:01.430563072,2019-10-24 13:36:01.430545549,536792,T,IEX,134.695000,63
2019-10-24 13:37:14.465423872,2019-10-24 13:37:14.465408108,627254,T,IEX,134.620000,100
2019-10-24 13:37:30.483774976,2019-10-24 13:37:30.483754031,643064,T,IEX,134.610000,50
2019-10-24 13:37:38.480275968,2019-10-24 13:37:38.480260242,650141,T,IEX,134.590000,50
2019-10-24 13:37:38.480304128,2019-10-24 13:37:38.480289383,650143,T,IEX,134.580000,50
2019-10-24 13:37:45.152442112,2019-10-24 13:37:45.152426931,656967,T,IEX,134.580000,74
2019-10-24 13:37:45.153563904,2019-10-24 13:37:45.153546109,656969,T,IEX,134.580000,74
2019-10-24 13:37:47.46893056,2019-10-24 13:37:47.46874929,658813,T,IEX,134.540000,2
2019-10-24 13:37:57.286478080,2019-10-24 13:37:57.286452938,668917,T,IEX,134.475000,100
2019-10-24 13:38:10.766395904,2019-10-24 13:38:10.766380944,682052,T,IEX,134.570000,100
2019-10-24 13:38:20.919642880,2019-10-24 13:38:20.919620930,693455,T,IEX,134.530000,100
2019-10-24 13:38:25.521679104,2019-10-24 13:38:25.521659170,698584,T,IEX,134.520000,2
2019-10-24 13:38:30.386533120,2019-10-24 13:38:30.386517158,704717,T,IEX,134.470000,100
2019-10-24 13:38:51.267262976,2019-10-24 13:38:51.267248078,725603,T,IEX,134.445000,126
2019-10-24 13:39:05.94195968,2019-10-24 13:39:05.94180795,743571,T,IEX,134.490000,50
2019-10-24 13:40:56.131915008,2019-10-24 13:40:56.131896852,849951,T,IEX,134.570000,100
2019-10-24 13:42:45.739838976,2019-10-24 13:42:45.739820894,950147,T,IEX,134.585000,100
2019-10-24 13:42:54.94345984,2019-10-24 13:42:54.94326499,958213,T,IEX,134.560000,1
2019-10-24 13:44:33.91962880,2019-10-24 13:44:33.91943826,1032014,T,IEX,134.740000,100
2019-10-24 13:47:57.913997056,2019-10-24 13:47:57.913979520,1242082,T,IEX,134.830000,100
2019-10-24 13:48:01.222778880,2019-10-24 13:48:01.222756169,1248809,T,IEX,134.735000,100
2019-10-24 13:48:01.222789888,2019-10-24 13:48:01.222772317,1248810,T,IEX,134.735000,100
2019-10-24 13:48:01.224073984,2019-10-24 13:48:01.224056900,1248820,T,IEX,134.735000,100
2019-10-24 13:48:01.225912064,2019-10-24 13:48:01.225888964,1248838,T,IEX,134.735000,100
2019-10-24 13:48:01.653413120,2019-10-24 13:48:01.653393918,1251204,T,IEX,134.700000,100
2019-10-24 13:48:06.320681984,2019-10-24 13:48:06.320663908,1259503,T,IEX,134.690000,100
2019-10-24 13:48:55.864785920,2019-10-24 13:48:55.864768668,1322267,T,IEX,134.700000,100
2019-10-24 13:49:05.387792896,2019-10-24 13:49:05.387773679,1333215,T,IEX,134.640000,20
2019-10-24 13:49:28.742889984,2019-10-24 13:49:28.742873541,1356328,T,IEX,134.610000,100
2019-10-24 13:49:44.331527936,2019-10-24 13:49:44.331504951,1371598,T,IEX,134.520000,100
2019-10-24 13:51:12.167072000,2019-10-24 13:51:12.167055438,1465626,T,IEX,134.350000,18
2019-10-24 13:51:42.187662080,2019-10-24 13:51:42.187646127,1499450,T,IEX,134.240000,100
2019-10-24 13:51:42.196754944,2019-10-24 13:51:42.196736765,1499462,T,IEX,134.220000,100
2019-10-24 13:51:42.196772096,2019-10-24 13:51:42.196755675,1499463,T,IEX,134.220000,100
2019-10-24 13:51:42.200978944,2019-10-24 13:51:42.200961105,1499473,T,IEX,134.210000,100
2019-10-24 13:52:06.962528000,2019-10-24 13:52:06.962511636,1523388,T,IEX,134.100000,100
2019-10-24 13:53:04.33911040,2019-10-24 13:53:04.33889139,1578341,T,IEX,134.060000,100
2019-10-24 13:53:04.33918976,2019-10-24 13:53:04.33897395,1578342,T,IEX,134.060000,200
2019-10-24 13:54:28.892690944,2019-10-24 13:54:28.892671863,1657735,T,IEX,133.920000,100
2019-10-24 13:55:19.668719104,2019-10-24 13:55:19.668694745,1707042,T,IEX,133.860000,74
2019-10-24 13:56:00.197231104,2019-10-24 13:56:00.197216146,1747124,T,IEX,133.760000,1
2019-10-24 13:58:45.525703936,2019-10-24 13:58:45.525687971,1905110,T,IEX,133.940000,100
2019-10-24 13:58:45.526330880,2019-10-24 13:58:45.526314151,1905111,T,IEX,133.970000,100
2019-10-24 13:58:51.741307904,2019-10-24 13:58:51.741286579,1910264,T,IEX,133.890000,100
2019-10-24 13:59:20.709622016,2019-10-24 13:59:20.709605667,1933118,T,IEX,133.980000,27
2019-10-24 13:59:22.387960064,2019-10-24 13:59:22.387939956,1935021,T,IEX,134.010000,100
2019-10-24 13:59:22.532327936,2019-10-24 13:59:22.532312198,1935111,T,IEX,134.010000,400
2019-10-24 13:59:30.551546880,2019-10-24 13:59:30.551530111,1941118,T,IEX,134.030000,100
2019-10-24 13:59:30.551591936,2019-10-24 13:59:30.551574739,1941120,T,IEX,134.030000,100
2019-10-24 13:59:56.336363008,2019-10-24 13:59:56.336342667,1958875,T,IEX,134.060000,100
2019-10-24 14:00:17.643930880,2019-10-24 14:00:17.643912510,1976922,T,IEX,134.010000,100
2019-10-24 14:00:43.985337088,2019-10-24 14:00:43.985319227,2003511,T,IEX,133.990000,37
2019-10-24 14:01:13.660571904,2019-10-24 14:01:13.660552428,2036443,T,IEX,134.070000,10
2019-10-24 14:01:33.260492032,2019-10-24 14:01:33.260473736,2053479,T,IEX,134.080000,87
2019-10-24 14:01:33.260967936,2019-10-24 14:01:33.260947292,2053505,T,IEX,134.080000,11
2019-10-24 14:01:33.261064960,2019-10-24 14:01:33.261046721,2053508,T,IEX,134.080000,2
2019-10-24 14:01:33.273575936,2019-10-24 14:01:33.273558079,2053632,T,IEX,134.070000,100
2019-10-24 14:01:33.273680896,2019-10-24 14:01:33.273664141,2053633,T,IEX,134.070000,100
2019-10-24 14:02:02.100910080,2019-10-24 14:02:02.100891607,2085168,T,IEX,133.920000,100
2019-10-24 14:02:06.219791104,2019-10-24 14:02:06.219773119,2096049,T,IEX,133.875000,100
2019-10-24 14:03:04.223372032,2019-10-24 14:03:04.223349163,2168203,T,IEX,133.825000,100
2019-10-24 14:04:06.965604096,2019-10-24 14:04:06.965585041,2229056,T,IEX,133.880000,100
2019-10-24 14:04:24.44247040,2019-10-24 14:04:24.44229019,2251814,T,IEX,133.850000,100
2019-10-24 14:04:43.995538944,2019-10-24 14:04:43.995518946,2273309,T,IEX,133.890000,89
2019-10-24 14:04:43.995602944,2019-10-24 14:04:43.995585259,2273311,T,IEX,133.890000,37
2019-10-24 14:04:43.995641088,2019-10-24 14:04:43.995624627,2273313,T,IEX,133.890000,97
2019-10-24 14:05:00.207076096,2019-10-24 14:05:00.207059993,2291021,T,IEX,133.830000,200
2019-10-24 14:05:49.913253120,2019-10-24 14:05:49.913233432,2339377,T,IEX,133.825000,100
2019-10-24 14:08:53.293402112,2019-10-24 14:08:53.293380465,2509787,T,IEX,133.930000,100
2019-10-24 14:09:08.885072896,2019-10-24 14:09:08.885056436,2523408,T,IEX,133.900000,100
2019-10-24 14:10:32.917701888,2019-10-24 14:10:32.917681641,2597886,T,IEX,133.870000,100
2019-10-24 14:11:24.319482112,2019-10-24 14:11:24.319463492,2637404,T,IEX,133.815000,100
2019-10-24 14:11:54.814590976,2019-10-24 14:11:54.814573581,2662982,T,IEX,133.850000,100
2019-10-24 14:13:03.435927040,2019-10-24 14:13:03.435908171,2714260,T,IEX,133.810000,9
2019-10-24 14:13:56.227639040,2019-10-24 14:13:56.227619986,2757550,T,IEX,133.800000,100
2019-10-24 14:13:56.230577920,2019-10-24 14:13:56.230562275,2757553,T,IEX,133.795000,1
2019-10-24 14:14:08.906132992,2019-10-24 14:14:08.906112821,2769692,T,IEX,133.790000,45
2019-10-24 14:14:13.468040960,2019-10-24 14:14:13.468021933,2772459,T,IEX,133.785000,355
2019-10-24 14:14:21.683697920,2019-10-24 14:14:21.683677040,2778420,T,IEX,133.770000,200
2019-10-24 14:14:23.491035904,2019-10-24 14:14:23.491017719,2779895,T,IEX,133.770000,1
2019-10-24 14:14:23.491054080,2019-10-24 14:14:23.491036573,2779896,T,IEX,133.770000,22
2019-10-24 14:14:23.491063040,2019-10-24 14:14:23.491046264,2779897,T,IEX,133.770000,77
2019-10-24 14:14:32.102919936,2019-10-24 14:14:32.102899955,2787067,T,IEX,133.720000,100
2019-10-24 14:14:32.150827008,2019-10-24 14:14:32.150806426,2787084,T,IEX,133.745000,100
2019-10-24 14:14:32.221203968,2019-10-24 14:14:32.221186331,2787112,T,IEX,133.745000,37
2019-10-24 14:14:32.221243904,2019-10-24 14:14:32.221228521,2787113,T,IEX,133.745000,9
2019-10-24 14:14:32.221259008,2019-10-24 14:14:32.221243459,2787114,T,IEX,133.745000,54
2019-10-24 14:14:32.221267968,2019-10-24 14:14:32.221251836,2787115,T,IEX,133.745000,69
2019-10-24 14:14:32.221282048,2019-10-24 14:14:32.221265346,2787116,T,IEX,133.745000,68
2019-10-24 14:14:34.301797120,2019-10-24 14:14:34.301778659,2788278,T,IEX,133.745000,32
2019-10-24 14:14:34.301808896,2019-10-24 14:14:34.301791635,2788279,T,IEX,133.745000,38
2019-10-24 14:14:34.469899008,2019-10-24 14:14:34.469878592,2788353,T,IEX,133.740000,200
2019-10-24 14:14:57.392079872,2019-10-24 14:14:57.392062526,2805291,T,IEX,133.750000,75
2019-10-24 14:14:57.394200064,2019-10-24 14:14:57.394181362,2805371,T,IEX,133.750000,25
2019-10-24 14:15:20.71062016,2019-10-24 14:15:20.71045322,2828098,T,IEX,133.750000,300
2019-10-24 14:17:23.472006912,2019-10-24 14:17:23.471988805,2924449,T,IEX,133.700000,100
2019-10-24 14:18:23.666780928,2019-10-24 14:18:23.666763054,2975027,T,IEX,133.620000,100
2019-10-24 14:18:23.669326080,2019-10-24 14:18:23.669306034,2975028,T,IEX,133.610000,131
2019-10-24 14:18:23.670277120,2019-10-24 14:18:23.670260364,2975030,T,IEX,133.610000,69
2019-10-24 14:21:37.664880128,2019-10-24 14:21:37.664860221,3130349,T,IEX,133.395000,100
2019-10-24 14:21:45.924649984,2019-10-24 14:21:45.924632186,3137067,T,IEX,133.410000,100
2019-10-24 14:23:08.196880896,2019-10-24 14:23:08.196864024,3197576,T,IEX,133.455000,100
2019-10-24 14:24:08.351971072,2019-10-24 14:24:08.351954959,3244251,T,IEX,133.490000,105
2019-10-24 14:24:08.451694080,2019-10-24 14:24:08.451678539,3244400,T,IEX,133.490000,100
2019-10-24 14:25:23.470034944,2019-10-24 14:25:23.470016373,3298100,T,IEX,133.485000,100
2019-10-24 14:25:24.736189952,2019-10-24 14:25:24.736172024,3299057,T,IEX,133.480000,100
2019-10-24 14:25:26.513080064,2019-10-24 14:25:26.513060647,3301158,T,IEX,133.465000,100
2019-10-24 14:26:13.666183936,2019-10-24 14:26:13.666163206,3330591,T,IEX,133.470000,100
2019-10-24 14:29:27.550498048,2019-10-24 14:29:27.550479892,3453748,T,IEX,133.505000,4
2019-10-24 14:29:32.600183040,2019-10-24 14:29:32.600163096,3456438,T,IEX,133.505000,20
2019-10-24 14:29:39.577575936,2019-10-24 14:29:39.577555512,3460108,T,IEX,133.505000,7
2019-10-24 14:30:12.431371008,2019-10-24 14:30:12.431352516,3480213,T,IEX,133.510000,10
2019-10-24 14:30:35.643953920,2019-10-24 14:30:35.643934805,3505655,T,IEX,133.445000,1
2019-10-24 14:30:35.651813888,2019-10-24 14:30:35.651794926,3505686,T,IEX,133.445000,13
2019-10-24 14:30:39.823040,2019-10-24 14:30:39.802885,3511113,T,IEX,133.410000,1
2019-10-24 14:30:59.266607104,2019-10-24 14:30:59.266587201,3538098,T,IEX,133.330000,1
2019-10-24 14:31:14.31920128,2019-10-24 14:31:14.31902615,3553072,T,IEX,133.335000,1
2019-10-24 14:31:15.8994048,2019-10-24 14:31:15.8972601,3553972,T,IEX,133.325000,2
2019-10-24 14:31:40.899843072,2019-10-24 14:31:40.899823822,3573041,T,IEX,133.395000,1
2019-10-24 14:31:43.548691968,2019-10-24 14:31:43.548673336,3575508,T,IEX,133.420000,2
2019-10-24 14:32:12.682010880,2019-10-24 14:32:12.681990998,3598737,T,IEX,133.410000,1
2019-10-24 14:32:43.585320960,2019-10-24 14:32:43.585302792,3618790,T,IEX,133.420000,1
2019-10-24 14:32:51.381991936,2019-10-24 14:32:51.381974476,3623536,T,IEX,133.410000,1
2019-10-24 14:33:15.358018048,2019-10-24 14:33:15.357995951,3640949,T,IEX,133.390000,1
2019-10-24 14:34:30.82254080,2019-10-24 14:34:30.82235749,3696036,T,IEX,133.460000,5
2019-10-24 14:35:05.180968960,2019-10-24 14:35:05.180950399,3722132,T,IEX,133.510000,1
2019-10-24 14:35:20.687943936,2019-10-24 14:35:20.687926005,3741376,T,IEX,133.595000,1
2019-10-24 14:36:21.263161088,2019-10-24 14:36:21.263142380,3785750,T,IEX,133.620000,100
2019-10-24 14:36:33.71474944,2019-10-24 14:36:33.71455337,3794779,T,IEX,133.610000,100
2019-10-24 14:36:40.414941952,2019-10-24 14:36:40.414920267,3798725,T,IEX,133.590000,1
2019-10-24 14:36:40.483248128,2019-10-24 14:36:40.483229948,3798767,T,IEX,133.590000,5
2019-10-24 14:36:47.479055872,2019-10-24 14:36:47.479036780,3804620,T,IEX,133.605000,1
2019-10-24 14:36:51.961373952,2019-10-24 14:36:51.961355171,3807424,T,IEX,133.625000,100
2019-10-24 14:37:01.314035968,2019-10-24 14:37:01.314018393,3816471,T,IEX,133.645000,1
2019-10-24 14:37:05.613837056,2019-10-24 14:37:05.613816383,3819751,T,IEX,133.655000,1
2019-10-24 14:37:13.282153984,2019-10-24 14:37:13.282134410,3826150,T,IEX,133.695000,1
2019-10-24 14:37:35.471002112,2019-10-24 14:37:35.470982445,3842001,T,IEX,133.720000,1
2019-10-24 14:37:45.348367104,2019-10-24 14:37:45.348345206,3848849,T,IEX,133.740000,1
2019-10-24 14:38:12.339324928,2019-10-24 14:38:12.339303911,3866496,T,IEX,133.745000,1
2019-10-24 14:38:30.24908032,2019-10-24 14:38:30.24888077,3879327,T,IEX,133.740000,1
2019-10-24 14:38:44.272344064,2019-10-24 14:38:44.272325101,3890199,T,IEX,133.770000,1
2019-10-24 14:39:41.798042880,2019-10-24 14:39:41.798025176,3928680,T,IEX,133.800000,1
2019-10-24 14:39:46.359877120,2019-10-24 14:39:46.359854271,3931625,T,IEX,133.805000,1
2019-10-24 14:40:15.271313920,2019-10-24 14:40:15.271291582,3950627,T,IEX,133.820000,1
2019-10-24 14:40:33.512163072,2019-10-24 14:40:33.512143751,3962207,T,IEX,133.880000,1
2019-10-24 14:40:40.753445888,2019-10-24 14:40:40.753425793,3967071,T,IEX,133.870000,100
2019-10-24 14:40:40.762657024,2019-10-24 14:40:40.762638251,3967075,T,IEX,133.865000,1
2019-10-24 14:40:41.509459968,2019-10-24 14:40:41.509441248,3967525,T,IEX,133.870000,100
2019-10-24 14:40:43.652386048,2019-10-24 14:40:43.652368673,3969340,T,IEX,133.870000,1
2019-10-24 14:40:57.627975936,2019-10-24 14:40:57.627957166,3979854,T,IEX,133.875000,1
2019-10-24 14:41:12.697142016,2019-10-24 14:41:12.697124650,3992500,T,IEX,133.910000,1
2019-10-24 14:41:20.452303104,2019-10-24 14:41:20.452287729,3997626,T,IEX,133.885000,1
2019-10-24 14:41:24.294660096,2019-10-24 14:41:24.294638857,4001334,T,IEX,133.895000,1
2019-10-24 14:41:46.408128000,2019-10-24 14:41:46.408112087,4017677,T,IEX,133.880000,1
2019-10-24 14:41:53.591676928,2019-10-24 14:41:53.591655259,4021628,T,IEX,133.885000,1
2019-10-24 14:41:59.788961024,2019-10-24 14:41:59.788942170,4025656,T,IEX,133.885000,1
2019-10-24 14:41:59.799550976,2019-10-24 14:41:59.799535273,4025668,T,IEX,133.885000,1
2019-10-24 14:42:02.32517888,2019-10-24 14:42:02.32500454,4027158,T,IEX,133.885000,98
2019-10-24 14:42:27.139968000,2019-10-24 14:42:27.139951224,4046036,T,IEX,133.905000,1
2019-10-24 14:42:44.403962880,2019-10-24 14:42:44.403943853,4057953,T,IEX,133.895000,1
2019-10-24 14:43:28.139712000,2019-10-24 14:43:28.139691721,4087618,T,IEX,133.890000,100
2019-10-24 14:43:28.758041088,2019-10-24 14:43:28.758020795,4088248,T,IEX,133.890000,1
2019-10-24 14:43:54.489202944,2019-10-24 14:43:54.489183649,4106901,T,IEX,133.915000,1
2019-10-24 14:44:02.359136000,2019-10-24 14:44:02.359117037,4112341,T,IEX,133.940000,1
2019-10-24 14:44:42.536935936,2019-10-24 14:44:42.536918127,4138097,T,IEX,133.940000,1
2019-10-24 14:44:58.618168064,2019-10-24 14:44:58.618147105,4146843,T,IEX,133.935000,1
2019-10-24 14:45:20.528478976,2019-10-24 14:45:20.528455238,4160598,T,IEX,133.930000,2
2019-10-24 14:45:48.111251968,2019-10-24 14:45:48.111234389,4176676,T,IEX,133.915000,1
2019-10-24 14:46:06.948167936,2019-10-24 14:46:06.948150755,4188348,T,IEX,133.915000,1
2019-10-24 14:46:07.149987072,2019-10-24 14:46:07.149968656,4188466,T,IEX,133.920000,100
2019-10-24 14:46:10.973515008,2019-10-24 14:46:10.973495649,4190425,T,IEX,133.920000,2
2019-10-24 14:46:21.795063040,2019-10-24 14:46:21.795045356,4197343,T,IEX,133.935000,1
2019-10-24 14:46:51.958888960,2019-10-24 14:46:51.958869720,4213362,T,IEX,133.935000,1
2019-10-24 14:47:32.259495936,2019-10-24 14:47:32.259475901,4241439,T,IEX,133.940000,1
2019-10-24 14:47:33.559459072,2019-10-24 14:47:33.559441515,4242973,T,IEX,133.940000,2
2019-10-24 14:48:14.553658880,2019-10-24 14:48:14.553642574,4265699,T,IEX,133.955000,1
2019-10-24 14:48:15.836804096,2019-10-24 14:48:15.836784403,4266437,T,IEX,133.940000,100
2019-10-24 14:48:29.902536960,2019-10-24 14:48:29.902521217,4273124,T,IEX,133.985000,100
2019-10-24 14:48:35.650330112,2019-10-24 14:48:35.650307797,4276144,T,IEX,133.980000,1
2019-10-24 14:48:56.884459008,2019-10-24 14:48:56.884438882,4287176,T,IEX,133.990000,100
2019-10-24 14:49:06.714192896,2019-10-24 14:49:06.714173381,4292779,T,IEX,133.975000,1
2019-10-24 14:49:06.794608128,2019-10-24 14:49:06.794590243,4292804,T,IEX,133.960000,2
2019-10-24 14:49:08.459920896,2019-10-24 14:49:08.459901637,4293553,T,IEX,133.960000,1
2019-10-24 14:49:12.309786880,2019-10-24 14:49:12.309769038,4296701,T,IEX,133.970000,100
2019-10-24 14:49:12.314667008,2019-10-24 14:49:12.314650617,4296709,T,IEX,133.970000,100
2019-10-24 14:49:15.519693056,2019-10-24 14:49:15.519671450,4298033,T,IEX,133.980000,1
2019-10-24 14:49:45.148794112,2019-10-24 14:49:45.148776817,4315243,T,IEX,133.985000,5
2019-10-24 14:49:58.507170048,2019-10-24 14:49:58.507153621,4322115,T,IEX,133.975000,1
2019-10-24 14:50:23.142969088,2019-10-24 14:50:23.142952424,4339542,T,IEX,133.915000,2
2019-10-24 14:50:23.182529024,2019-10-24 14:50:23.182505708,4339640,T,IEX,133.915000,100
2019-10-24 14:50:26.242458112,2019-10-24 14:50:26.242437125,4342328,T,IEX,133.915000,1
2019-10-24 14:50:45.624507904,2019-10-24 14:50:45.624486929,4354438,T,IEX,133.910000,1
2019-10-24 14:51:07.619917056,2019-10-24 14:51:07.619898991,4368301,T,IEX,133.895000,1
2019-10-24 14:51:07.709384960,2019-10-24 14:51:07.709364360,4368386,T,IEX,133.895000,1
2019-10-24 14:51:18.550348032,2019-10-24 14:51:18.550329111,4374686,T,IEX,133.890000,86
2019-10-24 14:51:25.831554048,2019-10-24 14:51:25.831535998,4377811,T,IEX,133.885000,1
2019-10-24 14:51:42.281410048,2019-10-24 14:51:42.281393947,4387654,T,IEX,133.870000,1
2019-10-24 14:52:44.50016000,2019-10-24 14:52:44.49994336,4421570,T,IEX,133.860000,100
2019-10-24 14:52:50.824984064,2019-10-24 14:52:50.824964010,4424748,T,IEX,133.810000,3
2019-10-24 14:52:51.732282880,2019-10-24 14:52:51.732264855,4425042,T,IEX,133.810000,82
2019-10-24 14:52:51.733476096,2019-10-24 14:52:51.733453399,4425043,T,IEX,133.810000,15
2019-10-24 14:52:54.944416000,2019-10-24 14:52:54.944397631,4426908,T,IEX,133.810000,2
2019-10-24 14:53:04.522905088,2019-10-24 14:53:04.522886160,4432162,T,IEX,133.800000,100
2019-10-24 14:53:04.522916096,2019-10-24 14:53:04.522899203,4432163,T,IEX,133.800000,100
2019-10-24 14:53:26.142473984,2019-10-24 14:53:26.142453971,4447232,T,IEX,133.825000,2
2019-10-24 14:53:29.544455936,2019-10-24 14:53:29.544438157,4449853,T,IEX,133.835000,1
2019-10-24 14:54:05.418671104,2019-10-24 14:54:05.418651159,4469071,T,IEX,133.840000,100
2019-10-24 14:54:05.429944064,2019-10-24 14:54:05.429923129,4469082,T,IEX,133.830000,100
2019-10-24 14:54:22.444422912,2019-10-24 14:54:22.444404422,4479041,T,IEX,133.810000,1
2019-10-24 14:54:40.622489088,2019-10-24 14:54:40.622473066,4489111,T,IEX,133.815000,300
2019-10-24 14:55:00.583069952,2019-10-24 14:55:00.583050976,4499288,T,IEX,133.730000,100
2019-10-24 14:55:00.648677888,2019-10-24 14:55:00.648661974,4499507,T,IEX,133.745000,300
2019-10-24 14:55:00.652158976,2019-10-24 14:55:00.652141108,4499510,T,IEX,133.745000,300
2019-10-24 14:55:08.181104128,2019-10-24 14:55:08.181083932,4504364,T,IEX,133.700000,100
2019-10-24 14:55:37.458615040,2019-10-24 14:55:37.458595699,4526058,T,IEX,133.605000,100
2019-10-24 14:56:28.856177920,2019-10-24 14:56:28.856159225,4566021,T,IEX,133.675000,100
2019-10-24 14:56:28.968556032,2019-10-24 14:56:28.968535321,4566126,T,IEX,133.680000,2
2019-10-24 14:56:56.136014080,2019-10-24 14:56:56.135995226,4583329,T,IEX,133.680000,100
2019-10-24 14:58:01.632918016,2019-10-24 14:58:01.632899817,4622191,T,IEX,133.765000,100
2019-10-24 14:58:01.963518976,2019-10-24 14:58:01.963498452,4622309,T,IEX,133.760000,100
2019-10-24 14:58:42.268837888,2019-10-24 14:58:42.268816326,4654230,T,IEX,133.770000,100
2019-10-24 14:58:56.24788992,2019-10-24 14:58:56.24770416,4664702,T,IEX,133.770000,20
2019-10-24 14:59:31.112180992,2019-10-24 14:59:31.112162891,4685165,T,IEX,133.750000,80
2019-10-24 14:59:52.179380992,2019-10-24 14:59:52.179360601,4698930,T,IEX,133.740000,100
2019-10-24 15:00:07.517416960,2019-10-24 15:00:07.517396325,4709651,T,IEX,133.770000,100
2019-10-24 15:00:26.569341952,2019-10-24 15:00:26.569323692,4722274,T,IEX,133.820000,200
2019-10-24 15:00:41.821171968,2019-10-24 15:00:41.821150243,4730945,T,IEX,133.820000,25
2019-10-24 15:00:41.822607872,2019-10-24 15:00:41.822591535,4730947,T,IEX,133.820000,75
2019-10-24 15:01:26.772994048,2019-10-24 15:01:26.772974906,4758678,T,IEX,133.875000,100
2019-10-24 15:01:45.64770048,2019-10-24 15:01:45.64751957,4770403,T,IEX,133.840000,100
2019-10-24 15:02:11.118825984,2019-10-24 15:02:11.118805363,4784235,T,IEX,133.820000,100
2019-10-24 15:02:22.917015040,2019-10-24 15:02:22.916999985,4792120,T,IEX,133.765000,100
2019-10-24 15:03:03.353613056,2019-10-24 15:03:03.353597114,4815317,T,IEX,133.730000,100
2019-10-24 15:03:17.977726976,2019-10-24 15:03:17.977706969,4827490,T,IEX,133.750000,100
2019-10-24 15:04:42.327728128,2019-10-24 15:04:42.327709411,4893217,T,IEX,133.825000,100
2019-10-24 15:05:58.648483072,2019-10-24 15:05:58.648464397,4943988,T,IEX,133.850000,14
2019-10-24 15:06:53.961938944,2019-10-24 15:06:53.961920297,4982223,T,IEX,133.870000,100
2019-10-24 15:06:53.962876928,2019-10-24 15:06:53.962857325,4982224,T,IEX,133.870000,100
2019-10-24 15:06:53.962895872,2019-10-24 15:06:53.962876941,4982225,T,IEX,133.870000,100
2019-10-24 15:07:06.476440064,2019-10-24 15:07:06.476419891,4989063,T,IEX,133.860000,100
2019-10-24 15:07:40.774821888,2019-10-24 15:07:40.774802503,5004903,T,IEX,133.825000,100
2019-10-24 15:08:24.836541952,2019-10-24 15:08:24.836525499,5031845,T,IEX,133.785000,100
2019-10-24 15:09:10.876047104,2019-10-24 15:09:10.876031055,5062327,T,IEX,133.900000,10
2019-10-24 15:09:57.166230016,2019-10-24 15:09:57.166208725,5091336,T,IEX,133.880000,100
2019-10-24 15:09:57.166676992,2019-10-24 15:09:57.166661103,5091338,T,IEX,133.880000,100
2019-10-24 15:10:26.66202112,2019-10-24 15:10:26.66184181,5109680,T,IEX,133.860000,100
2019-10-24 15:10:52.391190016,2019-10-24 15:10:52.391169107,5124685,T,IEX,133.870000,100
2019-10-24 15:11:05.576004096,2019-10-24 15:11:05.575983517,5132626,T,IEX,133.890000,100
2019-10-24 15:11:05.582822912,2019-10-24 15:11:05.582802731,5132628,T,IEX,133.890000,100
2019-10-24 15:11:05.582839040,2019-10-24 15:11:05.582822243,5132629,T,IEX,133.890000,100
2019-10-24 15:11:23.492058880,2019-10-24 15:11:23.492043438,5146300,T,IEX,133.880000,100
2019-10-24 15:11:35.900044032,2019-10-24 15:11:35.900026690,5156157,T,IEX,133.920000,100
2019-10-24 15:12:10.755465984,2019-10-24 15:12:10.755441854,5180231,T,IEX,133.930000,100
2019-10-24 15:12:13.932132096,2019-10-24 15:12:13.932110783,5182211,T,IEX,133.930000,100
2019-10-24 15:12:13.932147968,2019-10-24 15:12:13.932130321,5182212,T,IEX,133.930000,100
2019-10-24 15:13:23.696903936,2019-10-24 15:13:23.696885175,5225034,T,IEX,133.875000,100
2019-10-24 15:13:52.219159040,2019-10-24 15:13:52.219143705,5241220,T,IEX,133.840000,100
2019-10-24 15:14:13.760025088,2019-10-24 15:14:13.760004840,5253098,T,IEX,133.845000,100
2019-10-24 15:16:18.708069120,2019-10-24 15:16:18.708050654,5320620,T,IEX,133.910000,100
2019-10-24 15:16:22.625104896,2019-10-24 15:16:22.625088733,5323279,T,IEX,133.915000,100
2019-10-24 15:16:31.749187072,2019-10-24 15:16:31.749171080,5327968,T,IEX,133.905000,100
2019-10-24 15:17:51.247796992,2019-10-24 15:17:51.247777612,5366092,T,IEX,133.940000,100
2019-10-24 15:17:51.247873024,2019-10-24 15:17:51.247857002,5366093,T,IEX,133.940000,100
2019-10-24 15:18:47.263998976,2019-10-24 15:18:47.263983294,5394604,T,IEX,133.930000,100
2019-10-24 15:20:39.522468096,2019-10-24 15:20:39.522446187,5461204,T,IEX,133.960000,100
2019-10-24 15:20:59.17011968,2019-10-24 15:20:59.16993012,5472732,T,IEX,134.005000,100
2019-10-24 15:21:12.719642112,2019-10-24 15:21:12.719621323,5484245,T,IEX,134.010000,100
2019-10-24 15:21:16.792412928,2019-10-24 15:21:16.792393745,5486526,T,IEX,134.000000,100
2019-10-24 15:21:36.954102016,2019-10-24 15:21:36.954080103,5497128,T,IEX,133.970000,100
2019-10-24 15:22:33.51426048,2019-10-24 15:22:33.51409439,5529875,T,IEX,133.995000,100
2019-10-24 15:23:03.375756032,2019-10-24 15:23:03.375734938,5544402,T,IEX,134.005000,100
2019-10-24 15:23:03.375764992,2019-10-24 15:23:03.375750491,5544403,T,IEX,134.005000,100
2019-10-24 15:23:12.695521024,2019-10-24 15:23:12.695503348,5550992,T,IEX,134.025000,100
2019-10-24 15:23:33.167336960,2019-10-24 15:23:33.167318444,5562781,T,IEX,134.065000,100
2019-10-24 15:24:23.697573120,2019-10-24 15:24:23.697550733,5589799,T,IEX,134.070000,100
2019-10-24 15:24:24.408005120,2019-10-24 15:24:24.407983289,5590081,T,IEX,134.065000,1
2019-10-24 15:24:24.408016896,2019-10-24 15:24:24.407999301,5590082,T,IEX,134.065000,100
2019-10-24 15:24:24.425158912,2019-10-24 15:24:24.425139787,5590095,T,IEX,134.060000,100
2019-10-24 15:25:15.38194944,2019-10-24 15:25:15.38175639,5616134,T,IEX,134.095000,100
2019-10-24 15:26:07.134816000,2019-10-24 15:26:07.134797641,5643024,T,IEX,134.145000,100
2019-10-24 15:26:15.134151936,2019-10-24 15:26:15.134133774,5647707,T,IEX,134.115000,100
2019-10-24 15:26:15.324353024,2019-10-24 15:26:15.324337417,5647767,T,IEX,134.100000,100
2019-10-24 15:26:15.338352128,2019-10-24 15:26:15.338333397,5647781,T,IEX,134.100000,100
2019-10-24 15:26:31.477445888,2019-10-24 15:26:31.477426362,5656154,T,IEX,134.070000,100
2019-10-24 15:27:05.765659904,2019-10-24 15:27:05.765636358,5671706,T,IEX,134.070000,100
2019-10-24 15:27:43.137950976,2019-10-24 15:27:43.137929323,5694187,T,IEX,134.075000,100
2019-10-24 15:27:52.631983104,2019-10-24 15:27:52.631962268,5699623,T,IEX,134.070000,200
2019-10-24 15:28:35.845755904,2019-10-24 15:28:35.845738853,5723444,T,IEX,134.070000,200
2019-10-24 15:29:23.479612928,2019-10-24 15:29:23.479592281,5755957,T,IEX,134.090000,100
2019-10-24 15:29:23.795277056,2019-10-24 15:29:23.795259770,5756233,T,IEX,134.095000,100
2019-10-24 15:29:24.13530112,2019-10-24 15:29:24.13509264,5756339,T,IEX,134.080000,88
2019-10-24 15:29:33.915384064,2019-10-24 15:29:33.915361048,5761840,T,IEX,134.090000,100
2019-10-24 15:29:48.341702912,2019-10-24 15:29:48.341683082,5769511,T,IEX,134.120000,100
2019-10-24 15:30:00.642295040,2019-10-24 15:30:00.642276552,5781353,T,IEX,134.135000,100
2019-10-24 15:30:04.56800000,2019-10-24 15:30:04.56780680,5785459,T,IEX,134.140000,100
2019-10-24 15:30:52.173302016,2019-10-24 15:30:52.173282219,5831277,T,IEX,134.190000,100
2019-10-24 15:31:53.234248960,2019-10-24 15:31:53.234226169,5867007,T,IEX,134.160000,100
2019-10-24 15:32:52.630882048,2019-10-24 15:32:52.630862330,5898403,T,IEX,134.180000,100
2019-10-24 15:33:30.292721920,2019-10-24 15:33:30.292699046,5917949,T,IEX,134.145000,100
2019-10-24 15:34:06.511976960,2019-10-24 15:34:06.511959672,5936282,T,IEX,134.130000,100
2019-10-24 15:35:28.939105024,2019-10-24 15:35:28.939083627,5985413,T,IEX,134.195000,100
2019-10-24 15:36:36.546801920,2019-10-24 15:36:36.546784179,6021198,T,IEX,134.120000,1
2019-10-24 15:36:52.180896000,2019-10-24 15:36:52.180875637,6029371,T,IEX,134.120000,100
2019-10-24 15:38:23.185935104,2019-10-24 15:38:23.185917277,6076324,T,IEX,134.085000,100
2019-10-24 15:38:26.221195008,2019-10-24 15:38:26.221175557,6077420,T,IEX,134.080000,100
2019-10-24 15:38:59.795034880,2019-10-24 15:38:59.795016599,6092949,T,IEX,134.080000,100
2019-10-24 15:39:19.193355008,2019-10-24 15:39:19.193335738,6102990,T,IEX,134.045000,1
2019-10-24 15:39:55.190064896,2019-10-24 15:39:55.190043776,6121054,T,IEX,134.025000,100
2019-10-24 15:40:55.34288128,2019-10-24 15:40:55.34269335,6147829,T,IEX,134.020000,100
2019-10-24 15:41:26.192307968,2019-10-24 15:41:26.192286784,6163023,T,IEX,133.990000,100
2019-10-24 15:42:22.144851968,2019-10-24 15:42:22.144833286,6186124,T,IEX,133.975000,100
2019-10-24 15:42:22.154150912,2019-10-24 15:42:22.154133438,6186127,T,IEX,133.980000,100
2019-10-24 15:42:57.197254912,2019-10-24 15:42:57.197237701,6202298,T,IEX,134.010000,100
2019-10-24 15:44:23.575269888,2019-10-24 15:44:23.575252648,6237130,T,IEX,134.055000,100
2019-10-24 15:46:58.139821056,2019-10-24 15:46:58.139798868,6300586,T,IEX,134.070000,100
2019-10-24 15:48:09.778076928,2019-10-24 15:48:09.777815722,6334379,T,IEX,134.030000,1
2019-10-24 15:48:52.855895040,2019-10-24 15:48:52.855878567,6350280,T,IEX,134.025000,1
2019-10-24 15:48:52.877764096,2019-10-24 15:48:52.877746658,6350375,T,IEX,134.025000,2
2019-10-24 15:49:05.95254016,2019-10-24 15:49:05.95235039,6355835,T,IEX,134.020000,1
2019-10-24 15:51:37.901927936,2019-10-24 15:51:37.901911522,6443771,T,IEX,133.855000,100
2019-10-24 15:51:45.704081920,2019-10-24 15:51:45.704064543,6470269,T,IEX,134.020000,100
2019-10-24 15:52:25.897776896,2019-10-24 15:52:25.897758825,6533929,T,IEX,134.050000,55
2019-10-24 15:52:46.173113088,2019-10-24 15:52:46.173094954,6551365,T,IEX,134.015000,100
2019-10-24 15:54:56.750391040,2019-10-24 15:54:56.750373245,6629705,T,IEX,134.060000,100
2019-10-24 15:55:46.969009920,2019-10-24 15:55:46.968989523,6655643,T,IEX,134.020000,100
2019-10-24 15:56:08.991311104,2019-10-24 15:56:08.991291198,6668749,T,IEX,134.070000,100
2019-10-24 15:56:45.236634112,2019-10-24 15:56:45.236618562,6686332,T,IEX,134.065000,100
2019-10-24 15:59:24.631313920,2019-10-24 15:59:24.631293751,6773301,T,IEX,134.145000,100
2019-10-24 16:01:02.137181952,2019-10-24 16:01:02.137165297,6829746,T,IEX,134.240000,1
2019-10-24 16:01:45.890281984,2019-10-24 16:01:45.890264217,6856407,T,IEX,134.250000,1
2019-10-24 16:01:45.937235968,2019-10-24 16:01:45.937216845,6856441,T,IEX,134.250000,1
2019-10-24 16:01:47.78170880,2019-10-24 16:01:47.78151226,6857278,T,IEX,134.230000,100
2019-10-24 16:01:54.951066112,2019-10-24 16:01:54.951046280,6863032,T,IEX,134.260000,1
2019-10-24 16:02:24.294606080,2019-10-24 16:02:24.294589326,6881184,T,IEX,134.255000,100
2019-10-24 16:05:08.297084928,2019-10-24 16:05:08.297067437,6972562,T,IEX,134.140000,100
2019-10-24 16:05:30.712986112,2019-10-24 16:05:30.712970585,6991142,T,IEX,134.090000,2
2019-10-24 16:10:04.422684928,2019-10-24 16:10:04.422664999,7172457,T,IEX,134.015000,100
2019-10-24 16:10:16.548451072,2019-10-24 16:10:16.548433132,7184286,T,IEX,133.990000,100
2019-10-24 16:12:43.503390976,2019-10-24 16:12:43.503369439,7267270,T,IEX,133.920000,100
2019-10-24 16:15:41.449021952,2019-10-24 16:15:41.449002393,7372199,T,IEX,133.830000,101
2019-10-24 16:15:41.450699008,2019-10-24 16:15:41.450681189,7372201,T,IEX,133.830000,99
2019-10-24 16:15:41.450718976,2019-10-24 16:15:41.450701036,7372202,T,IEX,133.830000,2
2019-10-24 16:16:21.19504896,2019-10-24 16:16:21.19490625,7409925,T,IEX,133.770000,100
2019-10-24 16:17:04.393135104,2019-10-24 16:17:04.393117822,7441521,T,IEX,133.710000,2
2019-10-24 16:18:52.850227968,2019-10-24 16:18:52.850208352,7503875,T,IEX,133.720000,44
2019-10-24 16:20:02.460438016,2019-10-24 16:20:02.460418093,7548636,T,IEX,133.780000,100
2019-10-24 16:20:50.370971904,2019-10-24 16:20:50.370952862,7576014,T,IEX,133.760000,7
2019-10-24 16:21:31.942252032,2019-10-24 16:21:31.942236172,7595877,T,IEX,133.715000,100
2019-10-24 16:21:42.577367040,2019-10-24 16:21:42.577350381,7604449,T,IEX,133.690000,100
2019-10-24 16:22:54.147738880,2019-10-24 16:22:54.147720333,7634332,T,IEX,133.680000,1
2019-10-24 16:23:17.257592064,2019-10-24 16:23:17.257573543,7645977,T,IEX,133.700000,100
2019-10-24 16:27:16.656335104,2019-10-24 16:27:16.656315236,7768959,T,IEX,133.760000,1
2019-10-24 16:27:17.617624064,2019-10-24 16:27:17.617604952,7769438,T,IEX,133.750000,93
2019-10-24 16:29:13.228453888,2019-10-24 16:29:13.228433807,7829491,T,IEX,133.820000,1
2019-10-24 16:29:20.309082880,2019-10-24 16:29:20.309062050,7832857,T,IEX,133.830000,100
2019-10-24 16:29:29.346606080,2019-10-24 16:29:29.346588366,7835760,T,IEX,133.830000,14
2019-10-24 16:29:37.155976960,2019-10-24 16:29:37.155959408,7838715,T,IEX,133.830000,378
2019-10-24 16:29:41.482440960,2019-10-24 16:29:41.482424961,7840983,T,IEX,133.830000,100
2019-10-24 16:29:45.705231872,2019-10-24 16:29:45.705213842,7843822,T,IEX,133.845000,1
2019-10-24 16:30:08.232550912,2019-10-24 16:30:08.232535607,7852854,T,IEX,133.840000,300
2019-10-24 16:30:41.417499904,2019-10-24 16:30:41.417481931,7867130,T,IEX,133.830000,2
2019-10-24 16:31:18.628484096,2019-10-24 16:31:18.628461960,7881527,T,IEX,133.805000,3
2019-10-24 16:31:42.369765120,2019-10-24 16:31:42.369746851,7890468,T,IEX,133.815000,1
2019-10-24 16:31:51.713999104,2019-10-24 16:31:51.713979614,7894261,T,IEX,133.830000,200
2019-10-24 16:32:12.361240064,2019-10-24 16:32:12.361220751,7902540,T,IEX,133.820000,1
2019-10-24 16:32:27.960174080,2019-10-24 16:32:27.960154254,7909153,T,IEX,133.830000,1
2019-10-24 16:32:34.597629952,2019-10-24 16:32:34.597614896,7913584,T,IEX,133.840000,1
2019-10-24 16:32:36.129309952,2019-10-24 16:32:36.129289746,7914253,T,IEX,133.820000,78
2019-10-24 16:32:45.687468032,2019-10-24 16:32:45.687446620,7919026,T,IEX,133.830000,100
2019-10-24 16:32:58.376495104,2019-10-24 16:32:58.376476792,7924029,T,IEX,133.830000,6
2019-10-24 16:33:06.85895936,2019-10-24 16:33:06.85878715,7927230,T,IEX,133.835000,1
2019-10-24 16:33:28.347097088,2019-10-24 16:33:28.347078955,7936743,T,IEX,133.820000,1
2019-10-24 16:33:32.458131968,2019-10-24 16:33:32.458114935,7938655,T,IEX,133.820000,200
2019-10-24 16:33:42.466064896,2019-10-24 16:33:42.466045961,7944189,T,IEX,133.850000,1
2019-10-24 16:33:43.365088000,2019-10-24 16:33:43.365068635,7944659,T,IEX,133.860000,1
2019-10-24 16:34:06.50836992,2019-10-24 16:34:06.50818725,7953948,T,IEX,133.850000,1
2019-10-24 16:34:06.61832960,2019-10-24 16:34:06.61814158,7953956,T,IEX,133.860000,1
2019-10-24 16:34:28.206170112,2019-10-24 16:34:28.206150750,7964232,T,IEX,133.865000,1
2019-10-24 16:34:37.392732928,2019-10-24 16:34:37.392714529,7967964,T,IEX,133.870000,1
2019-10-24 16:34:45.37154048,2019-10-24 16:34:45.37136393,7973904,T,IEX,133.890000,1
2019-10-24 16:35:19.326944000,2019-10-24 16:35:19.326926851,7994482,T,IEX,133.930000,1
2019-10-24 16:35:22.792709120,2019-10-24 16:35:22.792690253,7996405,T,IEX,133.905000,1
2019-10-24 16:35:41.507291904,2019-10-24 16:35:41.507272434,8006346,T,IEX,133.940000,2
2019-10-24 16:35:41.918995968,2019-10-24 16:35:41.918977716,8006543,T,IEX,133.945000,2
2019-10-24 16:35:56.133756928,2019-10-24 16:35:56.133736352,8015194,T,IEX,133.970000,1
2019-10-24 16:36:15.923493120,2019-10-24 16:36:15.923476837,8023414,T,IEX,133.970000,23
2019-10-24 16:36:23.523983104,2019-10-24 16:36:23.523959930,8027211,T,IEX,133.930000,300
2019-10-24 16:36:42.571649024,2019-10-24 16:36:42.571628341,8032696,T,IEX,133.930000,1
2019-10-24 16:37:05.635741952,2019-10-24 16:37:05.635724574,8040774,T,IEX,133.935000,5
2019-10-24 16:37:06.43986944,2019-10-24 16:37:06.43967817,8040921,T,IEX,133.940000,1
2019-10-24 16:37:28.112216064,2019-10-24 16:37:28.112195030,8048893,T,IEX,133.940000,1
2019-10-24 16:38:29.928562944,2019-10-24 16:38:29.928545488,8075705,T,IEX,133.985000,1
2019-10-24 16:38:42.260034048,2019-10-24 16:38:42.260016478,8081957,T,IEX,133.980000,40
2019-10-24 16:38:42.260050944,2019-10-24 16:38:42.260034259,8081958,T,IEX,133.980000,2
2019-10-24 16:38:55.71635968,2019-10-24 16:38:55.71617008,8086676,T,IEX,133.950000,1
2019-10-24 16:39:03.368301056,2019-10-24 16:39:03.368285727,8091111,T,IEX,133.940000,1
2019-10-24 16:39:03.580462080,2019-10-24 16:39:03.580440650,8091227,T,IEX,133.950000,1
2019-10-24 16:39:36.380801024,2019-10-24 16:39:36.380783633,8105810,T,IEX,133.980000,1
2019-10-24 16:39:53.798146048,2019-10-24 16:39:53.798127124,8111446,T,IEX,133.980000,1
2019-10-24 16:40:23.555034880,2019-10-24 16:40:23.555014244,8122269,T,IEX,133.970000,300
2019-10-24 16:40:42.370784000,2019-10-24 16:40:42.370765744,8127884,T,IEX,133.970000,1
2019-10-24 16:40:52.101587968,2019-10-24 16:40:52.101571611,8132629,T,IEX,133.985000,1
2019-10-24 16:40:52.105926912,2019-10-24 16:40:52.105906551,8132631,T,IEX,133.990000,100
2019-10-24 16:40:53.341848064,2019-10-24 16:40:53.341826822,8133093,T,IEX,133.990000,100
2019-10-24 16:40:58.787237888,2019-10-24 16:40:58.787215708,8135437,T,IEX,133.995000,1
2019-10-24 16:41:03.866032896,2019-10-24 16:41:03.866015119,8137716,T,IEX,133.985000,1
2019-10-24 16:41:04.629713920,2019-10-24 16:41:04.629695157,8138234,T,IEX,133.985000,1
2019-10-24 16:41:11.317760000,2019-10-24 16:41:11.317739075,8140495,T,IEX,133.970000,1
2019-10-24 16:41:27.737918976,2019-10-24 16:41:27.737900613,8148110,T,IEX,133.955000,1
2019-10-24 16:41:42.408097024,2019-10-24 16:41:42.408079597,8153068,T,IEX,133.940000,1
2019-10-24 16:42:21.535254016,2019-10-24 16:42:21.535229144,8165723,T,IEX,133.930000,1
2019-10-24 16:42:28.495395072,2019-10-24 16:42:28.495372879,8168993,T,IEX,133.945000,100
2019-10-24 16:42:30.627456000,2019-10-24 16:42:30.627438447,8169950,T,IEX,133.945000,1
2019-10-24 16:42:37.627804928,2019-10-24 16:42:37.627785428,8171763,T,IEX,133.960000,100
2019-10-24 16:42:37.771491072,2019-10-24 16:42:37.771469942,8171807,T,IEX,133.965000,1
2019-10-24 16:42:45.229596928,2019-10-24 16:42:45.229579084,8173918,T,IEX,133.960000,1
2019-10-24 16:43:42.469277952,2019-10-24 16:43:42.469262529,8195400,T,IEX,133.940000,1
2019-10-24 16:43:57.782091008,2019-10-24 16:43:57.782069686,8201379,T,IEX,133.960000,1
2019-10-24 16:44:37.794388992,2019-10-24 16:44:37.794369991,8215339,T,IEX,133.970000,1
2019-10-24 16:44:37.802754048,2019-10-24 16:44:37.802732415,8215340,T,IEX,133.970000,1
2019-10-24 16:44:39.84346880,2019-10-24 16:44:39.84326811,8215565,T,IEX,133.980000,200
2019-10-24 16:44:40.16801024,2019-10-24 16:44:40.16783364,8215812,T,IEX,133.985000,1
2019-10-24 16:45:02.156135936,2019-10-24 16:45:02.156118374,8223211,T,IEX,134.005000,200
2019-10-24 16:45:04.760555008,2019-10-24 16:45:04.760534483,8224221,T,IEX,134.005000,1
2019-10-24 16:45:18.394512896,2019-10-24 16:45:18.394492499,8228995,T,IEX,134.020000,1
2019-10-24 16:45:40.45321984,2019-10-24 16:45:40.45304356,8235154,T,IEX,134.010000,1
2019-10-24 16:45:43.467066112,2019-10-24 16:45:43.467044955,8236681,T,IEX,134.015000,1
2019-10-24 16:45:44.73512960,2019-10-24 16:45:44.73495001,8236863,T,IEX,134.015000,1
2019-10-24 16:45:50.645192960,2019-10-24 16:45:50.645177069,8239013,T,IEX,134.015000,1
2019-10-24 16:46:18.60576000,2019-10-24 16:46:18.60554476,8247279,T,IEX,134.035000,1
2019-10-24 16:46:19.51066880,2019-10-24 16:46:19.51046368,8248001,T,IEX,134.035000,90
2019-10-24 16:46:20.963564032,2019-10-24 16:46:20.963545398,8248692,T,IEX,134.040000,1
2019-10-24 16:46:42.612838912,2019-10-24 16:46:42.612821593,8256943,T,IEX,134.035000,1
2019-10-24 16:46:43.391450880,2019-10-24 16:46:43.391432500,8257234,T,IEX,134.030000,2
2019-10-24 16:47:05.432911104,2019-10-24 16:47:05.432892657,8268614,T,IEX,134.040000,1
2019-10-24 16:47:09.432929024,2019-10-24 16:47:09.432908186,8271956,T,IEX,134.065000,1
2019-10-24 16:47:42.655715072,2019-10-24 16:47:42.655697255,8289156,T,IEX,134.105000,1
2019-10-24 16:48:01.420339968,2019-10-24 16:48:01.420320843,8295844,T,IEX,134.115000,1
2019-10-24 16:48:03.569671936,2019-10-24 16:48:03.569651126,8297000,T,IEX,134.120000,1
2019-10-24 16:48:35.719128064,2019-10-24 16:48:35.719111992,8308272,T,IEX,134.155000,1
2019-10-24 16:48:42.681818880,2019-10-24 16:48:42.681798207,8310403,T,IEX,134.155000,1
2019-10-24 16:48:51.926372096,2019-10-24 16:48:51.926353167,8313335,T,IEX,134.160000,1
2019-10-24 16:49:25.592410880,2019-10-24 16:49:25.592393484,8323895,T,IEX,134.150000,1
2019-10-24 16:49:36.971778048,2019-10-24 16:49:36.971760475,8327244,T,IEX,134.145000,1
2019-10-24 16:50:05.774395904,2019-10-24 16:50:05.774375614,8337605,T,IEX,134.120000,100
2019-10-24 16:50:42.792866048,2019-10-24 16:50:42.792847960,8352600,T,IEX,134.100000,1
2019-10-24 16:50:59.481594112,2019-10-24 16:50:59.481574500,8359106,T,IEX,134.080000,100
2019-10-24 16:50:59.492207104,2019-10-24 16:50:59.492188290,8359110,T,IEX,134.080000,100
2019-10-24 16:51:03.290864896,2019-10-24 16:51:03.290844990,8360706,T,IEX,134.080000,3
2019-10-24 16:51:42.822097920,2019-10-24 16:51:42.822080837,8375763,T,IEX,134.080000,1
2019-10-24 16:51:43.434950912,2019-10-24 16:51:43.434931907,8376133,T,IEX,134.090000,100
2019-10-24 16:51:43.435380992,2019-10-24 16:51:43.435364121,8376135,T,IEX,134.090000,4
2019-10-24 16:52:09.561517056,2019-10-24 16:52:09.561495696,8385592,T,IEX,134.100000,100
2019-10-24 16:52:26.219190016,2019-10-24 16:52:26.219172882,8394540,T,IEX,134.100000,1
2019-10-24 16:52:42.913465088,2019-10-24 16:52:42.913447201,8401193,T,IEX,134.115000,5
2019-10-24 16:53:03.309779968,2019-10-24 16:53:03.309760769,8407963,T,IEX,134.115000,1
2019-10-24 16:53:09.898578944,2019-10-24 16:53:09.898560414,8410195,T,IEX,134.115000,1
2019-10-24 16:53:41.922164992,2019-10-24 16:53:41.922146921,8419526,T,IEX,134.125000,1
2019-10-24 16:53:53.620903936,2019-10-24 16:53:53.620886053,8422254,T,IEX,134.150000,2
2019-10-24 16:54:06.30964992,2019-10-24 16:54:06.30941412,8428150,T,IEX,134.150000,1
2019-10-24 16:54:53.931686912,2019-10-24 16:54:53.931669665,8443400,T,IEX,134.135000,1
2019-10-24 16:55:06.155398912,2019-10-24 16:55:06.155380765,8451041,T,IEX,134.165000,1
2019-10-24 16:55:37.261306112,2019-10-24 16:55:37.261288956,8466230,T,IEX,134.085000,2
2019-10-24 16:55:37.277385984,2019-10-24 16:55:37.277367346,8466237,T,IEX,134.085000,5
2019-10-24 16:55:48.340517120,2019-10-24 16:55:48.340500619,8470573,T,IEX,134.075000,1
2019-10-24 16:56:02.511482112,2019-10-24 16:56:02.511464215,8475641,T,IEX,134.075000,1
2019-10-24 16:56:08.652419072,2019-10-24 16:56:08.652403757,8480101,T,IEX,134.040000,100
2019-10-24 16:56:11.139514880,2019-10-24 16:56:11.139495289,8481381,T,IEX,134.050000,1
2019-10-24 16:56:18.764728064,2019-10-24 16:56:18.764703217,8486374,T,IEX,134.040000,1
2019-10-24 16:56:18.772000000,2019-10-24 16:56:18.771979746,8486377,T,IEX,134.040000,2
2019-10-24 16:56:19.207393024,2019-10-24 16:56:19.207373668,8487030,T,IEX,134.010000,1
2019-10-24 16:56:19.624284928,2019-10-24 16:56:19.624266084,8488583,T,IEX,134.015000,1
2019-10-24 16:56:21.679249920,2019-10-24 16:56:21.679234567,8490322,T,IEX,134.040000,1
2019-10-24 16:56:57.337056000,2019-10-24 16:56:57.337037184,8502392,T,IEX,134.030000,1
2019-10-24 16:57:02.404737024,2019-10-24 16:57:02.404718898,8505095,T,IEX,134.000000,1
2019-10-24 16:57:17.725026048,2019-10-24 16:57:17.725008146,8512757,T,IEX,133.945000,1
2019-10-24 16:57:19.828435968,2019-10-24 16:57:19.828420438,8515266,T,IEX,133.965000,100
2019-10-24 16:57:29.630619904,2019-10-24 16:57:29.630598304,8520829,T,IEX,133.960000,1
2019-10-24 16:57:52.784636928,2019-10-24 16:57:52.784617481,8528456,T,IEX,133.960000,200
2019-10-24 16:57:56.284644096,2019-10-24 16:57:56.284623205,8529073,T,IEX,133.960000,1
2019-10-24 16:57:59.28602880,2019-10-24 16:57:59.28543440,8529737,T,IEX,133.970000,3
2019-10-24 16:58:36.631384064,2019-10-24 16:58:36.631366308,8543352,T,IEX,133.960000,100
2019-10-24 16:58:41.944585984,2019-10-24 16:58:41.944571343,8545349,T,IEX,133.980000,1
2019-10-24 16:58:57.355721984,2019-10-24 16:58:57.355698704,8550498,T,IEX,133.980000,100
2019-10-24 16:59:06.28610048,2019-10-24 16:59:06.28438831,8553507,T,IEX,133.975000,1
2019-10-24 16:59:06.35597056,2019-10-24 16:59:06.35573467,8553508,T,IEX,133.980000,49
2019-10-24 16:59:42.600626944,2019-10-24 16:59:42.600611473,8563977,T,IEX,133.910000,1
2019-10-24 16:59:56.974489088,2019-10-24 16:59:56.974473392,8569452,T,IEX,133.915000,6
2019-10-24 16:59:56.976984064,2019-10-24 16:59:56.976966906,8569456,T,IEX,133.920000,100
2019-10-24 16:59:56.977932032,2019-10-24 16:59:56.977914408,8569459,T,IEX,133.920000,115
2019-10-24 16:59:57.11000064,2019-10-24 16:59:57.10981059,8569475,T,IEX,133.915000,3
2019-10-24 16:59:57.12617984,2019-10-24 16:59:57.12597258,8569476,T,IEX,133.920000,97
2019-10-24 17:00:02.529475072,2019-10-24 17:00:02.529455216,8571767,T,IEX,133.935000,2
2019-10-24 17:00:02.733287936,2019-10-24 17:00:02.733270565,8571940,T,IEX,133.960000,1
2019-10-24 17:00:06.257696000,2019-10-24 17:00:06.257675834,8574661,T,IEX,133.960000,1
2019-10-24 17:00:06.262873088,2019-10-24 17:00:06.262852114,8574663,T,IEX,133.970000,83
2019-10-24 17:00:15.635527936,2019-10-24 17:00:15.635507211,8578071,T,IEX,133.925000,100
2019-10-24 17:00:15.636541952,2019-10-24 17:00:15.636524019,8578072,T,IEX,133.925000,200
2019-10-24 17:00:47.667822080,2019-10-24 17:00:47.667798674,8590741,T,IEX,133.925000,178
2019-10-24 17:00:47.669168128,2019-10-24 17:00:47.669147622,8590742,T,IEX,133.925000,129
2019-10-24 17:00:47.707927040,2019-10-24 17:00:47.707908414,8590751,T,IEX,133.925000,1
2019-10-24 17:00:47.732967936,2019-10-24 17:00:47.732946897,8590779,T,IEX,133.925000,4
2019-10-24 17:00:47.743634944,2019-10-24 17:00:47.743614498,8590784,T,IEX,133.930000,46
2019-10-24 17:00:51.546921984,2019-10-24 17:00:51.546901189,8592015,T,IEX,133.930000,50
2019-10-24 17:00:54.946873088,2019-10-24 17:00:54.946854386,8593370,T,IEX,133.925000,1
2019-10-24 17:00:54.954092032,2019-10-24 17:00:54.954072847,8593372,T,IEX,133.930000,49
2019-10-24 17:01:06.184047104,2019-10-24 17:01:06.184028329,8598516,T,IEX,133.935000,10
2019-10-24 17:01:06.184060928,2019-10-24 17:01:06.184044295,8598517,T,IEX,133.935000,1
2019-10-24 17:01:06.441047040,2019-10-24 17:01:06.441027570,8598621,T,IEX,133.935000,1
2019-10-24 17:02:23.475155968,2019-10-24 17:02:23.475133706,8627716,T,IEX,133.930000,100
2019-10-24 17:02:25.265086976,2019-10-24 17:02:25.265067235,8628110,T,IEX,133.935000,1
2019-10-24 17:02:43.232354048,2019-10-24 17:02:43.232334077,8632979,T,IEX,133.935000,1
2019-10-24 17:03:04.830605056,2019-10-24 17:03:04.830585070,8639386,T,IEX,133.925000,1
2019-10-24 17:03:05.230915072,2019-10-24 17:03:05.230897220,8639706,T,IEX,133.925000,2
2019-10-24 17:03:42.742548992,2019-10-24 17:03:42.742526900,8653889,T,IEX,133.920000,2
2019-10-24 17:03:43.268836096,2019-10-24 17:03:43.268818100,8654232,T,IEX,133.920000,1
2019-10-24 17:03:43.766145024,2019-10-24 17:03:43.766125899,8654558,T,IEX,133.920000,1
2019-10-24 17:04:06.163452928,2019-10-24 17:04:06.163434375,8661444,T,IEX,133.910000,1
2019-10-24 17:04:22.135728128,2019-10-24 17:04:22.135708565,8667615,T,IEX,133.855000,1
2019-10-24 17:04:22.146672128,2019-10-24 17:04:22.146650589,8667616,T,IEX,133.860000,99
2019-10-24 17:04:29.767080960,2019-10-24 17:04:29.767062478,8670196,T,IEX,133.860000,2
2019-10-24 17:04:40.91388928,2019-10-24 17:04:40.91369056,8673036,T,IEX,133.865000,1
2019-10-24 17:05:02.650477056,2019-10-24 17:05:02.650454031,8681514,T,IEX,133.890000,1
2019-10-24 17:05:03.466547968,2019-10-24 17:05:03.466532094,8681752,T,IEX,133.885000,1
2019-10-24 17:05:10.855388928,2019-10-24 17:05:10.855372506,8684539,T,IEX,133.905000,444
2019-10-24 17:05:16.919516928,2019-10-24 17:05:16.919496228,8687325,T,IEX,133.915000,1
2019-10-24 17:05:18.33118976,2019-10-24 17:05:18.33101531,8687733,T,IEX,133.915000,2
2019-10-24 17:05:18.45338880,2019-10-24 17:05:18.45319996,8687736,T,IEX,133.920000,48
2019-10-24 17:05:28.651565056,2019-10-24 17:05:28.651548516,8692743,T,IEX,133.920000,100
2019-10-24 17:06:13.653473024,2019-10-24 17:06:13.653452947,8706885,T,IEX,133.870000,100
2019-10-24 17:06:21.423443968,2019-10-24 17:06:21.423426189,8710052,T,IEX,133.855000,100
2019-10-24 17:06:35.230236928,2019-10-24 17:06:35.230218476,8714167,T,IEX,133.855000,7
2019-10-24 17:07:02.841858048,2019-10-24 17:07:02.841839723,8724513,T,IEX,133.820000,1
2019-10-24 17:07:14.18084096,2019-10-24 17:07:14.18063713,8728696,T,IEX,133.795000,1
2019-10-24 17:07:15.32892928,2019-10-24 17:07:15.32875445,8729114,T,IEX,133.775000,1
2019-10-24 17:07:16.452264960,2019-10-24 17:07:16.452245294,8729877,T,IEX,133.765000,2
2019-10-24 17:07:21.547407872,2019-10-24 17:07:21.547388833,8732564,T,IEX,133.755000,1
2019-10-24 17:07:22.893434880,2019-10-24 17:07:22.893419977,8732896,T,IEX,133.765000,100
2019-10-24 17:07:28.656997888,2019-10-24 17:07:28.656979898,8736463,T,IEX,133.750000,1
2019-10-24 17:07:29.467223040,2019-10-24 17:07:29.467204646,8736776,T,IEX,133.745000,1
2019-10-24 17:07:37.359806976,2019-10-24 17:07:37.359791340,8740563,T,IEX,133.755000,1
2019-10-24 17:07:43.453413888,2019-10-24 17:07:43.453398057,8742860,T,IEX,133.755000,1
2019-10-24 17:07:43.555357952,2019-10-24 17:07:43.555341772,8743120,T,IEX,133.770000,49
2019-10-24 17:07:55.41825024,2019-10-24 17:07:55.41805468,8748271,T,IEX,133.795000,1
2019-10-24 17:07:55.52861952,2019-10-24 17:07:55.52842217,8748273,T,IEX,133.800000,49
2019-10-24 17:08:42.617374976,2019-10-24 17:08:42.617359571,8765827,T,IEX,133.725000,1
2019-10-24 17:08:59.968944128,2019-10-24 17:08:59.968923562,8774318,T,IEX,133.725000,1
2019-10-24 17:08:59.978640896,2019-10-24 17:08:59.978620064,8774320,T,IEX,133.730000,99
2019-10-24 17:09:06.223023104,2019-10-24 17:09:06.223004280,8777448,T,IEX,133.755000,2
2019-10-24 17:09:06.237025024,2019-10-24 17:09:06.237004493,8777456,T,IEX,133.760000,38
2019-10-24 17:09:12.576758016,2019-10-24 17:09:12.576739005,8780528,T,IEX,133.730000,100
2019-10-24 17:09:25.758128128,2019-10-24 17:09:25.758110318,8784963,T,IEX,133.705000,1
2019-10-24 17:09:25.767431936,2019-10-24 17:09:25.767411865,8784969,T,IEX,133.710000,1
2019-10-24 17:09:36.90704896,2019-10-24 17:09:36.90688695,8789271,T,IEX,133.670000,100
2019-10-24 17:09:36.147794944,2019-10-24 17:09:36.147775725,8789348,T,IEX,133.680000,1
2019-10-24 17:10:01.336503040,2019-10-24 17:10:01.336488278,8799711,T,IEX,133.665000,1
2019-10-24 17:10:06.253479936,2019-10-24 17:10:06.253459271,8801429,T,IEX,133.670000,40
2019-10-24 17:10:43.709445120,2019-10-24 17:10:43.709425929,8816444,T,IEX,133.700000,1
2019-10-24 17:10:50.367497984,2019-10-24 17:10:50.367477729,8818708,T,IEX,133.700000,2
2019-10-24 17:11:19.776449024,2019-10-24 17:11:19.776429854,8828720,T,IEX,133.705000,1
2019-10-24 17:11:43.764161024,2019-10-24 17:11:43.764140300,8837909,T,IEX,133.685000,1
2019-10-24 17:11:49.47417088,2019-10-24 17:11:49.47396031,8839742,T,IEX,133.685000,100
2019-10-24 17:11:54.668197120,2019-10-24 17:11:54.668178167,8841283,T,IEX,133.685000,100
2019-10-24 17:11:54.669180928,2019-10-24 17:11:54.669163124,8841284,T,IEX,133.685000,200
2019-10-24 17:12:03.920880128,2019-10-24 17:12:03.920860769,8844479,T,IEX,133.685000,2
2019-10-24 17:12:06.160710912,2019-10-24 17:12:06.160692301,8845270,T,IEX,133.685000,1
2019-10-24 17:12:26.846052096,2019-10-24 17:12:26.846033622,8853333,T,IEX,133.670000,100
2019-10-24 17:12:43.799660032,2019-10-24 17:12:43.799640303,8859398,T,IEX,133.710000,114
2019-10-24 17:12:58.377413888,2019-10-24 17:12:58.377393652,8864680,T,IEX,133.685000,1
2019-10-24 17:12:58.385494016,2019-10-24 17:12:58.385472824,8864681,T,IEX,133.685000,9
2019-10-24 17:12:58.537200128,2019-10-24 17:12:58.537183703,8864698,T,IEX,133.685000,1
2019-10-24 17:13:49.120115968,2019-10-24 17:13:49.120098856,8882477,T,IEX,133.725000,1
2019-10-24 17:14:18.657229056,2019-10-24 17:14:18.657208989,8901182,T,IEX,133.790000,200
2019-10-24 17:14:38.468729088,2019-10-24 17:14:38.468706586,8908659,T,IEX,133.790000,100
2019-10-24 17:14:43.844807936,2019-10-24 17:14:43.844787140,8911372,T,IEX,133.780000,1
2019-10-24 17:14:45.155567104,2019-10-24 17:14:45.155547761,8911776,T,IEX,133.785000,100
2019-10-24 17:15:02.450554880,2019-10-24 17:15:02.450535582,8918806,T,IEX,133.780000,100
2019-10-24 17:15:04.350003968,2019-10-24 17:15:04.349982451,8919746,T,IEX,133.780000,5
2019-10-24 17:15:10.845564928,2019-10-24 17:15:10.845546744,8922059,T,IEX,133.780000,100
2019-10-24 17:15:14.77346048,2019-10-24 17:15:14.77328161,8923014,T,IEX,133.780000,100
2019-10-24 17:15:26.123162112,2019-10-24 17:15:26.123143506,8928526,T,IEX,133.760000,100
2019-10-24 17:16:04.747165952,2019-10-24 17:16:04.747144793,8948707,T,IEX,133.760000,1
2019-10-24 17:16:24.746070016,2019-10-24 17:16:24.746051239,8955409,T,IEX,133.740000,4
2019-10-24 17:16:44.66426112,2019-10-24 17:16:44.66407224,8960784,T,IEX,133.745000,1
2019-10-24 17:17:18.843334912,2019-10-24 17:17:18.843319659,8973046,T,IEX,133.775000,1
2019-10-24 17:17:34.668525056,2019-10-24 17:17:34.668504795,8979234,T,IEX,133.780000,200
2019-10-24 17:17:44.88186880,2019-10-24 17:17:44.88169146,8981499,T,IEX,133.780000,65
2019-10-24 17:17:48.397459968,2019-10-24 17:17:48.397441084,8982655,T,IEX,133.765000,1
2019-10-24 17:17:49.299696128,2019-10-24 17:17:49.299677640,8983093,T,IEX,133.750000,32
2019-10-24 17:18:43.18604032,2019-10-24 17:18:43.18588250,9003838,T,IEX,133.755000,1
2019-10-24 17:18:46.689213952,2019-10-24 17:18:46.689194318,9005188,T,IEX,133.760000,1
2019-10-24 17:19:04.247753984,2019-10-24 17:19:04.247734211,9010458,T,IEX,133.755000,1
2019-10-24 17:19:06.284300032,2019-10-24 17:19:06.284282402,9011104,T,IEX,133.750000,1
2019-10-24 17:19:26.643770880,2019-10-24 17:19:26.643753063,9018189,T,IEX,133.750000,200
2019-10-24 17:19:33.251549952,2019-10-24 17:19:33.251529072,9019553,T,IEX,133.750000,1
2019-10-24 17:19:43.720997120,2019-10-24 17:19:43.720978386,9022042,T,IEX,133.760000,1
2019-10-24 17:20:05.488762880,2019-10-24 17:20:05.488742985,9028293,T,IEX,133.750000,100
2019-10-24 17:20:10.366159104,2019-10-24 17:20:10.366139186,9031978,T,IEX,133.740000,1
2019-10-24 17:20:43.151857920,2019-10-24 17:20:43.151836137,9043436,T,IEX,133.755000,1
2019-10-24 17:21:03.460357888,2019-10-24 17:21:03.460336963,9050118,T,IEX,133.755000,3
2019-10-24 17:21:18.631755008,2019-10-24 17:21:18.631735020,9055801,T,IEX,133.730000,1
2019-10-24 17:21:24.796699904,2019-10-24 17:21:24.796678644,9057435,T,IEX,133.710000,1
2019-10-24 17:21:43.207077120,2019-10-24 17:21:43.207059683,9063390,T,IEX,133.710000,1
2019-10-24 17:22:06.38208000,2019-10-24 17:22:06.38188730,9070089,T,IEX,133.710000,1
2019-10-24 17:22:06.45913088,2019-10-24 17:22:06.45891747,9070092,T,IEX,133.720000,200
2019-10-24 17:22:06.86953984,2019-10-24 17:22:06.86932954,9070100,T,IEX,133.720000,1
2019-10-24 17:22:23.320887040,2019-10-24 17:22:23.320869550,9075697,T,IEX,133.735000,1
2019-10-24 17:22:33.638181120,2019-10-24 17:22:33.638163428,9078906,T,IEX,133.740000,1
2019-10-24 17:22:44.227031040,2019-10-24 17:22:44.227010858,9082527,T,IEX,133.740000,1
2019-10-24 17:23:00.848052992,2019-10-24 17:23:00.848035194,9088311,T,IEX,133.740000,1
2019-10-24 17:23:06.182500096,2019-10-24 17:23:06.182485379,9091133,T,IEX,133.740000,1
2019-10-24 17:23:15.126618880,2019-10-24 17:23:15.126597805,9094300,T,IEX,133.730000,1
2019-10-24 17:23:43.228726016,2019-10-24 17:23:43.228708803,9101024,T,IEX,133.710000,1
2019-10-24 17:24:06.257630976,2019-10-24 17:24:06.257609726,9106683,T,IEX,133.705000,1
2019-10-24 17:24:13.21218048,2019-10-24 17:24:13.21199149,9108661,T,IEX,133.705000,1
2019-10-24 17:24:18.904628992,2019-10-24 17:24:18.904609511,9112012,T,IEX,133.710000,1
2019-10-24 17:24:43.280079104,2019-10-24 17:24:43.280061133,9122014,T,IEX,133.695000,1
2019-10-24 17:25:02.430297088,2019-10-24 17:25:02.430279531,9127725,T,IEX,133.675000,1
2019-10-24 17:25:04.408783872,2019-10-24 17:25:04.408766207,9128309,T,IEX,133.660000,1
2019-10-24 17:25:06.948385024,2019-10-24 17:25:06.948366218,9129482,T,IEX,133.660000,1
2019-10-24 17:25:25.952356096,2019-10-24 17:25:25.952337085,9137058,T,IEX,133.640000,1
2019-10-24 17:25:43.377851904,2019-10-24 17:25:43.377834208,9142068,T,IEX,133.645000,1
2019-10-24 17:26:05.336854016,2019-10-24 17:26:05.336832823,9149013,T,IEX,133.660000,1
2019-10-24 17:26:05.557796096,2019-10-24 17:26:05.557776360,9149062,T,IEX,133.665000,200
2019-10-24 17:26:34.807936,2019-10-24 17:26:34.789459,9156975,T,IEX,133.650000,1
2019-10-24 17:26:43.648500992,2019-10-24 17:26:43.648478981,9159272,T,IEX,133.665000,1
2019-10-24 17:26:54.420070912,2019-10-24 17:26:54.420049889,9163622,T,IEX,133.675000,1
2019-10-24 17:26:57.513035008,2019-10-24 17:26:57.513013696,9164441,T,IEX,133.675000,243
2019-10-24 17:27:34.84293120,2019-10-24 17:27:34.84274314,9174406,T,IEX,133.650000,1
2019-10-24 17:27:44.236483072,2019-10-24 17:27:44.236464564,9176826,T,IEX,133.660000,1
2019-10-24 17:28:26.24706048,2019-10-24 17:28:26.24684343,9188195,T,IEX,133.670000,1
2019-10-24 17:28:33.641697024,2019-10-24 17:28:33.641677511,9193072,T,IEX,133.720000,100
2019-10-24 17:28:36.867257088,2019-10-24 17:28:36.867238817,9194496,T,IEX,133.720000,1
2019-10-24 17:29:43.497300992,2019-10-24 17:29:43.497280908,9221574,T,IEX,133.685000,1
2019-10-24 17:29:44.971170048,2019-10-24 17:29:44.971152320,9222624,T,IEX,133.695000,1
2019-10-24 17:29:44.979569920,2019-10-24 17:29:44.979548828,9222632,T,IEX,133.695000,1
2019-10-24 17:30:02.569572096,2019-10-24 17:30:02.569551739,9230256,T,IEX,133.675000,200
2019-10-24 17:30:14.980592128,2019-10-24 17:30:14.980573650,9236131,T,IEX,133.685000,1
2019-10-24 17:30:31.807834880,2019-10-24 17:30:31.807817183,9241361,T,IEX,133.670000,1
2019-10-24 17:31:03.493271040,2019-10-24 17:31:03.493252474,9251835,T,IEX,133.640000,1
2019-10-24 17:32:06.482771968,2019-10-24 17:32:06.482753757,9269086,T,IEX,133.635000,1
2019-10-24 17:32:07.308545024,2019-10-24 17:32:07.308525962,9269417,T,IEX,133.645000,2
2019-10-24 17:32:10.177531904,2019-10-24 17:32:10.177516026,9271102,T,IEX,133.655000,1
2019-10-24 17:32:30.862438912,2019-10-24 17:32:30.862420561,9279858,T,IEX,133.645000,2
2019-10-24 17:32:58.805925120,2019-10-24 17:32:58.805905597,9289525,T,IEX,133.645000,100
2019-10-24 17:32:58.805943040,2019-10-24 17:32:58.805926724,9289526,T,IEX,133.645000,1
2019-10-24 17:33:12.496284928,2019-10-24 17:33:12.496267204,9295569,T,IEX,133.615000,1
2019-10-24 17:33:12.505134080,2019-10-24 17:33:12.505113584,9295578,T,IEX,133.620000,3
2019-10-24 17:33:17.912502016,2019-10-24 17:33:17.912484097,9298852,T,IEX,133.630000,1
2019-10-24 17:33:43.656528896,2019-10-24 17:33:43.656510703,9309618,T,IEX,133.645000,1
2019-10-24 17:34:00.160887040,2019-10-24 17:34:00.160870005,9317975,T,IEX,133.635000,1
2019-10-24 17:34:00.336716032,2019-10-24 17:34:00.336697331,9318437,T,IEX,133.635000,10
2019-10-24 17:34:02.973615104,2019-10-24 17:34:02.973597119,9321008,T,IEX,133.630000,1
2019-10-24 17:34:23.472290048,2019-10-24 17:34:23.472269959,9333767,T,IEX,133.595000,1
2019-10-24 17:34:27.346900992,2019-10-24 17:34:27.346881194,9336828,T,IEX,133.585000,3
2019-10-24 17:34:29.797592064,2019-10-24 17:34:29.797572623,9338556,T,IEX,133.590000,1
2019-10-24 17:34:30.861020928,2019-10-24 17:34:30.861000030,9339446,T,IEX,133.605000,1
2019-10-24 17:34:34.872037888,2019-10-24 17:34:34.872018177,9342410,T,IEX,133.595000,1
2019-10-24 17:34:44.406115072,2019-10-24 17:34:44.406097760,9346949,T,IEX,133.620000,1
2019-10-24 17:34:56.280099072,2019-10-24 17:34:56.280082617,9351089,T,IEX,133.640000,1
2019-10-24 17:34:58.546885888,2019-10-24 17:34:58.546863810,9351717,T,IEX,133.640000,1
2019-10-24 17:35:06.193854976,2019-10-24 17:35:06.193835386,9355505,T,IEX,133.645000,1
2019-10-24 17:35:49.36642048,2019-10-24 17:35:49.36621297,9369325,T,IEX,133.660000,1
2019-10-24 17:36:02.644259072,2019-10-24 17:36:02.644242642,9375769,T,IEX,133.655000,1
2019-10-24 17:36:04.707141120,2019-10-24 17:36:04.707122689,9376502,T,IEX,133.655000,1
2019-10-24 17:36:16.938014976,2019-10-24 17:36:16.937994409,9380221,T,IEX,133.650000,1
2019-10-24 17:36:33.961497088,2019-10-24 17:36:33.961476905,9384881,T,IEX,133.660000,1
2019-10-24 17:36:44.600613120,2019-10-24 17:36:44.600594547,9387966,T,IEX,133.660000,1
2019-10-24 17:37:03.684541952,2019-10-24 17:37:03.684526698,9394358,T,IEX,133.665000,1
2019-10-24 17:37:10.392861952,2019-10-24 17:37:10.392840061,9397918,T,IEX,133.665000,1
2019-10-24 17:37:12.567104000,2019-10-24 17:37:12.567082613,9398570,T,IEX,133.665000,1
2019-10-24 17:37:16.611616000,2019-10-24 17:37:16.611595667,9400434,T,IEX,133.660000,1
2019-10-24 17:37:56.557782016,2019-10-24 17:37:56.557762364,9418153,T,IEX,133.710000,1
2019-10-24 17:38:03.603595008,2019-10-24 17:38:03.603573665,9420148,T,IEX,133.710000,1
2019-10-24 17:38:17.943570944,2019-10-24 17:38:17.943552604,9428558,T,IEX,133.690000,1
2019-10-24 17:38:27.348705024,2019-10-24 17:38:27.348683416,9432452,T,IEX,133.660000,200
2019-10-24 17:39:44.54761984,2019-10-24 17:39:44.54744012,9456102,T,IEX,133.670000,1
2019-10-24 17:39:49.536953088,2019-10-24 17:39:49.536934782,9457801,T,IEX,133.665000,2
2019-10-24 17:40:52.421765888,2019-10-24 17:40:52.421746420,9480386,T,IEX,133.650000,1
2019-10-24 17:40:57.778928128,2019-10-24 17:40:57.778725349,9482009,T,IEX,133.650000,1
2019-10-24 17:40:58.278310912,2019-10-24 17:40:58.278293882,9482160,T,IEX,133.650000,4
2019-10-24 17:41:13.770080000,2019-10-24 17:41:13.770062623,9487885,T,IEX,133.650000,100
2019-10-24 17:41:13.780317952,2019-10-24 17:41:13.780301000,9487891,T,IEX,133.650000,33
2019-10-24 17:41:28.721810944,2019-10-24 17:41:28.721789463,9493700,T,IEX,133.650000,1
2019-10-24 17:41:44.160932096,2019-10-24 17:41:44.160913121,9498423,T,IEX,133.660000,1
2019-10-24 17:41:59.75183104,2019-10-24 17:41:59.75164882,9503767,T,IEX,133.660000,1
2019-10-24 17:42:15.83057920,2019-10-24 17:42:15.83038364,9511256,T,IEX,133.645000,1
2019-10-24 17:42:30.904361984,2019-10-24 17:42:30.904342927,9516275,T,IEX,133.645000,1
2019-10-24 17:42:44.184009984,2019-10-24 17:42:44.183992225,9523481,T,IEX,133.660000,1
2019-10-24 17:42:45.404015104,2019-10-24 17:42:45.403992969,9524072,T,IEX,133.650000,1
2019-10-24 17:43:06.209200128,2019-10-24 17:43:06.209180780,9530306,T,IEX,133.650000,60
2019-10-24 17:43:18.950351872,2019-10-24 17:43:18.950333871,9534117,T,IEX,133.655000,1
2019-10-24 17:43:18.995885056,2019-10-24 17:43:18.995868929,9534204,T,IEX,133.655000,1
2019-10-24 17:43:22.419915008,2019-10-24 17:43:22.419895949,9535067,T,IEX,133.655000,1
2019-10-24 17:43:24.193806080,2019-10-24 17:43:24.193787058,9535632,T,IEX,133.655000,200
2019-10-24 17:43:32.439250944,2019-10-24 17:43:32.439233212,9537538,T,IEX,133.655000,1
2019-10-24 17:43:34.21964032,2019-10-24 17:43:34.21946215,9537909,T,IEX,133.655000,226
2019-10-24 17:43:34.228459008,2019-10-24 17:43:34.228438084,9537951,T,IEX,133.655000,6
2019-10-24 17:43:45.819845888,2019-10-24 17:43:45.819825019,9541513,T,IEX,133.660000,8
2019-10-24 17:43:47.385822976,2019-10-24 17:43:47.385802402,9542139,T,IEX,133.655000,1
2019-10-24 17:43:51.107479040,2019-10-24 17:43:51.107460751,9543473,T,IEX,133.655000,1
2019-10-24 17:44:18.878260992,2019-10-24 17:44:18.878241532,9552758,T,IEX,133.695000,1
2019-10-24 17:44:18.886544896,2019-10-24 17:44:18.886523742,9552760,T,IEX,133.695000,1
2019-10-24 17:44:44.263921920,2019-10-24 17:44:44.263901063,9559004,T,IEX,133.720000,1
2019-10-24 17:44:45.638132992,2019-10-24 17:44:45.638115597,9559622,T,IEX,133.720000,1
2019-10-24 17:44:49.830583040,2019-10-24 17:44:49.830565725,9561492,T,IEX,133.720000,1
2019-10-24 17:45:02.253433088,2019-10-24 17:45:02.253418179,9565249,T,IEX,133.725000,357
2019-10-24 17:45:08.922840064,2019-10-24 17:45:08.922823008,9568348,T,IEX,133.725000,300
2019-10-24 17:45:08.991507968,2019-10-24 17:45:08.991490587,9568424,T,IEX,133.725000,1
2019-10-24 17:45:32.478429952,2019-10-24 17:45:32.478412539,9577888,T,IEX,133.690000,1
2019-10-24 17:45:32.486355968,2019-10-24 17:45:32.486336407,9577889,T,IEX,133.690000,1
2019-10-24 17:45:49.978341888,2019-10-24 17:45:49.978325066,9582806,T,IEX,133.715000,1
2019-10-24 17:46:41.809267968,2019-10-24 17:46:41.809252452,9597222,T,IEX,133.705000,1
2019-10-24 17:47:06.223057920,2019-10-24 17:47:06.223037463,9604130,T,IEX,133.720000,1
2019-10-24 17:47:17.533766912,2019-10-24 17:47:17.533744722,9607317,T,IEX,133.720000,300
2019-10-24 17:47:31.960739072,2019-10-24 17:47:31.960720177,9613281,T,IEX,133.735000,1
2019-10-24 17:47:34.248623104,2019-10-24 17:47:34.248605289,9614777,T,IEX,133.745000,10
2019-10-24 17:48:14.226586880,2019-10-24 17:48:14.226564958,9625324,T,IEX,133.750000,1
2019-10-24 17:48:20.284817920,2019-10-24 17:48:20.284796324,9627191,T,IEX,133.760000,1
2019-10-24 17:48:44.469380096,2019-10-24 17:48:44.469361543,9633735,T,IEX,133.760000,1
2019-10-24 17:48:57.649431040,2019-10-24 17:48:57.649412610,9637529,T,IEX,133.755000,1
2019-10-24 17:48:58.424009984,2019-10-24 17:48:58.423989835,9637653,T,IEX,133.755000,200
2019-10-24 17:49:10.477323008,2019-10-24 17:49:10.477304048,9640816,T,IEX,133.755000,200
2019-10-24 17:49:11.157787904,2019-10-24 17:49:11.157770446,9641400,T,IEX,133.765000,1
2019-10-24 17:49:38.551420928,2019-10-24 17:49:38.551403206,9651575,T,IEX,133.785000,1
2019-10-24 17:49:59.911232000,2019-10-24 17:49:59.911213799,9659587,T,IEX,133.785000,1
2019-10-24 17:50:17.175386880,2019-10-24 17:50:17.175371768,9666903,T,IEX,133.770000,1
2019-10-24 17:50:41.228780032,2019-10-24 17:50:41.228762228,9675191,T,IEX,133.755000,1
2019-10-24 17:50:42.45360896,2019-10-24 17:50:42.45346689,9675828,T,IEX,133.745000,1
2019-10-24 17:50:45.58617088,2019-10-24 17:50:45.58594777,9676733,T,IEX,133.735000,1
2019-10-24 17:50:49.110855936,2019-10-24 17:50:49.110835590,9678020,T,IEX,133.760000,1
2019-10-24 17:50:58.961485056,2019-10-24 17:50:58.961463649,9682841,T,IEX,133.775000,5
2019-10-24 17:50:58.961496064,2019-10-24 17:50:58.961478902,9682842,T,IEX,133.775000,295
2019-10-24 17:51:16.336474880,2019-10-24 17:51:16.336453811,9690429,T,IEX,133.790000,1
2019-10-24 17:51:17.121953024,2019-10-24 17:51:17.121935164,9690836,T,IEX,133.790000,3
2019-10-24 17:51:30.562819072,2019-10-24 17:51:30.562800713,9694908,T,IEX,133.790000,1
2019-10-24 17:51:51.162658048,2019-10-24 17:51:51.162641230,9702379,T,IEX,133.780000,500
2019-10-24 17:51:51.165019904,2019-10-24 17:51:51.165002749,9702382,T,IEX,133.780000,500
2019-10-24 17:51:51.166998016,2019-10-24 17:51:51.166978356,9702386,T,IEX,133.780000,500
2019-10-24 17:51:51.168713984,2019-10-24 17:51:51.168698388,9702388,T,IEX,133.780000,500
2019-10-24 17:51:59.504205056,2019-10-24 17:51:59.504188605,9705842,T,IEX,133.775000,200
2019-10-24 17:52:06.145519104,2019-10-24 17:52:06.145500832,9708631,T,IEX,133.775000,1
2019-10-24 17:52:06.157543936,2019-10-24 17:52:06.157526484,9708647,T,IEX,133.780000,4
2019-10-24 17:52:23.242553088,2019-10-24 17:52:23.242531597,9714396,T,IEX,133.770000,100
2019-10-24 17:52:23.251688960,2019-10-24 17:52:23.251672534,9714402,T,IEX,133.780000,1
2019-10-24 17:52:28.722604032,2019-10-24 17:52:28.722585007,9716298,T,IEX,133.765000,1
2019-10-24 17:52:32.76013056,2019-10-24 17:52:32.75996108,9717132,T,IEX,133.770000,4
2019-10-24 17:52:36.577437952,2019-10-24 17:52:36.577417645,9719126,T,IEX,133.765000,1
2019-10-24 17:52:59.164721920,2019-10-24 17:52:59.164700385,9725411,T,IEX,133.790000,1
2019-10-24 17:53:11.183322112,2019-10-24 17:53:11.183302932,9729942,T,IEX,133.790000,1
2019-10-24 17:53:19.122834944,2019-10-24 17:53:19.122814976,9732440,T,IEX,133.780000,1
2019-10-24 17:53:35.449040896,2019-10-24 17:53:35.449021396,9739306,T,IEX,133.760000,6
2019-10-24 17:53:44.307265024,2019-10-24 17:53:44.307245630,9743418,T,IEX,133.760000,1
2019-10-24 17:54:01.623560960,2019-10-24 17:54:01.623545449,9752750,T,IEX,133.755000,1
2019-10-24 17:55:20.925038080,2019-10-24 17:55:20.925015501,9780163,T,IEX,133.825000,300
2019-10-24 17:57:43.3811072,2019-10-24 17:57:43.3790546,9829704,T,IEX,133.830000,98
2019-10-24 17:57:51.53906944,2019-10-24 17:57:51.53888766,9831928,T,IEX,133.830000,2
2019-10-24 17:58:39.488566016,2019-10-24 17:58:39.488548043,9849663,T,IEX,133.805000,1
2019-10-24 17:59:02.843108096,2019-10-24 17:59:02.843088029,9858754,T,IEX,133.825000,1
2019-10-24 17:59:10.453596928,2019-10-24 17:59:10.453577817,9862063,T,IEX,133.825000,100
2019-10-24 17:59:13.205124096,2019-10-24 17:59:13.205103047,9863733,T,IEX,133.835000,1
2019-10-24 17:59:13.674589952,2019-10-24 17:59:13.674572150,9863930,T,IEX,133.835000,200
2019-10-24 17:59:13.680210944,2019-10-24 17:59:13.680192456,9863934,T,IEX,133.835000,303
2019-10-24 17:59:13.682274048,2019-10-24 17:59:13.682255930,9863937,T,IEX,133.835000,2
2019-10-24 17:59:13.690060032,2019-10-24 17:59:13.690042680,9863944,T,IEX,133.835000,1
2019-10-24 17:59:13.698767104,2019-10-24 17:59:13.698747839,9863948,T,IEX,133.835000,231
2019-10-24 17:59:13.702734080,2019-10-24 17:59:13.702713072,9863949,T,IEX,133.835000,1
2019-10-24 17:59:13.722149120,2019-10-24 17:59:13.722129724,9863954,T,IEX,133.835000,335
2019-10-24 17:59:32.997853952,2019-10-24 17:59:32.997834460,9871112,T,IEX,133.860000,2
2019-10-24 17:59:45.79281920,2019-10-24 17:59:45.79267017,9876163,T,IEX,133.870000,1
2019-10-24 17:59:45.199586048,2019-10-24 17:59:45.199567580,9876265,T,IEX,133.890000,1
2019-10-24 18:00:22.130597120,2019-10-24 18:00:22.130578216,9894242,T,IEX,133.860000,1
2019-10-24 18:00:22.138278912,2019-10-24 18:00:22.138261164,9894248,T,IEX,133.855000,1
2019-10-24 18:00:43.385193984,2019-10-24 18:00:43.385176858,9901779,T,IEX,133.850000,2
2019-10-24 18:00:56.661676032,2019-10-24 18:00:56.661657541,9906745,T,IEX,133.875000,1
2019-10-24 18:00:56.755322880,2019-10-24 18:00:56.755300619,9906764,T,IEX,133.880000,1
2019-10-24 18:00:59.600531968,2019-10-24 18:00:59.600515840,9907646,T,IEX,133.880000,1
2019-10-24 18:01:12.237906944,2019-10-24 18:01:12.237888270,9912357,T,IEX,133.890000,1
2019-10-24 18:01:44.172954112,2019-10-24 18:01:44.172936340,9922418,T,IEX,133.910000,1
2019-10-24 18:02:06.177460992,2019-10-24 18:02:06.177439255,9929903,T,IEX,133.910000,1
2019-10-24 18:02:07.867819008,2019-10-24 18:02:07.867801305,9930430,T,IEX,133.910000,1
2019-10-24 18:02:16.399756032,2019-10-24 18:02:16.399734974,9934190,T,IEX,133.910000,1
2019-10-24 18:02:34.36954880,2019-10-24 18:02:34.36936741,9941071,T,IEX,133.920000,1
2019-10-24 18:02:45.216540928,2019-10-24 18:02:45.216521571,9947060,T,IEX,133.910000,1
2019-10-24 18:03:06.142791936,2019-10-24 18:03:06.142772597,9955760,T,IEX,133.915000,1
2019-10-24 18:03:52.804229888,2019-10-24 18:03:52.804212387,9979511,T,IEX,133.910000,3
2019-10-24 18:04:25.282680064,2019-10-24 18:04:25.282656797,9994830,T,IEX,133.890000,5
2019-10-24 18:04:25.290582016,2019-10-24 18:04:25.290562383,9994831,T,IEX,133.890000,1
2019-10-24 18:04:25.290598912,2019-10-24 18:04:25.290581145,9994832,T,IEX,133.890000,4
2019-10-24 18:04:39.9470976,2019-10-24 18:04:39.9451046,9999864,T,IEX,133.870000,1
2019-10-24 18:04:45.304483072,2019-10-24 18:04:45.304468155,10002954,T,IEX,133.865000,5
2019-10-24 18:05:45.347059968,2019-10-24 18:05:45.347040092,10024501,T,IEX,133.850000,4
2019-10-24 18:06:15.989236992,2019-10-24 18:06:15.989219586,10032286,T,IEX,133.845000,239
2019-10-24 18:06:18.712758016,2019-10-24 18:06:18.712740042,10033013,T,IEX,133.845000,5
2019-10-24 18:06:45.355695104,2019-10-24 18:06:45.355679543,10040149,T,IEX,133.830000,2
2019-10-24 18:07:27.482798080,2019-10-24 18:07:27.482777208,10052314,T,IEX,133.825000,3
2019-10-24 18:07:35.841028096,2019-10-24 18:07:35.841009865,10054744,T,IEX,133.830000,100
2019-10-24 18:07:35.841329920,2019-10-24 18:07:35.841310211,10054754,T,IEX,133.830000,1
2019-10-24 18:07:45.382920960,2019-10-24 18:07:45.382900757,10059346,T,IEX,133.840000,1
2019-10-24 18:08:03.318278912,2019-10-24 18:08:03.318260452,10066384,T,IEX,133.820000,2
2019-10-24 18:08:03.318298112,2019-10-24 18:08:03.318280695,10066385,T,IEX,133.820000,3
2019-10-24 18:08:45.618117888,2019-10-24 18:08:45.618096037,10080136,T,IEX,133.800000,1
2019-10-24 18:09:03.574810112,2019-10-24 18:09:03.574789218,10086161,T,IEX,133.800000,3
2019-10-24 18:09:22.35951104,2019-10-24 18:09:22.35929943,10091615,T,IEX,133.790000,2
2019-10-24 18:09:22.35969024,2019-10-24 18:09:22.35950078,10091616,T,IEX,133.790000,98
2019-10-24 18:09:28.64090112,2019-10-24 18:09:28.64073220,10094659,T,IEX,133.800000,100
2019-10-24 18:11:04.307038976,2019-10-24 18:11:04.307019791,10128564,T,IEX,133.760000,1
2019-10-24 18:11:06.748345088,2019-10-24 18:11:06.748330100,10129613,T,IEX,133.760000,7
2019-10-24 18:11:12.736776960,2019-10-24 18:11:12.736759103,10131701,T,IEX,133.775000,1
2019-10-24 18:11:45.869788928,2019-10-24 18:11:45.869769379,10142039,T,IEX,133.765000,2
2019-10-24 18:12:04.546981888,2019-10-24 18:12:04.546962020,10148858,T,IEX,133.770000,1
2019-10-24 18:12:04.603621888,2019-10-24 18:12:04.603601715,10148889,T,IEX,133.775000,1
2019-10-24 18:12:12.512214016,2019-10-24 18:12:12.512197962,10152107,T,IEX,133.760000,1
2019-10-24 18:12:48.822886912,2019-10-24 18:12:48.822864911,10163719,T,IEX,133.760000,1
2019-10-24 18:12:48.822990080,2019-10-24 18:12:48.822972325,10163720,T,IEX,133.760000,363
2019-10-24 18:12:48.824370944,2019-10-24 18:12:48.824352139,10163722,T,IEX,133.760000,228
2019-10-24 18:12:48.830448896,2019-10-24 18:12:48.830428053,10163725,T,IEX,133.760000,2
2019-10-24 18:13:06.115440128,2019-10-24 18:13:06.115420143,10170625,T,IEX,133.770000,1
2019-10-24 18:13:43.498512896,2019-10-24 18:13:43.498494950,10185744,T,IEX,133.780000,1
2019-10-24 18:13:43.506146048,2019-10-24 18:13:43.506123640,10185787,T,IEX,133.780000,2
2019-10-24 18:13:46.427570944,2019-10-24 18:13:46.427552825,10187172,T,IEX,133.780000,1
2019-10-24 18:14:08.561899008,2019-10-24 18:14:08.561880597,10195738,T,IEX,133.785000,1
2019-10-24 18:14:23.863173888,2019-10-24 18:14:23.863155047,10201651,T,IEX,133.770000,1
2019-10-24 18:15:28.873787904,2019-10-24 18:15:28.873767613,10228677,T,IEX,133.770000,1
2019-10-24 18:15:32.140777984,2019-10-24 18:15:32.140756828,10230988,T,IEX,133.765000,1
2019-10-24 18:15:45.109687040,2019-10-24 18:15:45.109668895,10235760,T,IEX,133.765000,1
2019-10-24 18:15:45.116109056,2019-10-24 18:15:45.116091448,10235767,T,IEX,133.765000,1
2019-10-24 18:15:45.160196096,2019-10-24 18:15:45.160178958,10235809,T,IEX,133.765000,10
2019-10-24 18:16:06.118601984,2019-10-24 18:16:06.118586892,10243616,T,IEX,133.765000,1
2019-10-24 18:16:06.127286016,2019-10-24 18:16:06.127263312,10243617,T,IEX,133.770000,1
2019-10-24 18:16:07.69961984,2019-10-24 18:16:07.69944158,10243905,T,IEX,133.760000,1
2019-10-24 18:16:07.70013952,2019-10-24 18:16:07.69997635,10243906,T,IEX,133.760000,261
2019-10-24 18:16:07.79335936,2019-10-24 18:16:07.79315705,10243907,T,IEX,133.760000,1
2019-10-24 18:16:24.363321088,2019-10-24 18:16:24.363302725,10250309,T,IEX,133.745000,1
2019-10-24 18:16:24.371138048,2019-10-24 18:16:24.371117555,10250312,T,IEX,133.745000,1
2019-10-24 18:16:24.388055040,2019-10-24 18:16:24.388034022,10250318,T,IEX,133.745000,4
2019-10-24 18:16:24.403101952,2019-10-24 18:16:24.403082301,10250320,T,IEX,133.740000,2
2019-10-24 18:16:45.138864896,2019-10-24 18:16:45.138846027,10256536,T,IEX,133.745000,1
2019-10-24 18:16:48.100519936,2019-10-24 18:16:48.100505261,10257357,T,IEX,133.745000,3
2019-10-24 18:16:48.108898048,2019-10-24 18:16:48.108876882,10257361,T,IEX,133.745000,1
2019-10-24 18:16:59.617786112,2019-10-24 18:16:59.617766581,10260509,T,IEX,133.745000,42
2019-10-24 18:17:06.66491904,2019-10-24 18:17:06.66475306,10263218,T,IEX,133.745000,1
2019-10-24 18:17:35.716609024,2019-10-24 18:17:35.716589256,10275570,T,IEX,133.760000,2400
2019-10-24 18:17:36.114563072,2019-10-24 18:17:36.114548060,10275700,T,IEX,133.760000,1
2019-10-24 18:17:53.512235008,2019-10-24 18:17:53.512216164,10280437,T,IEX,133.760000,4
2019-10-24 18:18:07.500463104,2019-10-24 18:18:07.500446112,10285951,T,IEX,133.740000,1
2019-10-24 18:18:12.250337024,2019-10-24 18:18:12.250319981,10288535,T,IEX,133.735000,100
2019-10-24 18:18:13.70568960,2019-10-24 18:18:13.70550809,10288861,T,IEX,133.720000,1
2019-10-24 18:18:33.452956928,2019-10-24 18:18:33.452939110,10297529,T,IEX,133.705000,100
2019-10-24 18:18:33.454038016,2019-10-24 18:18:33.454017566,10297530,T,IEX,133.705000,100
2019-10-24 18:18:45.251322112,2019-10-24 18:18:45.251302344,10301513,T,IEX,133.685000,1
2019-10-24 18:18:54.444619008,2019-10-24 18:18:54.444599792,10304989,T,IEX,133.690000,100
2019-10-24 18:19:03.639887104,2019-10-24 18:19:03.639865986,10307506,T,IEX,133.685000,6
2019-10-24 18:19:03.693211904,2019-10-24 18:19:03.693192406,10307539,T,IEX,133.690000,1
2019-10-24 18:19:19.60368896,2019-10-24 18:19:19.60350817,10313064,T,IEX,133.670000,1
2019-10-24 18:19:23.787329024,2019-10-24 18:19:23.787310743,10316332,T,IEX,133.680000,3
2019-10-24 18:19:33.680980992,2019-10-24 18:19:33.680961193,10320318,T,IEX,133.680000,1
2019-10-24 18:19:33.691645952,2019-10-24 18:19:33.691625354,10320319,T,IEX,133.690000,1
2019-10-24 18:20:45.373965056,2019-10-24 18:20:45.373944995,10342982,T,IEX,133.675000,1
2019-10-24 18:21:05.834708992,2019-10-24 18:21:05.834690719,10350219,T,IEX,133.670000,2
2019-10-24 18:21:45.430134016,2019-10-24 18:21:45.430116091,10364204,T,IEX,133.660000,1
2019-10-24 18:22:06.152743936,2019-10-24 18:22:06.152724328,10373970,T,IEX,133.640000,2
2019-10-24 18:22:06.171170048,2019-10-24 18:22:06.171148264,10373973,T,IEX,133.640000,9
2019-10-24 18:22:06.336562944,2019-10-24 18:22:06.336543648,10374061,T,IEX,133.640000,4
2019-10-24 18:22:24.58073088,2019-10-24 18:22:24.58057410,10382175,T,IEX,133.640000,1
2019-10-24 18:22:45.493431040,2019-10-24 18:22:45.493416440,10389736,T,IEX,133.640000,1
2019-10-24 18:23:25.131535872,2019-10-24 18:23:25.131519507,10404291,T,IEX,133.650000,1
2019-10-24 18:23:28.800986112,2019-10-24 18:23:28.800968058,10405581,T,IEX,133.670000,4
2019-10-24 18:23:45.533230080,2019-10-24 18:23:45.533208055,10411100,T,IEX,133.675000,1
2019-10-24 18:24:05.669502976,2019-10-24 18:24:05.669485093,10419013,T,IEX,133.680000,2
2019-10-24 18:24:10.671032064,2019-10-24 18:24:10.671010429,10420845,T,IEX,133.675000,1
2019-10-24 18:25:45.606532096,2019-10-24 18:25:45.606516392,10461451,T,IEX,133.660000,1
2019-10-24 18:26:45.634919936,2019-10-24 18:26:45.634901651,10484906,T,IEX,133.625000,1
2019-10-24 18:27:00.137289984,2019-10-24 18:27:00.137267896,10489008,T,IEX,133.620000,3
2019-10-24 18:28:04.833716992,2019-10-24 18:28:04.833696233,10509873,T,IEX,133.620000,74
2019-10-24 18:28:06.225228032,2019-10-24 18:28:06.225207722,10510310,T,IEX,133.620000,1
2019-10-24 18:29:03.547640064,2019-10-24 18:29:03.547622460,10529377,T,IEX,133.610000,21
2019-10-24 18:29:03.547656960,2019-10-24 18:29:03.547641986,10529378,T,IEX,133.610000,79
2019-10-24 18:29:57.721692928,2019-10-24 18:29:57.721674861,10548371,T,IEX,133.645000,487
2019-10-24 18:29:59.729379072,2019-10-24 18:29:59.729357818,10548854,T,IEX,133.640000,100
2019-10-24 18:30:22.82896896,2019-10-24 18:30:22.82876446,10557651,T,IEX,133.640000,60
2019-10-24 18:30:43.926276096,2019-10-24 18:30:43.926257328,10564705,T,IEX,133.630000,100
2019-10-24 18:31:01.879046912,2019-10-24 18:31:01.879027733,10569956,T,IEX,133.665000,6
2019-10-24 18:31:01.879453952,2019-10-24 18:31:01.879437305,10569957,T,IEX,133.670000,100
2019-10-24 18:31:01.879476992,2019-10-24 18:31:01.879457071,10569958,T,IEX,133.670000,100
2019-10-24 18:31:01.936954880,2019-10-24 18:31:01.936937157,10569967,T,IEX,133.670000,100
2019-10-24 18:31:33.717945088,2019-10-24 18:31:33.717923029,10582699,T,IEX,133.645000,100
2019-10-24 18:32:05.480201984,2019-10-24 18:32:05.480184991,10596284,T,IEX,133.675000,100
2019-10-24 18:32:06.675762944,2019-10-24 18:32:06.675746704,10597360,T,IEX,133.675000,100
2019-10-24 18:32:12.108199936,2019-10-24 18:32:12.108182334,10601416,T,IEX,133.710000,2
2019-10-24 18:32:49.12782080,2019-10-24 18:32:49.12764644,10614747,T,IEX,133.710000,92
2019-10-24 18:32:52.453658112,2019-10-24 18:32:52.453638619,10616056,T,IEX,133.700000,2
2019-10-24 18:33:28.319422976,2019-10-24 18:33:28.319404048,10628613,T,IEX,133.695000,100
2019-10-24 18:33:28.325690112,2019-10-24 18:33:28.325670190,10628615,T,IEX,133.700000,300
2019-10-24 18:33:28.340358912,2019-10-24 18:33:28.340339008,10628627,T,IEX,133.700000,200
2019-10-24 18:33:28.341381888,2019-10-24 18:33:28.341361908,10628628,T,IEX,133.700000,600
2019-10-24 18:33:28.374910976,2019-10-24 18:33:28.374892694,10628635,T,IEX,133.680000,100
2019-10-24 18:33:47.825167104,2019-10-24 18:33:47.825149611,10637705,T,IEX,133.730000,224
2019-10-24 18:34:01.901299968,2019-10-24 18:34:01.901282859,10642009,T,IEX,133.725000,25
2019-10-24 18:34:01.901317888,2019-10-24 18:34:01.901302924,10642010,T,IEX,133.725000,35
2019-10-24 18:34:29.322629888,2019-10-24 18:34:29.322608505,10656804,T,IEX,133.735000,338
2019-10-24 18:35:05.548602112,2019-10-24 18:35:05.548584519,10670870,T,IEX,133.740000,100
2019-10-24 18:35:10.240465920,2019-10-24 18:35:10.240449417,10673691,T,IEX,133.740000,300
2019-10-24 18:35:15.410160896,2019-10-24 18:35:15.410141012,10675622,T,IEX,133.750000,300
2019-10-24 18:35:20.874406912,2019-10-24 18:35:20.874391914,10677561,T,IEX,133.750000,300
2019-10-24 18:35:23.220989952,2019-10-24 18:35:23.220969295,10678771,T,IEX,133.740000,100
2019-10-24 18:37:17.406800896,2019-10-24 18:37:17.406780130,10714145,T,IEX,133.790000,810
2019-10-24 18:37:17.407809024,2019-10-24 18:37:17.407791305,10714146,T,IEX,133.790000,100
2019-10-24 18:38:32.709733120,2019-10-24 18:38:32.709714461,10738097,T,IEX,133.805000,100
2019-10-24 18:39:02.455752960,2019-10-24 18:39:02.455732214,10744514,T,IEX,133.810000,3
2019-10-24 18:39:46.267034880,2019-10-24 18:39:46.267012423,10757764,T,IEX,133.795000,1
2019-10-24 18:40:15.635889920,2019-10-24 18:40:15.635872689,10770271,T,IEX,133.800000,100
2019-10-24 18:42:02.27354112,2019-10-24 18:42:02.27333355,10810059,T,IEX,133.840000,100
2019-10-24 18:42:44.556026880,2019-10-24 18:42:44.556007916,10824371,T,IEX,133.875000,12400
2019-10-24 18:43:04.847182080,2019-10-24 18:43:04.847163288,10831490,T,IEX,133.880000,100
2019-10-24 18:43:20.912946944,2019-10-24 18:43:20.912927820,10836158,T,IEX,133.930000,98
2019-10-24 18:43:46.484728064,2019-10-24 18:43:46.484713096,10844226,T,IEX,133.915000,100
2019-10-24 18:44:09.414626048,2019-10-24 18:44:09.414610036,10853833,T,IEX,133.910000,36
2019-10-24 18:45:06.947278080,2019-10-24 18:45:06.947263035,10875019,T,IEX,133.900000,1
2019-10-24 18:45:45.150593024,2019-10-24 18:45:45.150573116,10889389,T,IEX,133.910000,100
2019-10-24 18:47:47.5460992,2019-10-24 18:47:47.5443919,10928340,T,IEX,133.955000,100
2019-10-24 18:48:47.387696128,2019-10-24 18:48:47.387679712,10950046,T,IEX,133.915000,100
2019-10-24 18:50:24.387460096,2019-10-24 18:50:24.387439652,10980229,T,IEX,133.900000,100
2019-10-24 18:50:37.542927872,2019-10-24 18:50:37.542907987,10983994,T,IEX,133.900000,100
2019-10-24 18:52:25.146842112,2019-10-24 18:52:25.146822584,11017390,T,IEX,133.940000,100
2019-10-24 18:52:46.567568896,2019-10-24 18:52:46.567553059,11023500,T,IEX,133.945000,100
2019-10-24 18:53:06.546544128,2019-10-24 18:53:06.546522013,11029513,T,IEX,133.950000,10
2019-10-24 18:53:46.228055040,2019-10-24 18:53:46.228034975,11041622,T,IEX,133.910000,100
2019-10-24 18:54:04.686771968,2019-10-24 18:54:04.686752602,11048111,T,IEX,133.925000,100
2019-10-24 18:55:46.695610880,2019-10-24 18:55:46.695594600,11079325,T,IEX,133.955000,100
2019-10-24 18:57:46.823837952,2019-10-24 18:57:46.823819122,11113000,T,IEX,133.925000,100
2019-10-24 18:58:58.414364928,2019-10-24 18:58:58.414346118,11136145,T,IEX,133.910000,2
2019-10-24 18:59:45.963636992,2019-10-24 18:59:45.963617158,11152423,T,IEX,133.875000,100
2019-10-24 19:00:46.294626048,2019-10-24 19:00:46.294607084,11176097,T,IEX,133.900000,1
2019-10-24 19:01:00.548556032,2019-10-24 19:01:00.548536557,11181798,T,IEX,133.925000,100
2019-10-24 19:01:01.217657088,2019-10-24 19:01:01.217642185,11182204,T,IEX,133.935000,10
2019-10-24 19:02:33.6697984,2019-10-24 19:02:33.6682252,11214408,T,IEX,133.975000,313
2019-10-24 19:03:04.437775104,2019-10-24 19:03:04.437753859,11222651,T,IEX,134.000000,100
2019-10-24 19:04:01.719064064,2019-10-24 19:04:01.719044197,11240319,T,IEX,134.010000,1
2019-10-24 19:05:15.434854912,2019-10-24 19:05:15.434836106,11270031,T,IEX,133.980000,2
2019-10-24 19:08:01.419727872,2019-10-24 19:08:01.419706398,11328515,T,IEX,134.000000,1
2019-10-24 19:08:47.109006080,2019-10-24 19:08:47.108984960,11341743,T,IEX,133.990000,2
2019-10-24 19:08:47.109018112,2019-10-24 19:08:47.109002045,11341744,T,IEX,133.990000,3
2019-10-24 19:09:23.241860096,2019-10-24 19:09:23.241843549,11352004,T,IEX,133.980000,94
2019-10-24 19:11:15.296795904,2019-10-24 19:11:15.296776080,11382031,T,IEX,133.950000,1
2019-10-24 19:11:15.296806912,2019-10-24 19:11:15.296789279,11382032,T,IEX,133.950000,1
2019-10-24 19:13:18.898844928,2019-10-24 19:13:18.898822416,11420111,T,IEX,133.925000,2
2019-10-24 19:13:18.952636928,2019-10-24 19:13:18.952615871,11420141,T,IEX,133.920000,100
2019-10-24 19:14:42.499985920,2019-10-24 19:14:42.499966321,11445695,T,IEX,133.930000,100
2019-10-24 19:15:02.629018112,2019-10-24 19:15:02.629000765,11451070,T,IEX,133.935000,209
2019-10-24 19:16:46.611756032,2019-10-24 19:16:46.611738230,11487167,T,IEX,133.955000,2
2019-10-24 19:16:46.611773952,2019-10-24 19:16:46.611757991,11487168,T,IEX,133.955000,1
2019-10-24 19:18:04.992448000,2019-10-24 19:18:04.992429899,11514700,T,IEX,133.985000,25
2019-10-24 19:21:04.804446976,2019-10-24 19:21:04.804431691,11580922,T,IEX,134.030000,2
2019-10-24 19:22:52.624254976,2019-10-24 19:22:52.624236089,11619852,T,IEX,134.050000,100
2019-10-24 19:24:10.484986112,2019-10-24 19:24:10.484967224,11651107,T,IEX,134.080000,1
2019-10-24 19:24:36.104881920,2019-10-24 19:24:36.104865703,11659941,T,IEX,134.095000,50
2019-10-24 19:25:11.442682880,2019-10-24 19:25:11.442664207,11672719,T,IEX,134.095000,50
2019-10-24 19:27:19.512787968,2019-10-24 19:27:19.512770488,11722783,T,IEX,134.110000,100
2019-10-24 19:28:19.35081984,2019-10-24 19:28:19.35061852,11741639,T,IEX,134.090000,10
2019-10-24 19:31:02.998212096,2019-10-24 19:31:02.998193669,11809874,T,IEX,134.030000,34
2019-10-24 19:33:43.863369984,2019-10-24 19:33:43.863351608,11872163,T,IEX,134.075000,1
2019-10-24 19:34:50.926362880,2019-10-24 19:34:50.926344701,11897226,T,IEX,134.075000,1
2019-10-24 19:34:50.926381056,2019-10-24 19:34:50.926364251,11897227,T,IEX,134.080000,100
2019-10-24 19:36:47.620121088,2019-10-24 19:36:47.620102624,11945535,T,IEX,134.055000,100
2019-10-24 19:37:39.221756928,2019-10-24 19:37:39.221735384,11970860,T,IEX,134.040000,2
2019-10-24 19:38:23.459704064,2019-10-24 19:38:23.459684810,11989428,T,IEX,134.025000,100
2019-10-24 19:38:37.93690880,2019-10-24 19:38:37.93675336,11995052,T,IEX,134.045000,1
2019-10-24 19:38:45.9249024,2019-10-24 19:38:45.9229817,11998689,T,IEX,134.045000,99
2019-10-24 19:39:21.8795904,2019-10-24 19:39:21.8774912,12019496,T,IEX,134.090000,100
2019-10-24 19:39:21.9293056,2019-10-24 19:39:21.9276628,12019498,T,IEX,134.090000,2
2019-10-24 19:40:01.264632064,2019-10-24 19:40:01.264614238,12039710,T,IEX,134.080000,1
2019-10-24 19:42:21.923661056,2019-10-24 19:42:21.923645861,12099797,T,IEX,134.015000,100
2019-10-24 19:43:59.647659008,2019-10-24 19:43:59.647639113,12141565,T,IEX,134.010000,100
2019-10-24 19:44:42.108325888,2019-10-24 19:44:42.108307168,12162641,T,IEX,133.990000,5
2019-10-24 19:45:00.135207936,2019-10-24 19:45:00.135190993,12172944,T,IEX,133.990000,100
2019-10-24 19:46:07.501516032,2019-10-24 19:46:07.501500947,12213872,T,IEX,134.010000,7
2019-10-24 19:46:07.501571072,2019-10-24 19:46:07.501555944,12213873,T,IEX,134.010000,4
2019-10-24 19:46:48.415257088,2019-10-24 19:46:48.415240962,12236273,T,IEX,134.025000,100
2019-10-24 19:47:18.316012032,2019-10-24 19:47:18.315994478,12252465,T,IEX,134.030000,100
2019-10-24 19:47:25.9067008,2019-10-24 19:47:25.9045051,12255645,T,IEX,134.030000,3
2019-10-24 19:49:09.218284032,2019-10-24 19:49:09.218263852,12318947,T,IEX,134.060000,1
2019-10-24 19:49:15.846315008,2019-10-24 19:49:15.846300201,12324244,T,IEX,134.055000,99
2019-10-24 19:49:41.816268032,2019-10-24 19:49:41.816252757,12338683,T,IEX,134.050000,100
2019-10-24 19:50:02.113008128,2019-10-24 19:50:02.112989825,12356947,T,IEX,134.090000,2
2019-10-24 19:51:42.225942016,2019-10-24 19:51:42.225921608,12430376,T,IEX,134.120000,42
2019-10-24 19:51:42.270001920,2019-10-24 19:51:42.269982835,12430388,T,IEX,134.100000,100
2019-10-24 19:53:00.514628096,2019-10-24 19:53:00.514612590,12482392,T,IEX,134.075000,100
2019-10-24 19:54:09.473212928,2019-10-24 19:54:09.473192813,12540943,T,IEX,134.035000,100
2019-10-24 19:54:42.714423040,2019-10-24 19:54:42.714402959,12565044,T,IEX,134.035000,100
2019-10-24 19:54:59.348914944,2019-10-24 19:54:59.348898780,12581234,T,IEX,134.060000,15
2019-10-24 19:54:59.348971008,2019-10-24 19:54:59.348954645,12581236,T,IEX,134.060000,8
2019-10-24 19:55:47.636129024,2019-10-24 19:55:47.636107658,12634450,T,IEX,134.090000,100
2019-10-24 19:56:40.152556032,2019-10-24 19:56:40.152540195,12684610,T,IEX,134.130000,5
2019-10-24 19:56:42.297084928,2019-10-24 19:56:42.297067126,12686470,T,IEX,134.130000,1
2019-10-24 19:57:20.401502976,2019-10-24 19:57:20.401484103,12726307,T,IEX,134.150000,100
2019-10-24 19:57:29.274723072,2019-10-24 19:57:29.274699952,12736353,T,IEX,134.125000,100
2019-10-24 19:57:31.305032960,2019-10-24 19:57:31.305014269,12738622,T,IEX,134.120000,3
2019-10-24 19:57:48.9295104,2019-10-24 19:57:48.9274990,12755139,T,IEX,134.125000,6
2019-10-24 19:58:12.731781120,2019-10-24 19:58:12.731760252,12783790,T,IEX,134.145000,2
2019-10-24 19:58:12.731802880,2019-10-24 19:58:12.731787061,12783791,T,IEX,134.145000,1
2019-10-24 19:58:20.387684096,2019-10-24 19:58:20.387667444,12792412,T,IEX,134.130000,100
2019-10-24 19:58:26.833467904,2019-10-24 19:58:26.833449456,12799171,T,IEX,134.120000,100
2019-10-24 19:59:00.418725120,2019-10-24 19:59:00.418702092,12839999,T,IEX,134.090000,302
2019-10-24 19:59:15.147687936,2019-10-24 19:59:15.147672430,12864158,T,IEX,134.140000,12
2019-10-24 19:59:15.377670912,2019-10-24 19:59:15.377655610,12864530,T,IEX,134.140000,11
