2019-10-02 13:36:47.173965056,2019-10-02 13:36:47.173945612,719923,T,IEX,17.670000,100
2019-10-02 13:43:38.599945984,2019-10-02 13:43:38.599928170,1299957,T,IEX,17.750000,100
2019-10-02 13:45:19.665381888,2019-10-02 13:45:19.665366413,1439163,T,IEX,17.740000,100
2019-10-02 13:49:11.922017024,2019-10-02 13:49:11.921997648,1730841,T,IEX,17.730000,100
2019-10-02 14:00:00.421116928,2019-10-02 14:00:00.421102645,2588187,T,IEX,17.690000,200
2019-10-02 14:01:50.485262080,2019-10-02 14:01:50.485244355,2759719,T,IEX,17.700000,200
2019-10-02 14:01:52.747672064,2019-10-02 14:01:52.747653900,2764043,T,IEX,17.700000,100
2019-10-02 14:03:12.652508928,2019-10-02 14:03:12.652489841,2908442,T,IEX,17.600000,50
2019-10-02 14:06:07.42287104,2019-10-02 14:06:07.42266498,3156275,T,IEX,17.585000,100
2019-10-02 14:11:55.41881088,2019-10-02 14:11:55.41865103,3573682,T,IEX,17.560000,100
2019-10-02 14:30:00.769358080,2019-10-02 14:30:00.769337548,4672894,T,IEX,17.800000,200
2019-10-02 14:30:05.506512896,2019-10-02 14:30:05.506496310,4680364,T,IEX,17.880000,1000
2019-10-02 14:30:11.742884096,2019-10-02 14:30:11.742865139,4690061,T,IEX,18.100000,200
2019-10-02 14:30:43.98928896,2019-10-02 14:30:43.98899258,4763823,T,IEX,17.970000,200
2019-10-02 14:33:09.188231936,2019-10-02 14:33:09.188216423,4993169,T,IEX,18.160000,100
2019-10-02 14:33:09.188246016,2019-10-02 14:33:09.188229407,4993170,T,IEX,18.160000,100
2019-10-02 14:33:15.926320896,2019-10-02 14:33:15.926302887,5000837,T,IEX,18.240000,100
2019-10-02 14:33:15.926334976,2019-10-02 14:33:15.926317390,5000838,T,IEX,18.240000,1000
2019-10-02 14:33:17.553672960,2019-10-02 14:33:17.553654143,5004883,T,IEX,18.220000,100
2019-10-02 14:33:30.298336000,2019-10-02 14:33:30.298320487,5024207,T,IEX,18.200000,100
2019-10-02 14:37:00.552416000,2019-10-02 14:37:00.552397547,5313124,T,IEX,18.340000,100
2019-10-02 14:40:00.722963968,2019-10-02 14:40:00.722944052,5533611,T,IEX,18.350000,200
2019-10-02 14:45:57.485540096,2019-10-02 14:45:57.485524051,6032152,T,IEX,18.250000,100
2019-10-02 14:49:00.380883968,2019-10-02 14:49:00.380866874,6249725,T,IEX,18.360000,100
2019-10-02 14:49:59.52503040,2019-10-02 14:49:59.52483450,6324343,T,IEX,18.470000,300
2019-10-02 15:10:47.109786880,2019-10-02 15:10:47.109769739,7768625,T,IEX,18.530000,200
2019-10-02 15:36:10.152388096,2019-10-02 15:36:10.152368538,9543746,T,IEX,18.840000,100
2019-10-02 16:01:12.734735104,2019-10-02 16:01:12.734715610,10847353,T,IEX,18.590000,100
2019-10-02 16:10:38.143973888,2019-10-02 16:10:38.143950212,11245579,T,IEX,18.730000,100
2019-10-02 16:30:04.257565952,2019-10-02 16:30:04.257549511,11968401,T,IEX,18.520000,100
2019-10-02 16:37:51.632985088,2019-10-02 16:37:51.632965614,12216306,T,IEX,18.570000,100
2019-10-02 16:55:15.173363968,2019-10-02 16:55:15.173344052,12803812,T,IEX,18.680000,100
2019-10-02 17:06:22.211471872,2019-10-02 17:06:22.211451230,13291947,T,IEX,18.540000,100
2019-10-02 17:26:07.49102080,2019-10-02 17:26:07.49084622,14057849,T,IEX,18.240000,100
2019-10-02 17:42:51.453458944,2019-10-02 17:42:51.453441207,14648412,T,IEX,18.310000,100
2019-10-02 17:54:33.209075968,2019-10-02 17:54:33.209053937,15033917,T,IEX,18.360000,300
2019-10-02 18:12:42.430641920,2019-10-02 18:12:42.430620375,15730825,T,IEX,18.250000,100
2019-10-02 18:30:38.505677056,2019-10-02 18:30:38.505659769,16369070,T,IEX,18.490000,100
2019-10-02 18:45:58.303564032,2019-10-02 18:45:58.303544433,16902398,T,IEX,18.550000,100
