2019-11-01 13:30:12.21262080,2019-11-01 13:30:12.21237012,135757,T,IEX,340.985000,100
2019-11-01 13:30:25.318726912,2019-11-01 13:30:25.318702070,155240,T,IEX,341.700000,100
2019-11-01 13:30:39.483404032,2019-11-01 13:30:39.483377660,173035,T,IEX,341.730000,100
2019-11-01 13:30:39.483553024,2019-11-01 13:30:39.483529771,173036,T,IEX,341.730000,100
2019-11-01 13:30:55.263942912,2019-11-01 13:30:55.263917413,190221,T,IEX,341.520000,100
2019-11-01 13:33:27.926073088,2019-11-01 13:33:27.926051077,357134,T,IEX,340.390000,1
2019-11-01 13:33:48.177320960,2019-11-01 13:33:48.177302146,376464,T,IEX,340.430000,1
2019-11-01 13:34:27.490246912,2019-11-01 13:34:27.490230698,416127,T,IEX,340.600000,100
2019-11-01 13:34:27.491822080,2019-11-01 13:34:27.491804540,416130,T,IEX,340.600000,100
2019-11-01 13:34:28.253798912,2019-11-01 13:34:28.253778593,417424,T,IEX,340.990000,100
2019-11-01 13:34:30.683713024,2019-11-01 13:34:30.683693197,419387,T,IEX,341.290000,100
2019-11-01 13:34:30.683763968,2019-11-01 13:34:30.683747206,419388,T,IEX,341.360000,100
2019-11-01 13:35:00.46040064,2019-11-01 13:35:00.46020175,446215,T,IEX,341.660000,100
2019-11-01 13:35:08.37831936,2019-11-01 13:35:08.37814646,458770,T,IEX,341.655000,100
2019-11-01 13:35:11.584538112,2019-11-01 13:35:11.584517274,463476,T,IEX,341.420000,100
2019-11-01 13:35:17.498170112,2019-11-01 13:35:17.498151637,469546,T,IEX,341.470000,100
2019-11-01 13:35:41.193377024,2019-11-01 13:35:41.193360386,489975,T,IEX,341.345000,2
2019-11-01 13:35:43.881208064,2019-11-01 13:35:43.881186530,492010,T,IEX,341.320000,22
2019-11-01 13:36:07.736884992,2019-11-01 13:36:07.736865119,516454,T,IEX,341.210000,33
2019-11-01 13:36:20.223970048,2019-11-01 13:36:20.223951851,529577,T,IEX,341.500000,1
2019-11-01 13:36:20.528369920,2019-11-01 13:36:20.528352913,529793,T,IEX,341.645000,100
2019-11-01 13:37:27.372805888,2019-11-01 13:37:27.372787618,600051,T,IEX,341.140000,2
2019-11-01 13:38:01.155282944,2019-11-01 13:38:01.155266837,632174,T,IEX,341.310000,100
2019-11-01 13:38:08.316282880,2019-11-01 13:38:08.316266844,640118,T,IEX,341.470000,100
2019-11-01 13:39:12.409568000,2019-11-01 13:39:12.409552047,698756,T,IEX,341.990000,50
2019-11-01 13:39:28.67590912,2019-11-01 13:39:28.67571365,715818,T,IEX,341.980000,20
2019-11-01 13:40:13.377008896,2019-11-01 13:40:13.376988986,759197,T,IEX,341.765000,2
2019-11-01 13:41:30.369080064,2019-11-01 13:41:30.369061632,831821,T,IEX,341.940000,100
2019-11-01 13:41:55.77771008,2019-11-01 13:41:55.77753257,852472,T,IEX,342.110000,50
2019-11-01 13:42:31.546595072,2019-11-01 13:42:31.546579685,887223,T,IEX,341.950000,100
2019-11-01 13:42:35.286564096,2019-11-01 13:42:35.286545644,890189,T,IEX,341.870000,20
2019-11-01 13:42:35.287728128,2019-11-01 13:42:35.287710782,890190,T,IEX,341.870000,30
2019-11-01 13:42:58.627531008,2019-11-01 13:42:58.627515500,907535,T,IEX,341.830000,158
2019-11-01 13:44:31.247929088,2019-11-01 13:44:31.247908945,977518,T,IEX,341.810000,250
2019-11-01 13:44:33.634828032,2019-11-01 13:44:33.634809921,979748,T,IEX,341.810000,100
2019-11-01 13:45:00.82177024,2019-11-01 13:45:00.82156043,994750,T,IEX,341.665000,100
2019-11-01 13:45:08.874267904,2019-11-01 13:45:08.874251226,999971,T,IEX,341.760000,100
2019-11-01 13:45:45.392435968,2019-11-01 13:45:45.392417211,1031293,T,IEX,341.710000,100
2019-11-01 13:46:26.810961920,2019-11-01 13:46:26.810943926,1065016,T,IEX,341.570000,2
2019-11-01 13:46:26.954808064,2019-11-01 13:46:26.954787413,1065167,T,IEX,341.550000,8
2019-11-01 13:46:33.97869056,2019-11-01 13:46:33.97847839,1071555,T,IEX,341.520000,2
2019-11-01 13:48:16.205917952,2019-11-01 13:48:16.205899789,1154519,T,IEX,341.860000,100
2019-11-01 13:49:09.422938112,2019-11-01 13:49:09.422916245,1198230,T,IEX,341.695000,2
2019-11-01 13:50:20.444547072,2019-11-01 13:50:20.444525238,1252304,T,IEX,341.815000,100
2019-11-01 13:50:22.551450112,2019-11-01 13:50:22.551431463,1254955,T,IEX,341.895000,100
2019-11-01 13:52:43.82562048,2019-11-01 13:52:43.82545956,1361818,T,IEX,342.345000,16
2019-11-01 13:55:08.542938112,2019-11-01 13:55:08.542917799,1501364,T,IEX,342.480000,100
2019-11-01 13:55:26.6309888,2019-11-01 13:55:26.6291552,1514969,T,IEX,342.625000,100
2019-11-01 13:56:27.835881984,2019-11-01 13:56:27.835863022,1564705,T,IEX,342.460000,15
2019-11-01 13:56:31.903770880,2019-11-01 13:56:31.903750931,1568578,T,IEX,342.490000,50
2019-11-01 13:58:55.550000896,2019-11-01 13:58:55.549982382,1675983,T,IEX,342.130000,20
2019-11-01 13:59:35.339298048,2019-11-01 13:59:35.339279448,1705179,T,IEX,342.070000,35
2019-11-01 14:00:19.182085888,2019-11-01 14:00:19.182068548,1770641,T,IEX,342.170000,52
2019-11-01 14:00:56.64243968,2019-11-01 14:00:56.64226776,1828702,T,IEX,342.170000,100
2019-11-01 14:02:41.779495936,2019-11-01 14:02:41.779479847,1981635,T,IEX,342.720000,50
2019-11-01 14:02:41.787407872,2019-11-01 14:02:41.787391835,1981650,T,IEX,342.720000,20
2019-11-01 14:02:59.544532992,2019-11-01 14:02:59.544516947,2003006,T,IEX,342.920000,100
2019-11-01 14:04:37.354935040,2019-11-01 14:04:37.354916442,2126159,T,IEX,342.820000,100
2019-11-01 14:06:29.562236928,2019-11-01 14:06:29.562075794,2253077,T,IEX,343.245000,100
2019-11-01 14:07:25.614927104,2019-11-01 14:07:25.614909630,2302693,T,IEX,342.815000,100
2019-11-01 14:08:16.524206080,2019-11-01 14:08:16.524188419,2343834,T,IEX,342.750000,3
2019-11-01 14:09:01.733136896,2019-11-01 14:09:01.733116872,2378161,T,IEX,342.840000,100
2019-11-01 14:10:00.232068096,2019-11-01 14:10:00.232051741,2422572,T,IEX,342.930000,100
2019-11-01 14:10:50.743996928,2019-11-01 14:10:50.743978559,2458224,T,IEX,343.110000,100
2019-11-01 14:11:06.636310016,2019-11-01 14:11:06.636291788,2469468,T,IEX,343.090000,100
2019-11-01 14:11:10.297362944,2019-11-01 14:11:10.297347582,2473033,T,IEX,343.070000,100
2019-11-01 14:11:10.299828992,2019-11-01 14:11:10.299810717,2473035,T,IEX,343.070000,100
2019-11-01 14:11:10.310137088,2019-11-01 14:11:10.310119010,2473044,T,IEX,343.070000,123
2019-11-01 14:11:48.339264000,2019-11-01 14:11:48.339248236,2502517,T,IEX,342.800000,100
2019-11-01 14:11:48.911817984,2019-11-01 14:11:48.911799055,2502816,T,IEX,342.815000,100
2019-11-01 14:14:03.980696064,2019-11-01 14:14:03.980679444,2613450,T,IEX,343.020000,200
2019-11-01 14:14:42.621697024,2019-11-01 14:14:42.621680839,2641021,T,IEX,342.880000,100
2019-11-01 14:14:42.621714944,2019-11-01 14:14:42.621695095,2641022,T,IEX,342.880000,100
2019-11-01 14:16:31.737000960,2019-11-01 14:16:31.736981064,2726411,T,IEX,343.285000,10
2019-11-01 14:17:33.324025088,2019-11-01 14:17:33.324005868,2774379,T,IEX,343.560000,100
2019-11-01 14:17:36.357640960,2019-11-01 14:17:36.357621998,2776618,T,IEX,343.510000,100
2019-11-01 14:17:53.802092032,2019-11-01 14:17:53.802073750,2785581,T,IEX,343.585000,2
2019-11-01 14:19:11.493580032,2019-11-01 14:19:11.493562341,2853411,T,IEX,343.320000,100
2019-11-01 14:19:12.433460992,2019-11-01 14:19:12.433444433,2854598,T,IEX,343.320000,200
2019-11-01 14:19:44.996962048,2019-11-01 14:19:44.996943493,2876589,T,IEX,343.340000,100
2019-11-01 14:20:31.186857984,2019-11-01 14:20:31.186838937,2914291,T,IEX,343.460000,3
2019-11-01 14:21:26.201952000,2019-11-01 14:21:26.201934829,2957971,T,IEX,343.430000,100
2019-11-01 14:22:01.340722944,2019-11-01 14:22:01.340704866,2987107,T,IEX,343.280000,91
2019-11-01 14:22:14.204411904,2019-11-01 14:22:14.204392909,2998452,T,IEX,343.265000,100
2019-11-01 14:23:30.632478976,2019-11-01 14:23:30.632461523,3055417,T,IEX,343.340000,10
2019-11-01 14:23:32.622973952,2019-11-01 14:23:32.622954119,3056744,T,IEX,343.365000,100
2019-11-01 14:26:09.170249984,2019-11-01 14:26:09.170231855,3171021,T,IEX,343.140000,25
2019-11-01 14:26:11.373391104,2019-11-01 14:26:11.373375398,3172386,T,IEX,343.080000,50
2019-11-01 14:26:11.382262016,2019-11-01 14:26:11.382245988,3172394,T,IEX,343.020000,20
2019-11-01 14:26:17.129501952,2019-11-01 14:26:17.129483713,3176447,T,IEX,343.080000,20
2019-11-01 14:26:20.540548096,2019-11-01 14:26:20.540530064,3178736,T,IEX,343.000000,100
2019-11-01 14:27:40.230819072,2019-11-01 14:27:40.230798640,3230490,T,IEX,342.670000,100
2019-11-01 14:28:27.630127104,2019-11-01 14:28:27.630111290,3262276,T,IEX,342.605000,100
2019-11-01 14:28:43.134400000,2019-11-01 14:28:43.134382204,3270676,T,IEX,342.645000,125
2019-11-01 14:29:06.271497984,2019-11-01 14:29:06.271482048,3287058,T,IEX,342.620000,200
2019-11-01 14:29:12.3206912,2019-11-01 14:29:12.3189545,3292142,T,IEX,342.610000,100
2019-11-01 14:29:55.634287104,2019-11-01 14:29:55.634268984,3321309,T,IEX,342.620000,100
2019-11-01 14:30:08.524977920,2019-11-01 14:30:08.524958220,3333222,T,IEX,342.620000,100
2019-11-01 14:30:08.604322048,2019-11-01 14:30:08.604306856,3333272,T,IEX,342.620000,100
2019-11-01 14:30:08.620282880,2019-11-01 14:30:08.620264700,3333315,T,IEX,342.620000,100
2019-11-01 14:30:09.998231040,2019-11-01 14:30:09.998213081,3334495,T,IEX,342.680000,1
2019-11-01 14:30:32.47668992,2019-11-01 14:30:32.47651088,3350415,T,IEX,342.695000,29
2019-11-01 14:30:34.549884928,2019-11-01 14:30:34.549867709,3352686,T,IEX,342.770000,100
2019-11-01 14:30:50.230829056,2019-11-01 14:30:50.230809604,3361421,T,IEX,342.910000,100
2019-11-01 14:30:50.232449024,2019-11-01 14:30:50.232432685,3361423,T,IEX,342.910000,126
2019-11-01 14:31:12.661658880,2019-11-01 14:31:12.661639443,3380969,T,IEX,343.070000,10
2019-11-01 14:31:20.934448896,2019-11-01 14:31:20.934431393,3387014,T,IEX,343.090000,100
2019-11-01 14:31:33.581172992,2019-11-01 14:31:33.581155610,3396157,T,IEX,343.020000,100
2019-11-01 14:31:50.956600064,2019-11-01 14:31:50.956580830,3405435,T,IEX,343.000000,5
2019-11-01 14:32:29.877463040,2019-11-01 14:32:29.877439328,3434777,T,IEX,343.015000,100
2019-11-01 14:32:38.179930112,2019-11-01 14:32:38.179910365,3441018,T,IEX,342.950000,6
2019-11-01 14:33:31.814266880,2019-11-01 14:33:31.814251774,3477013,T,IEX,342.790000,14
2019-11-01 14:33:58.643247104,2019-11-01 14:33:58.643229721,3497772,T,IEX,342.850000,2
2019-11-01 14:33:58.643267072,2019-11-01 14:33:58.643251818,3497773,T,IEX,342.900000,5
2019-11-01 14:34:41.514743040,2019-11-01 14:34:41.514724428,3527835,T,IEX,343.060000,1
2019-11-01 14:36:52.894855936,2019-11-01 14:36:52.894835962,3620724,T,IEX,342.900000,100
2019-11-01 14:39:11.662714880,2019-11-01 14:39:11.662696337,3703658,T,IEX,342.960000,100
2019-11-01 14:40:02.321870080,2019-11-01 14:40:02.321852773,3733537,T,IEX,342.900000,10
2019-11-01 14:41:00.333291008,2019-11-01 14:41:00.333271253,3766878,T,IEX,342.980000,100
2019-11-01 14:41:22.510202112,2019-11-01 14:41:22.510183262,3780510,T,IEX,342.950000,10
2019-11-01 14:42:00.426398976,2019-11-01 14:42:00.426380493,3803251,T,IEX,342.930000,100
2019-11-01 14:42:30.600916992,2019-11-01 14:42:30.600900747,3822544,T,IEX,343.000000,100
2019-11-01 14:42:56.936890112,2019-11-01 14:42:56.936870030,3840443,T,IEX,343.310000,1
2019-11-01 14:42:58.468239872,2019-11-01 14:42:58.468222133,3841320,T,IEX,343.350000,100
2019-11-01 14:44:15.997573120,2019-11-01 14:44:15.997551817,3898229,T,IEX,343.680000,100
2019-11-01 14:44:15.998537984,2019-11-01 14:44:15.998520413,3898231,T,IEX,343.680000,100
2019-11-01 14:44:27.806483968,2019-11-01 14:44:27.806465654,3904778,T,IEX,343.680000,100
2019-11-01 14:44:50.17740032,2019-11-01 14:44:50.17717690,3917955,T,IEX,343.630000,100
2019-11-01 14:44:51.271806976,2019-11-01 14:44:51.271787762,3918958,T,IEX,343.565000,100
2019-11-01 14:45:04.789267968,2019-11-01 14:45:04.789248347,3928239,T,IEX,343.415000,100
2019-11-01 14:45:04.792244992,2019-11-01 14:45:04.792226188,3928243,T,IEX,343.370000,100
2019-11-01 14:45:04.944290048,2019-11-01 14:45:04.944270167,3928343,T,IEX,343.450000,100
2019-11-01 14:45:37.650778112,2019-11-01 14:45:37.650758752,3947115,T,IEX,343.530000,100
2019-11-01 14:46:08.278317056,2019-11-01 14:46:08.278299409,3963583,T,IEX,343.540000,100
2019-11-01 14:46:15.304007936,2019-11-01 14:46:15.303988466,3967661,T,IEX,343.490000,100
2019-11-01 14:46:25.90306048,2019-11-01 14:46:25.90287432,3972686,T,IEX,343.600000,3
2019-11-01 14:46:37.259396096,2019-11-01 14:46:37.259377297,3980032,T,IEX,343.640000,97
2019-11-01 14:46:37.259410944,2019-11-01 14:46:37.259392382,3980033,T,IEX,343.640000,103
2019-11-01 14:46:37.978490112,2019-11-01 14:46:37.978469312,3980379,T,IEX,343.580000,100
2019-11-01 14:46:46.365955072,2019-11-01 14:46:46.365938101,3984124,T,IEX,343.550000,100
2019-11-01 14:46:48.628690944,2019-11-01 14:46:48.628669920,3985091,T,IEX,343.440000,200
2019-11-01 14:46:53.480675072,2019-11-01 14:46:53.480658405,3988511,T,IEX,343.405000,100
2019-11-01 14:47:33.632993024,2019-11-01 14:47:33.632971741,4013398,T,IEX,343.350000,100
2019-11-01 14:47:33.634208000,2019-11-01 14:47:33.634190235,4013414,T,IEX,343.350000,100
2019-11-01 14:47:34.978770944,2019-11-01 14:47:34.978748857,4014176,T,IEX,343.350000,100
2019-11-01 14:47:39.511915008,2019-11-01 14:47:39.511894477,4016517,T,IEX,343.375000,100
2019-11-01 14:47:40.5175040,2019-11-01 14:47:40.5155451,4016734,T,IEX,343.360000,100
2019-11-01 14:47:40.280233984,2019-11-01 14:47:40.280215843,4016893,T,IEX,343.380000,99
2019-11-01 14:48:24.688347904,2019-11-01 14:48:24.688328384,4045129,T,IEX,343.210000,100
2019-11-01 14:49:18.337431040,2019-11-01 14:49:18.337411223,4075231,T,IEX,343.080000,200
2019-11-01 14:49:55.208776960,2019-11-01 14:49:55.208758351,4096018,T,IEX,342.920000,100
2019-11-01 14:51:08.688018944,2019-11-01 14:51:08.688003160,4141620,T,IEX,342.980000,100
2019-11-01 14:51:32.907844096,2019-11-01 14:51:32.907825418,4154188,T,IEX,343.025000,10
2019-11-01 14:51:32.907856896,2019-11-01 14:51:32.907839327,4154189,T,IEX,343.025000,10
2019-11-01 14:51:46.963106048,2019-11-01 14:51:46.963086274,4160702,T,IEX,342.920000,100
2019-11-01 14:52:36.37334016,2019-11-01 14:52:36.37315817,4188300,T,IEX,342.900000,900
2019-11-01 14:53:02.680946944,2019-11-01 14:53:02.680928286,4204471,T,IEX,343.380000,100
2019-11-01 14:55:02.718260992,2019-11-01 14:55:02.718242575,4264846,T,IEX,343.230000,100
2019-11-01 14:55:04.645692928,2019-11-01 14:55:04.645675215,4267177,T,IEX,343.290000,100
2019-11-01 14:55:05.596072960,2019-11-01 14:55:05.596053269,4268418,T,IEX,343.290000,100
2019-11-01 14:56:02.498756096,2019-11-01 14:56:02.498738265,4304599,T,IEX,343.170000,100
2019-11-01 14:58:19.113680896,2019-11-01 14:58:19.113661860,4381496,T,IEX,343.240000,100
2019-11-01 14:59:03.567034880,2019-11-01 14:59:03.567017659,4404721,T,IEX,343.130000,200
2019-11-01 14:59:30.116815104,2019-11-01 14:59:30.116795395,4418609,T,IEX,342.980000,100
2019-11-01 14:59:38.688907008,2019-11-01 14:59:38.688889075,4422783,T,IEX,342.975000,100
2019-11-01 14:59:40.542469888,2019-11-01 14:59:40.542449147,4423741,T,IEX,343.000000,4
2019-11-01 15:01:41.330629888,2019-11-01 15:01:41.330612502,4488615,T,IEX,343.070000,200
2019-11-01 15:01:41.807704064,2019-11-01 15:01:41.807685427,4488798,T,IEX,343.135000,100
2019-11-01 15:03:18.796391936,2019-11-01 15:03:18.796374748,4552387,T,IEX,343.170000,50
2019-11-01 15:03:18.796441088,2019-11-01 15:03:18.796423203,4552389,T,IEX,343.170000,50
2019-11-01 15:03:25.985259008,2019-11-01 15:03:25.985242482,4555707,T,IEX,343.090000,15
2019-11-01 15:04:08.466823936,2019-11-01 15:04:08.466804673,4577743,T,IEX,342.970000,10
2019-11-01 15:04:24.714244096,2019-11-01 15:04:24.714226522,4586922,T,IEX,342.905000,100
2019-11-01 15:04:25.214486016,2019-11-01 15:04:25.214466517,4587118,T,IEX,342.905000,100
2019-11-01 15:04:26.160320000,2019-11-01 15:04:26.160300707,4587601,T,IEX,342.940000,100
2019-11-01 15:04:29.130796032,2019-11-01 15:04:29.130777461,4589007,T,IEX,342.890000,100
2019-11-01 15:04:29.138076928,2019-11-01 15:04:29.138058572,4589008,T,IEX,342.890000,100
2019-11-01 15:04:29.140878080,2019-11-01 15:04:29.140858436,4589009,T,IEX,342.890000,100
2019-11-01 15:04:29.143835904,2019-11-01 15:04:29.143815863,4589011,T,IEX,342.890000,100
2019-11-01 15:04:29.147919104,2019-11-01 15:04:29.147897728,4589013,T,IEX,342.890000,100
2019-11-01 15:04:40.442734080,2019-11-01 15:04:40.442710637,4595442,T,IEX,342.855000,100
2019-11-01 15:05:03.337504000,2019-11-01 15:05:03.337486164,4605392,T,IEX,342.820000,100
2019-11-01 15:06:03.136513024,2019-11-01 15:06:03.136493650,4633655,T,IEX,343.075000,100
2019-11-01 15:06:27.540864000,2019-11-01 15:06:27.540844924,4646081,T,IEX,343.065000,10
2019-11-01 15:06:27.584946944,2019-11-01 15:06:27.584929627,4646092,T,IEX,343.030000,100
2019-11-01 15:07:21.289086976,2019-11-01 15:07:21.289069564,4676867,T,IEX,343.055000,100
2019-11-01 15:08:41.606627072,2019-11-01 15:08:41.606608222,4718047,T,IEX,343.155000,200
2019-11-01 15:09:38.890758912,2019-11-01 15:09:38.890739711,4744043,T,IEX,343.010000,200
2019-11-01 15:10:21.114029056,2019-11-01 15:10:21.114009066,4766978,T,IEX,342.940000,100
2019-11-01 15:10:22.125754880,2019-11-01 15:10:22.125732231,4767437,T,IEX,342.885000,100
2019-11-01 15:10:22.626427904,2019-11-01 15:10:22.626412239,4767720,T,IEX,342.890000,100
2019-11-01 15:10:24.78118912,2019-11-01 15:10:24.78100844,4768834,T,IEX,342.870000,100
2019-11-01 15:10:25.148628992,2019-11-01 15:10:25.148613058,4769464,T,IEX,342.880000,100
2019-11-01 15:10:25.673722880,2019-11-01 15:10:25.673703789,4769670,T,IEX,342.870000,100
2019-11-01 15:10:28.63233024,2019-11-01 15:10:28.63207126,4770885,T,IEX,342.870000,100
2019-11-01 15:10:28.723666944,2019-11-01 15:10:28.723649085,4771264,T,IEX,342.850000,100
2019-11-01 15:10:29.235396096,2019-11-01 15:10:29.235380081,4771537,T,IEX,342.850000,100
2019-11-01 15:11:14.154796032,2019-11-01 15:11:14.154776229,4790082,T,IEX,342.930000,10
2019-11-01 15:11:53.186792960,2019-11-01 15:11:53.186774895,4806267,T,IEX,342.980000,100
2019-11-01 15:11:53.188314112,2019-11-01 15:11:53.188296670,4806269,T,IEX,342.990000,33
2019-11-01 15:11:53.188747008,2019-11-01 15:11:53.188726452,4806271,T,IEX,342.990000,34
2019-11-01 15:11:53.190247936,2019-11-01 15:11:53.190227232,4806272,T,IEX,342.985000,200
2019-11-01 15:12:09.381652992,2019-11-01 15:12:09.381637299,4814040,T,IEX,342.870000,1
2019-11-01 15:12:21.940418048,2019-11-01 15:12:21.940398103,4818208,T,IEX,342.970000,200
2019-11-01 15:12:47.292577024,2019-11-01 15:12:47.292554397,4829553,T,IEX,343.020000,200
2019-11-01 15:12:50.557677056,2019-11-01 15:12:50.557658601,4830653,T,IEX,342.985000,100
2019-11-01 15:13:01.351289088,2019-11-01 15:13:01.351270031,4835555,T,IEX,342.985000,100
2019-11-01 15:14:00.879452928,2019-11-01 15:14:00.879433768,4861803,T,IEX,343.000000,100
2019-11-01 15:14:17.756125952,2019-11-01 15:14:17.756105249,4869368,T,IEX,342.980000,100
2019-11-01 15:14:58.290131968,2019-11-01 15:14:58.290110385,4886911,T,IEX,342.970000,91
2019-11-01 15:14:58.290500096,2019-11-01 15:14:58.290484282,4886913,T,IEX,342.970000,9
2019-11-01 15:14:58.290513920,2019-11-01 15:14:58.290498348,4886914,T,IEX,342.960000,10
2019-11-01 15:16:22.529152000,2019-11-01 15:16:22.529135040,4927578,T,IEX,342.965000,100
2019-11-01 15:17:08.164209920,2019-11-01 15:17:08.164190244,4950044,T,IEX,342.995000,100
2019-11-01 15:17:53.664709888,2019-11-01 15:17:53.664687424,4967824,T,IEX,343.005000,100
2019-11-01 15:18:21.570684928,2019-11-01 15:18:21.570662162,4983087,T,IEX,343.000000,100
2019-11-01 15:19:44.559421952,2019-11-01 15:19:44.559402808,5018365,T,IEX,342.900000,200
2019-11-01 15:20:24.742940928,2019-11-01 15:20:24.742923988,5033632,T,IEX,342.900000,100
2019-11-01 15:22:32.611118080,2019-11-01 15:22:32.611100865,5089982,T,IEX,342.920000,100
2019-11-01 15:23:05.785787904,2019-11-01 15:23:05.785769113,5104037,T,IEX,342.955000,18
2019-11-01 15:23:57.650021888,2019-11-01 15:23:57.649999335,5130760,T,IEX,343.150000,200
2019-11-01 15:23:57.650034944,2019-11-01 15:23:57.650017247,5130762,T,IEX,343.200000,497
2019-11-01 15:23:57.982816000,2019-11-01 15:23:57.982799192,5130931,T,IEX,343.205000,100
2019-11-01 15:24:08.665284096,2019-11-01 15:24:08.665265610,5136113,T,IEX,343.160000,100
2019-11-01 15:24:09.671973888,2019-11-01 15:24:09.671954500,5136540,T,IEX,343.165000,100
2019-11-01 15:24:09.673839104,2019-11-01 15:24:09.673820976,5136541,T,IEX,343.165000,100
2019-11-01 15:24:36.111917056,2019-11-01 15:24:36.111896433,5147067,T,IEX,343.175000,100
2019-11-01 15:24:36.125804032,2019-11-01 15:24:36.125786492,5147073,T,IEX,343.175000,100
2019-11-01 15:26:10.167651072,2019-11-01 15:26:10.167633090,5186743,T,IEX,343.340000,100
2019-11-01 15:26:39.456605952,2019-11-01 15:26:39.456589970,5199195,T,IEX,343.350000,100
2019-11-01 15:29:33.785142016,2019-11-01 15:29:33.785122253,5293744,T,IEX,343.230000,100
2019-11-01 15:29:49.696556032,2019-11-01 15:29:49.696537624,5300242,T,IEX,343.180000,100
2019-11-01 15:30:02.404047872,2019-11-01 15:30:02.404029493,5306092,T,IEX,343.260000,100
2019-11-01 15:31:37.419272960,2019-11-01 15:31:37.419252641,5351749,T,IEX,343.285000,8
2019-11-01 15:32:58.253789952,2019-11-01 15:32:58.253770561,5386802,T,IEX,343.270000,92
2019-11-01 15:36:48.423426048,2019-11-01 15:36:48.423407118,5488913,T,IEX,343.590000,10
2019-11-01 15:37:27.730104064,2019-11-01 15:37:27.730085695,5506785,T,IEX,343.460000,1
2019-11-01 15:38:49.44133888,2019-11-01 15:38:49.44112487,5543218,T,IEX,343.490000,100
2019-11-01 15:39:16.356166912,2019-11-01 15:39:16.356148505,5555220,T,IEX,343.510000,9
2019-11-01 15:39:30.207589888,2019-11-01 15:39:30.207571503,5560619,T,IEX,343.550000,100
2019-11-01 15:42:06.481661952,2019-11-01 15:42:06.481643605,5622524,T,IEX,343.710000,100
2019-11-01 15:42:13.665437952,2019-11-01 15:42:13.665419344,5626199,T,IEX,343.740000,700
2019-11-01 15:42:19.142669056,2019-11-01 15:42:19.142650056,5628348,T,IEX,343.715000,300
2019-11-01 15:42:39.293276928,2019-11-01 15:42:39.293260579,5636479,T,IEX,343.825000,100
2019-11-01 15:42:39.294503936,2019-11-01 15:42:39.294484591,5636481,T,IEX,343.825000,100
2019-11-01 15:42:51.548476928,2019-11-01 15:42:51.548458968,5641659,T,IEX,343.860000,9
2019-11-01 15:43:56.129886976,2019-11-01 15:43:56.129866733,5667787,T,IEX,343.790000,100
2019-11-01 15:45:27.666020096,2019-11-01 15:45:27.666002228,5707371,T,IEX,344.155000,61
2019-11-01 15:47:40.660696064,2019-11-01 15:47:40.660677539,5770696,T,IEX,344.040000,50
2019-11-01 15:47:47.687126016,2019-11-01 15:47:47.687108925,5773189,T,IEX,344.070000,200
2019-11-01 15:48:39.303518976,2019-11-01 15:48:39.303499703,5794359,T,IEX,344.175000,100
2019-11-01 15:49:17.215392000,2019-11-01 15:49:17.215375845,5809712,T,IEX,344.310000,21
2019-11-01 15:49:44.975698944,2019-11-01 15:49:44.975680718,5821664,T,IEX,344.300000,8
2019-11-01 15:49:44.975768064,2019-11-01 15:49:44.975749944,5821666,T,IEX,344.300000,92
2019-11-01 15:52:11.504517888,2019-11-01 15:52:11.504502230,5889142,T,IEX,344.445000,10
2019-11-01 15:52:50.262800896,2019-11-01 15:52:50.262783060,5906238,T,IEX,344.525000,100
2019-11-01 15:52:54.348029952,2019-11-01 15:52:54.348008471,5907543,T,IEX,344.530000,100
2019-11-01 15:57:49.422909952,2019-11-01 15:57:49.422890646,6033951,T,IEX,344.220000,1
2019-11-01 15:59:37.927168000,2019-11-01 15:59:37.927148775,6083028,T,IEX,344.480000,1
2019-11-01 16:00:38.477199104,2019-11-01 16:00:38.477179474,6115055,T,IEX,344.620000,100
2019-11-01 16:02:53.526010112,2019-11-01 16:02:53.525990236,6182780,T,IEX,344.450000,49
2019-11-01 16:02:56.868281088,2019-11-01 16:02:56.868262328,6185273,T,IEX,344.405000,50
2019-11-01 16:02:56.874836992,2019-11-01 16:02:56.874818640,6185280,T,IEX,344.405000,1
2019-11-01 16:04:03.559084032,2019-11-01 16:04:03.559064917,6215758,T,IEX,344.600000,4
2019-11-01 16:04:24.437528064,2019-11-01 16:04:24.437512797,6224249,T,IEX,344.580000,10
2019-11-01 16:04:32.222780928,2019-11-01 16:04:32.222761029,6227274,T,IEX,344.570000,89
2019-11-01 16:04:32.224034048,2019-11-01 16:04:32.224015564,6227275,T,IEX,344.570000,1
2019-11-01 16:05:55.907387904,2019-11-01 16:05:55.907369917,6261712,T,IEX,344.190000,100
2019-11-01 16:07:16.204488960,2019-11-01 16:07:16.204472018,6301327,T,IEX,344.040000,15
2019-11-01 16:07:41.585539072,2019-11-01 16:07:41.585522008,6312409,T,IEX,344.040000,5
2019-11-01 16:07:44.26979072,2019-11-01 16:07:44.26959283,6313589,T,IEX,344.040000,80
2019-11-01 16:09:02.384496128,2019-11-01 16:09:02.384477854,6351727,T,IEX,344.080000,100
2019-11-01 16:09:41.228728064,2019-11-01 16:09:41.228709657,6373002,T,IEX,344.105000,100
2019-11-01 16:10:00.713712896,2019-11-01 16:10:00.713692919,6381274,T,IEX,344.170000,100
2019-11-01 16:11:17.925928960,2019-11-01 16:11:17.925910212,6418684,T,IEX,344.115000,100
2019-11-01 16:11:31.314138880,2019-11-01 16:11:31.314116785,6426215,T,IEX,344.160000,10
2019-11-01 16:11:31.315891968,2019-11-01 16:11:31.315871599,6426216,T,IEX,344.130000,38
2019-11-01 16:11:31.315904000,2019-11-01 16:11:31.315887583,6426217,T,IEX,344.110000,10
2019-11-01 16:11:45.49466880,2019-11-01 16:11:45.49448023,6435312,T,IEX,343.910000,1
2019-11-01 16:12:04.434277120,2019-11-01 16:12:04.434258286,6456408,T,IEX,343.830000,4
2019-11-01 16:12:04.486448896,2019-11-01 16:12:04.486428097,6456438,T,IEX,343.710000,100
2019-11-01 16:12:24.637835008,2019-11-01 16:12:24.637818560,6470216,T,IEX,343.780000,100
2019-11-01 16:13:01.514665984,2019-11-01 16:13:01.514643518,6490063,T,IEX,343.810000,100
2019-11-01 16:13:08.34806016,2019-11-01 16:13:08.34786569,6493825,T,IEX,343.710000,20
2019-11-01 16:13:20.950758912,2019-11-01 16:13:20.950736915,6500869,T,IEX,343.740000,15
2019-11-01 16:13:29.338949888,2019-11-01 16:13:29.338930113,6504964,T,IEX,343.770000,10
2019-11-01 16:13:37.743771904,2019-11-01 16:13:37.743751930,6508491,T,IEX,343.750000,100
2019-11-01 16:14:05.318219008,2019-11-01 16:14:05.318200593,6521274,T,IEX,343.755000,100
2019-11-01 16:17:22.377327104,2019-11-01 16:17:22.377310928,6630906,T,IEX,343.820000,100
2019-11-01 16:18:53.529861120,2019-11-01 16:18:53.529842214,6671722,T,IEX,343.880000,100
2019-11-01 16:19:07.921883904,2019-11-01 16:19:07.921865240,6679399,T,IEX,343.800000,100
2019-11-01 16:19:39.862021888,2019-11-01 16:19:39.862002796,6692019,T,IEX,343.700000,61
2019-11-01 16:20:03.273364992,2019-11-01 16:20:03.273344396,6703181,T,IEX,343.840000,3
2019-11-01 16:20:10.307732992,2019-11-01 16:20:10.307714779,6707857,T,IEX,343.825000,100
2019-11-01 16:21:01.952062976,2019-11-01 16:21:01.952044078,6733162,T,IEX,343.920000,100
2019-11-01 16:23:11.914661888,2019-11-01 16:23:11.914642797,6790599,T,IEX,343.970000,38
2019-11-01 16:23:39.899277056,2019-11-01 16:23:39.899257152,6804490,T,IEX,344.000000,5
2019-11-01 16:23:40.479538944,2019-11-01 16:23:40.479521445,6804692,T,IEX,344.000000,57
2019-11-01 16:23:50.359843072,2019-11-01 16:23:50.359825438,6808586,T,IEX,344.095000,100
2019-11-01 16:24:57.715097088,2019-11-01 16:24:57.715077194,6843150,T,IEX,344.190000,100
2019-11-01 16:25:44.113168896,2019-11-01 16:25:44.113147750,6866288,T,IEX,344.200000,1
2019-11-01 16:25:54.576092928,2019-11-01 16:25:54.576074246,6871025,T,IEX,344.120000,26
2019-11-01 16:27:32.983901952,2019-11-01 16:27:32.983880135,6918159,T,IEX,344.220000,10
2019-11-01 16:27:32.998512128,2019-11-01 16:27:32.998493740,6918172,T,IEX,344.180000,100
2019-11-01 16:27:57.569612032,2019-11-01 16:27:57.569589470,6928544,T,IEX,344.200000,100
2019-11-01 16:30:46.519856128,2019-11-01 16:30:46.519838499,7004931,T,IEX,344.250000,10
2019-11-01 16:30:46.555095040,2019-11-01 16:30:46.555073060,7004983,T,IEX,344.270000,100
2019-11-01 16:30:54.622240000,2019-11-01 16:30:54.622223166,7009326,T,IEX,344.180000,1
2019-11-01 16:31:04.917942016,2019-11-01 16:31:04.917921107,7013442,T,IEX,344.140000,100
2019-11-01 16:31:11.592796928,2019-11-01 16:31:11.592779475,7016704,T,IEX,344.130000,10
2019-11-01 16:32:53.552297984,2019-11-01 16:32:53.552282919,7058562,T,IEX,344.035000,100
2019-11-01 16:33:41.59888896,2019-11-01 16:33:41.59868916,7078226,T,IEX,343.970000,200
2019-11-01 16:33:41.69236992,2019-11-01 16:33:41.69216549,7078229,T,IEX,343.995000,500
2019-11-01 16:33:41.134877952,2019-11-01 16:33:41.134861398,7078279,T,IEX,344.020000,300
2019-11-01 16:33:41.401559040,2019-11-01 16:33:41.401540117,7078446,T,IEX,344.250000,100
2019-11-01 16:33:41.401571072,2019-11-01 16:33:41.401555770,7078447,T,IEX,344.250000,100
2019-11-01 16:33:41.407385088,2019-11-01 16:33:41.407366679,7078449,T,IEX,344.250000,100
2019-11-01 16:33:41.418456064,2019-11-01 16:33:41.418435365,7078456,T,IEX,344.250000,100
2019-11-01 16:33:41.585326080,2019-11-01 16:33:41.585305484,7078495,T,IEX,344.255000,100
2019-11-01 16:36:11.637107968,2019-11-01 16:36:11.637089081,7140637,T,IEX,344.170000,1
2019-11-01 16:37:03.366627072,2019-11-01 16:37:03.366610460,7161478,T,IEX,344.140000,70
2019-11-01 16:37:06.926117888,2019-11-01 16:37:06.926098935,7163633,T,IEX,344.205000,1
2019-11-01 16:38:39.391674880,2019-11-01 16:38:39.391659221,7199324,T,IEX,343.985000,1
2019-11-01 16:39:02.918942976,2019-11-01 16:39:02.918926927,7208899,T,IEX,343.980000,2
2019-11-01 16:39:06.289852928,2019-11-01 16:39:06.289835289,7211693,T,IEX,343.900000,1
2019-11-01 16:39:55.207027968,2019-11-01 16:39:55.207009680,7228297,T,IEX,343.870000,2
2019-11-01 16:40:13.822232064,2019-11-01 16:40:13.822214231,7234711,T,IEX,343.775000,1
2019-11-01 16:40:22.605241088,2019-11-01 16:40:22.605221547,7238145,T,IEX,343.800000,1
2019-11-01 16:40:31.807421952,2019-11-01 16:40:31.807399726,7240926,T,IEX,343.860000,2
2019-11-01 16:41:18.850127872,2019-11-01 16:41:18.850110216,7256134,T,IEX,343.760000,1
2019-11-01 16:41:49.609244928,2019-11-01 16:41:49.609227429,7266821,T,IEX,343.620000,100
2019-11-01 16:41:59.163739904,2019-11-01 16:41:59.163718221,7270197,T,IEX,343.685000,1
2019-11-01 16:43:00.220349952,2019-11-01 16:43:00.220328544,7289638,T,IEX,343.435000,100
2019-11-01 16:43:13.648606976,2019-11-01 16:43:13.648589392,7294659,T,IEX,343.170000,3
2019-11-01 16:43:25.74416896,2019-11-01 16:43:25.74398568,7299491,T,IEX,343.220000,5
2019-11-01 16:43:27.16808960,2019-11-01 16:43:27.16790459,7300260,T,IEX,343.390000,2
2019-11-01 16:44:10.637786112,2019-11-01 16:44:10.637767770,7316556,T,IEX,343.270000,50
2019-11-01 16:44:54.82380032,2019-11-01 16:44:54.82363853,7329472,T,IEX,343.300000,1
2019-11-01 16:45:01.915892992,2019-11-01 16:45:01.915874246,7332076,T,IEX,343.300000,3
2019-11-01 16:45:40.454640128,2019-11-01 16:45:40.454623656,7344496,T,IEX,343.365000,1
2019-11-01 16:46:07.49178880,2019-11-01 16:46:07.49160035,7354397,T,IEX,343.410000,1
2019-11-01 16:46:07.59735040,2019-11-01 16:46:07.59714439,7354399,T,IEX,343.420000,1
2019-11-01 16:46:30.703000064,2019-11-01 16:46:30.702981694,7361340,T,IEX,343.465000,10
2019-11-01 16:46:32.190729984,2019-11-01 16:46:32.190707014,7361941,T,IEX,343.435000,1
2019-11-01 16:48:25.271547904,2019-11-01 16:48:25.271530388,7401153,T,IEX,343.490000,2
2019-11-01 16:48:42.248942080,2019-11-01 16:48:42.248924000,7405748,T,IEX,343.495000,1
2019-11-01 16:48:57.509164032,2019-11-01 16:48:57.509144446,7409607,T,IEX,343.500000,45
2019-11-01 16:50:25.313264128,2019-11-01 16:50:25.313147315,7438597,T,IEX,343.525000,1
2019-11-01 16:52:11.824620032,2019-11-01 16:52:11.824602023,7475621,T,IEX,343.425000,2
2019-11-01 16:52:18.911835904,2019-11-01 16:52:18.911817363,7478593,T,IEX,343.360000,3
2019-11-01 16:52:18.920297984,2019-11-01 16:52:18.920282118,7478597,T,IEX,343.360000,1
2019-11-01 16:52:19.27868928,2019-11-01 16:52:19.27847435,7478638,T,IEX,343.360000,6
2019-11-01 16:52:25.413193984,2019-11-01 16:52:25.413174258,7481166,T,IEX,343.315000,1
2019-11-01 16:52:51.258785024,2019-11-01 16:52:51.258764785,7489475,T,IEX,343.355000,1
2019-11-01 16:53:00.298824960,2019-11-01 16:53:00.298805143,7493579,T,IEX,343.365000,1
2019-11-01 16:54:08.445899008,2019-11-01 16:54:08.445879062,7519190,T,IEX,343.500000,1
2019-11-01 16:54:25.450402048,2019-11-01 16:54:25.450381128,7524141,T,IEX,343.615000,1
2019-11-01 16:54:36.916724992,2019-11-01 16:54:36.916706155,7528010,T,IEX,343.625000,1
2019-11-01 16:56:00.31251968,2019-11-01 16:56:00.31232452,7556391,T,IEX,343.550000,1
2019-11-01 16:56:04.921400064,2019-11-01 16:56:04.921380775,7558191,T,IEX,343.540000,2
2019-11-01 16:56:31.89701888,2019-11-01 16:56:31.89680362,7568928,T,IEX,343.535000,1
2019-11-01 16:56:49.653455104,2019-11-01 16:56:49.653435730,7575739,T,IEX,343.510000,1
2019-11-01 16:57:29.193767936,2019-11-01 16:57:29.193748402,7592482,T,IEX,343.550000,2
2019-11-01 16:57:41.682969088,2019-11-01 16:57:41.682951538,7597139,T,IEX,343.555000,1
2019-11-01 16:58:25.532171008,2019-11-01 16:58:25.532155151,7616876,T,IEX,343.715000,1
2019-11-01 16:58:41.25135104,2019-11-01 16:58:41.25115943,7621747,T,IEX,343.720000,1
2019-11-01 16:58:41.25154048,2019-11-01 16:58:41.25135822,7621748,T,IEX,343.720000,100
2019-11-01 16:58:57.859821056,2019-11-01 16:58:57.859798383,7627167,T,IEX,343.680000,1
2019-11-01 17:00:17.39864064,2019-11-01 17:00:17.39844935,7659772,T,IEX,343.480000,1
2019-11-01 17:02:11.224153088,2019-11-01 17:02:11.224134965,7701297,T,IEX,343.600000,10
2019-11-01 17:06:31.211279104,2019-11-01 17:06:31.211262325,7788604,T,IEX,343.580000,22
2019-11-01 17:06:31.214121984,2019-11-01 17:06:31.214101999,7788605,T,IEX,343.580000,22
2019-11-01 17:06:47.744634880,2019-11-01 17:06:47.744615217,7794184,T,IEX,343.520000,40
2019-11-01 17:08:12.169816064,2019-11-01 17:08:12.169797306,7821546,T,IEX,343.400000,60
2019-11-01 17:08:32.827282944,2019-11-01 17:08:32.827266922,7828808,T,IEX,343.410000,71
2019-11-01 17:08:32.856165888,2019-11-01 17:08:32.856148947,7828857,T,IEX,343.450000,100
2019-11-01 17:11:21.318465024,2019-11-01 17:11:21.318441405,7892929,T,IEX,343.600000,2
2019-11-01 17:13:12.294420992,2019-11-01 17:13:12.294403304,7946179,T,IEX,343.550000,6
2019-11-01 17:13:40.303595008,2019-11-01 17:13:40.303579457,7958815,T,IEX,343.765000,10
2019-11-01 17:13:41.172124928,2019-11-01 17:13:41.172106833,7959187,T,IEX,343.765000,8
2019-11-01 17:17:42.114216960,2019-11-01 17:17:42.114195936,8069601,T,IEX,344.075000,100
2019-11-01 17:18:03.428624896,2019-11-01 17:18:03.428605257,8078134,T,IEX,344.120000,1
2019-11-01 17:18:04.117726976,2019-11-01 17:18:04.117707952,8078561,T,IEX,344.100000,100
2019-11-01 17:19:21.121625088,2019-11-01 17:19:21.121608050,8110116,T,IEX,343.960000,100
2019-11-01 17:20:02.343429120,2019-11-01 17:20:02.343410975,8128197,T,IEX,343.900000,100
2019-11-01 17:20:03.439770880,2019-11-01 17:20:03.439752275,8128692,T,IEX,343.850000,900
2019-11-01 17:20:54.106707968,2019-11-01 17:20:54.106686843,8157536,T,IEX,343.980000,1
2019-11-01 17:21:30.466319872,2019-11-01 17:21:30.466301623,8174085,T,IEX,343.940000,8
2019-11-01 17:22:23.530281984,2019-11-01 17:22:23.530262732,8193268,T,IEX,343.780000,100
2019-11-01 17:23:04.671266048,2019-11-01 17:23:04.671250930,8208147,T,IEX,343.785000,100
2019-11-01 17:24:17.839973120,2019-11-01 17:24:17.839954813,8232717,T,IEX,343.790000,10
2019-11-01 17:24:28.536619008,2019-11-01 17:24:28.536602889,8237120,T,IEX,343.690000,1
2019-11-01 17:28:00.144849920,2019-11-01 17:28:00.144832186,8308691,T,IEX,343.740000,100
2019-11-01 17:28:26.946140928,2019-11-01 17:28:26.946122483,8319995,T,IEX,343.845000,100
2019-11-01 17:28:36.148761088,2019-11-01 17:28:36.148741004,8324316,T,IEX,343.880000,100
2019-11-01 17:28:42.352845056,2019-11-01 17:28:42.352825830,8326740,T,IEX,343.860000,100
2019-11-01 17:28:42.354487040,2019-11-01 17:28:42.354466462,8326741,T,IEX,343.860000,100
2019-11-01 17:29:41.72534016,2019-11-01 17:29:41.72516210,8353258,T,IEX,343.820000,100
2019-11-01 17:29:41.395162112,2019-11-01 17:29:41.395143536,8353387,T,IEX,343.835000,100
2019-11-01 17:29:41.396476928,2019-11-01 17:29:41.396458441,8353389,T,IEX,343.835000,100
2019-11-01 17:29:41.397586944,2019-11-01 17:29:41.397566439,8353390,T,IEX,343.870000,100
2019-11-01 17:30:22.153761024,2019-11-01 17:30:22.153739229,8370577,T,IEX,343.830000,100
2019-11-01 17:32:41.528637952,2019-11-01 17:32:41.528620328,8419423,T,IEX,343.695000,100
2019-11-01 17:33:23.970044928,2019-11-01 17:33:23.970027199,8434971,T,IEX,343.700000,100
2019-11-01 17:33:41.576025088,2019-11-01 17:33:41.576005491,8443445,T,IEX,343.705000,100
2019-11-01 17:34:02.282053120,2019-11-01 17:34:02.282029057,8451262,T,IEX,343.710000,100
2019-11-01 17:34:03.141660928,2019-11-01 17:34:03.141644346,8452006,T,IEX,343.720000,1
2019-11-01 17:34:16.961687040,2019-11-01 17:34:16.961668389,8456352,T,IEX,343.710000,100
2019-11-01 17:34:41.630576128,2019-11-01 17:34:41.630560425,8465220,T,IEX,343.750000,100
2019-11-01 17:35:19.965498880,2019-11-01 17:35:19.965479013,8479325,T,IEX,343.775000,100
2019-11-01 17:35:41.666816000,2019-11-01 17:35:41.666798636,8492575,T,IEX,343.785000,100
2019-11-01 17:35:53.966230016,2019-11-01 17:35:53.966212968,8497997,T,IEX,343.845000,100
2019-11-01 17:36:41.726123008,2019-11-01 17:36:41.726103215,8514759,T,IEX,343.850000,100
2019-11-01 17:36:41.727278080,2019-11-01 17:36:41.727257787,8514761,T,IEX,343.850000,100
2019-11-01 17:36:52.171889920,2019-11-01 17:36:52.171870214,8517906,T,IEX,343.850000,100
2019-11-01 17:37:37.861463040,2019-11-01 17:37:37.861445026,8534005,T,IEX,343.955000,200
2019-11-01 17:38:41.787115008,2019-11-01 17:38:41.787097571,8560589,T,IEX,344.030000,101
2019-11-01 17:38:46.902611968,2019-11-01 17:38:46.902595944,8562218,T,IEX,344.020000,5
2019-11-01 17:40:11.467600896,2019-11-01 17:40:11.467580972,8589536,T,IEX,343.950000,1
2019-11-01 17:40:59.611283968,2019-11-01 17:40:59.611264831,8605189,T,IEX,343.920000,200
2019-11-01 17:41:29.185613056,2019-11-01 17:41:29.185593448,8616252,T,IEX,343.930000,100
2019-11-01 17:41:41.898520064,2019-11-01 17:41:41.898504012,8620225,T,IEX,343.945000,100
2019-11-01 17:41:41.899842048,2019-11-01 17:41:41.899820334,8620226,T,IEX,343.945000,100
2019-11-01 17:42:41.972637952,2019-11-01 17:42:41.972615901,8640766,T,IEX,343.885000,100
2019-11-01 17:42:41.973786112,2019-11-01 17:42:41.973766591,8640767,T,IEX,343.885000,100
2019-11-01 17:43:06.774063104,2019-11-01 17:43:06.774042461,8649156,T,IEX,343.895000,100
2019-11-01 17:43:25.188032000,2019-11-01 17:43:25.188016511,8654816,T,IEX,343.840000,100
2019-11-01 17:43:42.109969920,2019-11-01 17:43:42.109951085,8659665,T,IEX,343.855000,100
2019-11-01 17:44:42.162008064,2019-11-01 17:44:42.161991766,8677659,T,IEX,343.895000,100
2019-11-01 17:45:25.422697984,2019-11-01 17:45:25.422675800,8691709,T,IEX,343.870000,100
2019-11-01 17:45:30.22242048,2019-11-01 17:45:30.22220429,8693425,T,IEX,343.890000,100
2019-11-01 17:45:31.199020032,2019-11-01 17:45:31.198996472,8693804,T,IEX,343.920000,10
2019-11-01 17:47:23.965641984,2019-11-01 17:47:23.965622804,8739662,T,IEX,344.050000,100
2019-11-01 17:48:07.206362880,2019-11-01 17:48:07.206344964,8757483,T,IEX,344.030000,100
2019-11-01 17:48:39.638117888,2019-11-01 17:48:39.638096590,8769802,T,IEX,344.020000,10
2019-11-01 17:48:42.381392896,2019-11-01 17:48:42.381377153,8771477,T,IEX,344.020000,100
2019-11-01 17:48:42.384620032,2019-11-01 17:48:42.384601284,8771481,T,IEX,344.020000,200
2019-11-01 17:48:42.419724032,2019-11-01 17:48:42.419702381,8771489,T,IEX,344.020000,100
2019-11-01 17:48:54.692336896,2019-11-01 17:48:54.692318195,8777114,T,IEX,344.010000,3
2019-11-01 17:49:02.207827968,2019-11-01 17:49:02.207809936,8779465,T,IEX,344.000000,100
2019-11-01 17:50:40.315056896,2019-11-01 17:50:40.315037273,8812807,T,IEX,343.910000,8
2019-11-01 17:50:42.453757952,2019-11-01 17:50:42.453738308,8813613,T,IEX,343.910000,101
2019-11-01 17:50:42.455217920,2019-11-01 17:50:42.455202262,8813615,T,IEX,343.910000,101
2019-11-01 17:51:10.414316032,2019-11-01 17:51:10.414296044,8824040,T,IEX,343.940000,100
2019-11-01 17:52:30.418402048,2019-11-01 17:52:30.418383926,8853478,T,IEX,343.940000,100
2019-11-01 17:52:42.541858048,2019-11-01 17:52:42.541837665,8858137,T,IEX,343.910000,105
2019-11-01 17:52:42.543260928,2019-11-01 17:52:42.543238728,8858140,T,IEX,343.910000,105
2019-11-01 17:52:43.893298944,2019-11-01 17:52:43.893281928,8858642,T,IEX,343.910000,200
2019-11-01 17:53:38.506160896,2019-11-01 17:53:38.506145131,8876395,T,IEX,343.855000,900
2019-11-01 17:53:38.512913920,2019-11-01 17:53:38.512897336,8876581,T,IEX,343.850000,100
2019-11-01 17:53:42.623958016,2019-11-01 17:53:42.623939800,8879431,T,IEX,343.845000,102
2019-11-01 17:53:42.784806912,2019-11-01 17:53:42.784789796,8879512,T,IEX,343.850000,100
2019-11-01 17:54:29.452633088,2019-11-01 17:54:29.452617337,8902047,T,IEX,343.780000,7
2019-11-01 17:54:29.821434880,2019-11-01 17:54:29.821416692,8902196,T,IEX,343.675000,100
2019-11-01 17:54:40.709818112,2019-11-01 17:54:40.709799668,8906353,T,IEX,343.660000,100
2019-11-01 17:54:40.709830912,2019-11-01 17:54:40.709812810,8906354,T,IEX,343.660000,100
2019-11-01 17:54:40.709844992,2019-11-01 17:54:40.709826090,8906355,T,IEX,343.660000,100
2019-11-01 17:55:02.222971904,2019-11-01 17:55:02.222953321,8913929,T,IEX,343.625000,100
2019-11-01 17:58:17.647378944,2019-11-01 17:58:17.647360797,8984923,T,IEX,343.560000,100
2019-11-01 17:59:33.42170880,2019-11-01 17:59:33.42152774,9009578,T,IEX,343.720000,100
2019-11-01 17:59:42.930632960,2019-11-01 17:59:42.930614210,9013270,T,IEX,343.685000,1
2019-11-01 18:00:12.441359872,2019-11-01 18:00:12.441343271,9026231,T,IEX,343.700000,1
2019-11-01 18:00:35.499355904,2019-11-01 18:00:35.499337275,9038636,T,IEX,343.560000,1
2019-11-01 18:00:35.501478912,2019-11-01 18:00:35.501453964,9038638,T,IEX,343.500000,10
2019-11-01 18:00:35.845285888,2019-11-01 18:00:35.845268144,9038768,T,IEX,343.560000,4
2019-11-01 18:00:38.900848128,2019-11-01 18:00:38.900827617,9040460,T,IEX,343.615000,3
2019-11-01 18:00:42.845669120,2019-11-01 18:00:42.845650671,9042670,T,IEX,343.690000,2
2019-11-01 18:00:46.443031040,2019-11-01 18:00:46.443010978,9044248,T,IEX,343.670000,1
2019-11-01 18:00:55.443017984,2019-11-01 18:00:55.442999975,9047192,T,IEX,343.600000,1
2019-11-01 18:02:31.61059072,2019-11-01 18:02:31.61039315,9086469,T,IEX,343.590000,1
2019-11-01 18:02:33.447982080,2019-11-01 18:02:33.447964511,9087209,T,IEX,343.610000,5
2019-11-01 18:03:27.165648896,2019-11-01 18:03:27.165633445,9116200,T,IEX,343.550000,1
2019-11-01 18:04:42.238522880,2019-11-01 18:04:42.238501235,9146805,T,IEX,343.555000,3
2019-11-01 18:05:24.328143104,2019-11-01 18:05:24.328124635,9165869,T,IEX,343.570000,2
2019-11-01 18:05:24.944957952,2019-11-01 18:05:24.944939434,9166113,T,IEX,343.570000,1
2019-11-01 18:06:05.491877888,2019-11-01 18:06:05.491835384,9184345,T,IEX,343.540000,1
2019-11-01 18:06:11.297921024,2019-11-01 18:06:11.297902912,9188056,T,IEX,343.545000,2
2019-11-01 18:06:11.305677056,2019-11-01 18:06:11.305660678,9188062,T,IEX,343.545000,2
2019-11-01 18:06:42.296453120,2019-11-01 18:06:42.296433419,9199590,T,IEX,343.580000,1
2019-11-01 18:07:55.592929024,2019-11-01 18:07:55.592908795,9226885,T,IEX,343.650000,1
2019-11-01 18:08:09.81124096,2019-11-01 18:08:09.81103935,9232074,T,IEX,343.560000,1
2019-11-01 18:08:37.140563968,2019-11-01 18:08:37.140543884,9244000,T,IEX,343.610000,100
2019-11-01 18:08:42.370224128,2019-11-01 18:08:42.370203812,9246202,T,IEX,343.610000,3
2019-11-01 18:09:09.136337920,2019-11-01 18:09:09.136319186,9255518,T,IEX,343.555000,100
2019-11-01 18:09:26.278184960,2019-11-01 18:09:26.278165028,9260674,T,IEX,343.560000,1
2019-11-01 18:09:27.722787072,2019-11-01 18:09:27.722768996,9260982,T,IEX,343.560000,1
2019-11-01 18:10:10.450544896,2019-11-01 18:10:10.450529276,9277393,T,IEX,343.460000,64
2019-11-01 18:10:10.450598912,2019-11-01 18:10:10.450581404,9277395,T,IEX,343.460000,36
2019-11-01 18:10:53.79982080,2019-11-01 18:10:53.79962199,9292545,T,IEX,343.480000,100
2019-11-01 18:11:01.188495104,2019-11-01 18:11:01.188475888,9296690,T,IEX,343.540000,3
2019-11-01 18:11:02.140008960,2019-11-01 18:11:02.139990416,9297277,T,IEX,343.545000,2
2019-11-01 18:11:39.204186880,2019-11-01 18:11:39.204170478,9315557,T,IEX,343.530000,1
2019-11-01 18:12:02.968432896,2019-11-01 18:12:02.968415622,9324012,T,IEX,343.520000,300
2019-11-01 18:12:05.692933120,2019-11-01 18:12:05.692912588,9324733,T,IEX,343.525000,100
2019-11-01 18:12:25.515547904,2019-11-01 18:12:25.515528245,9332978,T,IEX,343.525000,100
2019-11-01 18:12:31.874153984,2019-11-01 18:12:31.874133251,9335421,T,IEX,343.525000,1
2019-11-01 18:13:14.892009984,2019-11-01 18:13:14.891989400,9349940,T,IEX,343.490000,100
2019-11-01 18:13:14.920784896,2019-11-01 18:13:14.920766414,9349956,T,IEX,343.480000,100
2019-11-01 18:13:21.282522880,2019-11-01 18:13:21.282505115,9351959,T,IEX,343.470000,1
2019-11-01 18:13:23.101847040,2019-11-01 18:13:23.101827282,9352614,T,IEX,343.470000,100
2019-11-01 18:13:23.726846976,2019-11-01 18:13:23.726827485,9352771,T,IEX,343.465000,100
2019-11-01 18:13:30.929201920,2019-11-01 18:13:30.929182813,9355699,T,IEX,343.425000,3
2019-11-01 18:13:30.936944128,2019-11-01 18:13:30.936923147,9355703,T,IEX,343.425000,2
2019-11-01 18:13:43.12075008,2019-11-01 18:13:43.12057176,9360006,T,IEX,343.385000,100
2019-11-01 18:14:03.487284992,2019-11-01 18:14:03.487267220,9369276,T,IEX,343.490000,1
2019-11-01 18:14:17.660676096,2019-11-01 18:14:17.660656565,9374478,T,IEX,343.485000,200
2019-11-01 18:14:17.676392960,2019-11-01 18:14:17.676371126,9374480,T,IEX,343.485000,100
2019-11-01 18:14:17.926604032,2019-11-01 18:14:17.926588639,9374589,T,IEX,343.485000,100
2019-11-01 18:15:07.356244992,2019-11-01 18:15:07.356226407,9397788,T,IEX,343.230000,2
2019-11-01 18:15:07.853651968,2019-11-01 18:15:07.853634143,9397918,T,IEX,343.225000,2
2019-11-01 18:15:13.458950912,2019-11-01 18:15:13.458933586,9399986,T,IEX,343.060000,100
2019-11-01 18:16:01.170565888,2019-11-01 18:16:01.170546559,9417313,T,IEX,343.000000,2
2019-11-01 18:16:01.173670912,2019-11-01 18:16:01.173654349,9417339,T,IEX,342.980000,100
2019-11-01 18:16:01.206387968,2019-11-01 18:16:01.206371746,9417428,T,IEX,342.975000,400
2019-11-01 18:16:03.16663040,2019-11-01 18:16:03.16644647,9417926,T,IEX,343.000000,1
2019-11-01 18:16:03.61519872,2019-11-01 18:16:03.61502873,9417943,T,IEX,342.990000,100
2019-11-01 18:16:03.63913984,2019-11-01 18:16:03.63892828,9417944,T,IEX,342.990000,100
2019-11-01 18:16:10.324072960,2019-11-01 18:16:10.324050421,9420561,T,IEX,342.810000,100
2019-11-01 18:16:10.421292032,2019-11-01 18:16:10.421272394,9420620,T,IEX,342.820000,100
2019-11-01 18:17:10.608366080,2019-11-01 18:17:10.608349560,9444614,T,IEX,342.580000,100
2019-11-01 18:17:44.713691904,2019-11-01 18:17:44.713672881,9459312,T,IEX,342.750000,100
2019-11-01 18:17:55.337971968,2019-11-01 18:17:55.337952855,9463527,T,IEX,342.760000,100
2019-11-01 18:18:25.66684928,2019-11-01 18:18:25.66662919,9474186,T,IEX,342.715000,100
2019-11-01 18:18:28.849672960,2019-11-01 18:18:28.849654998,9475397,T,IEX,342.715000,100
2019-11-01 18:18:48.242128896,2019-11-01 18:18:48.242110709,9482328,T,IEX,342.650000,100
2019-11-01 18:18:49.842651904,2019-11-01 18:18:49.842635684,9482909,T,IEX,342.625000,100
2019-11-01 18:18:50.164620032,2019-11-01 18:18:50.164600025,9483126,T,IEX,342.590000,100
2019-11-01 18:19:19.165553920,2019-11-01 18:19:19.165531898,9496476,T,IEX,342.190000,5
2019-11-01 18:19:57.273607936,2019-11-01 18:19:57.273588959,9513488,T,IEX,342.170000,19
2019-11-01 18:19:59.600135936,2019-11-01 18:19:59.600119057,9514316,T,IEX,342.155000,9
2019-11-01 18:19:59.634601984,2019-11-01 18:19:59.634584182,9514320,T,IEX,342.120000,100
2019-11-01 18:19:59.634616064,2019-11-01 18:19:59.634597925,9514321,T,IEX,342.100000,91
2019-11-01 18:20:48.846465024,2019-11-01 18:20:48.846447207,9531775,T,IEX,342.180000,100
2019-11-01 18:21:07.713079040,2019-11-01 18:21:07.713062073,9541164,T,IEX,342.100000,9
2019-11-01 18:21:22.912071936,2019-11-01 18:21:22.912054143,9547564,T,IEX,342.030000,10
2019-11-01 18:22:01.256140032,2019-11-01 18:22:01.256121376,9560713,T,IEX,341.830000,15
2019-11-01 18:22:03.402575872,2019-11-01 18:22:03.402555331,9561990,T,IEX,341.910000,100
2019-11-01 18:22:03.402586880,2019-11-01 18:22:03.402569058,9561991,T,IEX,341.910000,100
2019-11-01 18:22:03.402600960,2019-11-01 18:22:03.402584731,9561992,T,IEX,341.910000,100
2019-11-01 18:22:03.402616064,2019-11-01 18:22:03.402598398,9561993,T,IEX,341.940000,400
2019-11-01 18:22:03.448339968,2019-11-01 18:22:03.448321853,9562020,T,IEX,341.920000,100
2019-11-01 18:22:03.448837888,2019-11-01 18:22:03.448820741,9562021,T,IEX,341.910000,100
2019-11-01 18:22:03.451838976,2019-11-01 18:22:03.451818226,9562022,T,IEX,341.900000,100
2019-11-01 18:22:03.662138880,2019-11-01 18:22:03.662123206,9562105,T,IEX,341.830000,3
2019-11-01 18:22:04.486771968,2019-11-01 18:22:04.486754552,9562448,T,IEX,341.990000,100
2019-11-01 18:22:04.486790912,2019-11-01 18:22:04.486773572,9562449,T,IEX,342.000000,100
2019-11-01 18:22:04.486807040,2019-11-01 18:22:04.486788636,9562450,T,IEX,342.000000,100
2019-11-01 18:22:05.65680896,2019-11-01 18:22:05.65654374,9562698,T,IEX,342.050000,100
2019-11-01 18:22:06.576399104,2019-11-01 18:22:06.576379649,9563142,T,IEX,342.140000,500
2019-11-01 18:22:08.344871936,2019-11-01 18:22:08.344852594,9563632,T,IEX,342.230000,997
2019-11-01 18:23:01.48331008,2019-11-01 18:23:01.48313849,9588392,T,IEX,342.440000,100
2019-11-01 18:23:23.906008064,2019-11-01 18:23:23.905989185,9600644,T,IEX,342.390000,20
2019-11-01 18:24:34.550393088,2019-11-01 18:24:34.550374878,9638924,T,IEX,342.850000,100
2019-11-01 18:25:01.597286912,2019-11-01 18:25:01.597269219,9652432,T,IEX,342.900000,14
2019-11-01 18:25:01.597303040,2019-11-01 18:25:01.597285585,9652433,T,IEX,342.870000,86
2019-11-01 18:26:49.150921984,2019-11-01 18:26:49.150904077,9706344,T,IEX,342.950000,100
2019-11-01 18:27:27.705836032,2019-11-01 18:27:27.705818368,9724190,T,IEX,342.950000,10
2019-11-01 18:28:10.334162944,2019-11-01 18:28:10.334145143,9746811,T,IEX,342.890000,85
2019-11-01 18:28:15.664335872,2019-11-01 18:28:15.664315852,9748616,T,IEX,342.890000,15
2019-11-01 18:29:44.874403072,2019-11-01 18:29:44.874382139,9789850,T,IEX,342.795000,100
2019-11-01 18:30:00.991910912,2019-11-01 18:30:00.991891067,9797463,T,IEX,342.870000,2
2019-11-01 18:30:21.528496896,2019-11-01 18:30:21.528479693,9808058,T,IEX,342.905000,10
2019-11-01 18:31:25.386022912,2019-11-01 18:31:25.386003555,9836666,T,IEX,342.880000,10
2019-11-01 18:31:30.677980928,2019-11-01 18:31:30.677961506,9839163,T,IEX,342.880000,100
2019-11-01 18:32:05.681491968,2019-11-01 18:32:05.681473788,9854520,T,IEX,342.825000,100
2019-11-01 18:33:08.75006976,2019-11-01 18:33:08.74987683,9882207,T,IEX,342.760000,100
2019-11-01 18:34:13.525347072,2019-11-01 18:34:13.525326079,9905290,T,IEX,342.765000,10
2019-11-01 18:34:13.531292928,2019-11-01 18:34:13.531274832,9905294,T,IEX,342.750000,100
2019-11-01 18:34:13.532291072,2019-11-01 18:34:13.532269922,9905295,T,IEX,342.750000,390
2019-11-01 18:34:50.746053120,2019-11-01 18:34:50.746030100,9921696,T,IEX,342.800000,99
2019-11-01 18:36:09.174639104,2019-11-01 18:36:09.174620205,9950628,T,IEX,342.755000,100
2019-11-01 18:37:11.509024000,2019-11-01 18:37:11.508999505,9972569,T,IEX,342.790000,10
2019-11-01 18:37:11.509036032,2019-11-01 18:37:11.509015747,9972570,T,IEX,342.790000,10
2019-11-01 18:37:30.693561088,2019-11-01 18:37:30.693544191,9980493,T,IEX,342.795000,100
2019-11-01 18:37:43.597089024,2019-11-01 18:37:43.597069031,9985806,T,IEX,342.880000,10
2019-11-01 18:38:02.73323008,2019-11-01 18:38:02.73300581,9992177,T,IEX,342.855000,1
2019-11-01 18:40:00.798149120,2019-11-01 18:40:00.798129554,10035910,T,IEX,342.840000,100
2019-11-01 18:41:26.996211968,2019-11-01 18:41:26.996191207,10065275,T,IEX,342.845000,6
2019-11-01 18:42:58.126126080,2019-11-01 18:42:58.126104342,10095990,T,IEX,342.870000,100
2019-11-01 18:43:13.331785984,2019-11-01 18:43:13.331768306,10101700,T,IEX,342.840000,2
2019-11-01 18:43:51.235812096,2019-11-01 18:43:51.235793275,10114502,T,IEX,342.895000,1
2019-11-01 18:44:05.566179072,2019-11-01 18:44:05.566157042,10119973,T,IEX,342.880000,10
2019-11-01 18:44:05.566221056,2019-11-01 18:44:05.566203705,10119974,T,IEX,342.880000,100
2019-11-01 18:44:29.870618880,2019-11-01 18:44:29.870597378,10126998,T,IEX,342.880000,25
2019-11-01 18:44:42.769912064,2019-11-01 18:44:42.769890993,10131024,T,IEX,342.800000,100
2019-11-01 18:44:42.780334080,2019-11-01 18:44:42.780317411,10131051,T,IEX,342.750000,100
2019-11-01 18:44:42.781324032,2019-11-01 18:44:42.781303034,10131053,T,IEX,342.750000,1200
2019-11-01 18:44:43.967333888,2019-11-01 18:44:43.967315852,10131406,T,IEX,342.840000,49
2019-11-01 18:45:04.485404928,2019-11-01 18:45:04.485387827,10139001,T,IEX,342.720000,100
2019-11-01 18:45:04.486486016,2019-11-01 18:45:04.486469370,10139015,T,IEX,342.720000,300
2019-11-01 18:45:15.83834880,2019-11-01 18:45:15.83816960,10143160,T,IEX,342.720000,150
2019-11-01 18:46:15.580687872,2019-11-01 18:46:15.580669008,10164606,T,IEX,342.850000,100
2019-11-01 18:47:02.134565120,2019-11-01 18:47:02.134543827,10178890,T,IEX,342.860000,1
2019-11-01 18:47:14.599129088,2019-11-01 18:47:14.599108506,10183147,T,IEX,342.930000,100
2019-11-01 18:47:15.150580992,2019-11-01 18:47:15.150558645,10183292,T,IEX,342.930000,10
2019-11-01 18:47:30.275618048,2019-11-01 18:47:30.275599929,10189208,T,IEX,342.945000,100
2019-11-01 18:48:39.387539968,2019-11-01 18:48:39.387523141,10210597,T,IEX,342.750000,100
2019-11-01 18:48:55.313730048,2019-11-01 18:48:55.313707589,10215063,T,IEX,342.835000,10
2019-11-01 18:49:08.786565120,2019-11-01 18:49:08.786546565,10220462,T,IEX,342.880000,100
2019-11-01 18:50:11.473018112,2019-11-01 18:50:11.472998586,10241869,T,IEX,342.935000,100
2019-11-01 18:50:53.630638080,2019-11-01 18:50:53.630621949,10256808,T,IEX,342.925000,100
2019-11-01 18:51:44.789165056,2019-11-01 18:51:44.789148698,10274927,T,IEX,342.950000,28
2019-11-01 18:51:44.789392896,2019-11-01 18:51:44.789377273,10274929,T,IEX,342.950000,72
2019-11-01 18:51:46.69447936,2019-11-01 18:51:46.69430039,10275268,T,IEX,342.960000,100
2019-11-01 18:52:41.999665920,2019-11-01 18:52:41.999649828,10293670,T,IEX,343.000000,100
2019-11-01 18:52:42.727040,2019-11-01 18:52:42.704551,10293671,T,IEX,343.000000,100
2019-11-01 18:52:44.420183040,2019-11-01 18:52:44.420164214,10294547,T,IEX,343.000000,1
2019-11-01 18:52:50.673584128,2019-11-01 18:52:50.673565788,10296330,T,IEX,343.000000,119
2019-11-01 18:52:51.320672000,2019-11-01 18:52:51.320651525,10296494,T,IEX,343.000000,1
2019-11-01 18:52:58.802480896,2019-11-01 18:52:58.802460544,10299265,T,IEX,343.000000,50
2019-11-01 18:53:14.124471040,2019-11-01 18:53:14.124447781,10305347,T,IEX,342.940000,30
2019-11-01 18:53:26.970434048,2019-11-01 18:53:26.970415509,10310663,T,IEX,342.885000,1
2019-11-01 18:53:26.970451968,2019-11-01 18:53:26.970434147,10310664,T,IEX,342.885000,99
2019-11-01 18:53:26.971527936,2019-11-01 18:53:26.971508376,10310666,T,IEX,342.885000,100
2019-11-01 18:53:43.857974016,2019-11-01 18:53:43.857957336,10317090,T,IEX,342.815000,200
2019-11-01 18:53:49.976385024,2019-11-01 18:53:49.976367295,10319577,T,IEX,342.940000,50
2019-11-01 18:54:14.333314048,2019-11-01 18:54:14.333294256,10328765,T,IEX,343.000000,100
2019-11-01 18:54:18.375194112,2019-11-01 18:54:18.375174690,10330506,T,IEX,343.000000,14
2019-11-01 18:54:18.715304960,2019-11-01 18:54:18.715288741,10330692,T,IEX,343.000000,200
2019-11-01 18:54:59.27449088,2019-11-01 18:54:59.27431444,10344759,T,IEX,343.000000,10
2019-11-01 18:55:13.783139072,2019-11-01 18:55:13.783117805,10350483,T,IEX,342.990000,100
2019-11-01 18:55:19.202635008,2019-11-01 18:55:19.202618777,10353748,T,IEX,343.040000,100
2019-11-01 18:55:44.269262080,2019-11-01 18:55:44.269243041,10365109,T,IEX,343.030000,31
2019-11-01 18:55:49.802789888,2019-11-01 18:55:49.802771378,10367297,T,IEX,343.045000,100
2019-11-01 18:55:51.260228096,2019-11-01 18:55:51.260212358,10367745,T,IEX,343.045000,100
2019-11-01 18:55:54.859076096,2019-11-01 18:55:54.859054951,10368679,T,IEX,343.090000,20
2019-11-01 18:55:55.868677888,2019-11-01 18:55:55.868658009,10368952,T,IEX,343.080000,100
2019-11-01 18:55:56.367408896,2019-11-01 18:55:56.367389310,10369075,T,IEX,343.085000,100
2019-11-01 18:56:03.54555904,2019-11-01 18:56:03.54534980,10372273,T,IEX,343.100000,29
2019-11-01 18:56:11.9451008,2019-11-01 18:56:11.9433784,10374471,T,IEX,343.100000,100
2019-11-01 18:56:11.12481024,2019-11-01 18:56:11.12462278,10374472,T,IEX,343.100000,100
2019-11-01 18:56:11.531382016,2019-11-01 18:56:11.531363536,10375321,T,IEX,343.090000,26
2019-11-01 18:56:13.506781952,2019-11-01 18:56:13.506765457,10376256,T,IEX,343.100000,100
2019-11-01 18:56:17.80558080,2019-11-01 18:56:17.80539483,10377634,T,IEX,343.100000,100
2019-11-01 18:56:18.111495936,2019-11-01 18:56:18.111476431,10377999,T,IEX,343.100000,100
2019-11-01 18:56:19.580608000,2019-11-01 18:56:19.580589814,10378495,T,IEX,343.100000,100
2019-11-01 18:56:21.58324992,2019-11-01 18:56:21.58309377,10379101,T,IEX,343.100000,100
2019-11-01 18:56:22.63418880,2019-11-01 18:56:22.63399294,10380093,T,IEX,343.100000,100
2019-11-01 18:56:22.961191936,2019-11-01 18:56:22.961173804,10380612,T,IEX,343.100000,100
2019-11-01 18:56:23.990888960,2019-11-01 18:56:23.990868349,10380984,T,IEX,343.100000,100
2019-11-01 18:56:24.978718976,2019-11-01 18:56:24.978702745,10381540,T,IEX,343.100000,100
2019-11-01 18:56:27.769436928,2019-11-01 18:56:27.769418187,10382910,T,IEX,343.100000,100
2019-11-01 18:56:28.776727040,2019-11-01 18:56:28.776707379,10383565,T,IEX,343.100000,100
2019-11-01 18:56:30.640251904,2019-11-01 18:56:30.640233571,10384677,T,IEX,343.100000,100
2019-11-01 18:56:57.331099904,2019-11-01 18:56:57.331081596,10393485,T,IEX,343.190000,100
2019-11-01 18:56:57.331191040,2019-11-01 18:56:57.331173107,10393487,T,IEX,343.190000,100
2019-11-01 18:57:44.798503936,2019-11-01 18:57:44.798484224,10409459,T,IEX,343.240000,200
2019-11-01 18:58:58.587808000,2019-11-01 18:58:58.587788845,10435433,T,IEX,343.440000,100
2019-11-01 19:00:22.428278016,2019-11-01 19:00:22.428258973,10474707,T,IEX,343.375000,100
2019-11-01 19:00:33.813707008,2019-11-01 19:00:33.813686459,10478142,T,IEX,343.340000,100
2019-11-01 19:00:33.814358016,2019-11-01 19:00:33.814184668,10478150,T,IEX,343.340000,100
2019-11-01 19:00:33.814358016,2019-11-01 19:00:33.814184668,10478153,T,IEX,343.340000,100
2019-11-01 19:02:53.306245120,2019-11-01 19:02:53.306225999,10532236,T,IEX,343.390000,100
2019-11-01 19:03:22.323899904,2019-11-01 19:03:22.323880226,10542043,T,IEX,343.550000,100
2019-11-01 19:03:26.966248960,2019-11-01 19:03:26.966229166,10543213,T,IEX,343.550000,100
2019-11-01 19:08:46.57095936,2019-11-01 19:08:46.57077297,10645311,T,IEX,343.930000,100
2019-11-01 19:10:08.692435968,2019-11-01 19:10:08.692419924,10671148,T,IEX,343.760000,8
2019-11-01 19:11:04.181671936,2019-11-01 19:11:04.181651513,10688019,T,IEX,343.610000,100
2019-11-01 19:11:04.181715968,2019-11-01 19:11:04.181693867,10688021,T,IEX,343.610000,16
2019-11-01 19:13:00.611229952,2019-11-01 19:13:00.611209992,10728914,T,IEX,343.510000,5
2019-11-01 19:13:01.993922048,2019-11-01 19:13:01.993904448,10729232,T,IEX,343.510000,95
2019-11-01 19:13:02.302077952,2019-11-01 19:13:02.302059111,10729378,T,IEX,343.455000,98
2019-11-01 19:14:10.995852032,2019-11-01 19:14:10.995833461,10756898,T,IEX,343.610000,100
2019-11-01 19:14:11.434376960,2019-11-01 19:14:11.434360064,10756973,T,IEX,343.640000,100
2019-11-01 19:14:38.563433984,2019-11-01 19:14:38.563415473,10767410,T,IEX,343.620000,100
2019-11-01 19:16:23.760456960,2019-11-01 19:16:23.760438669,10820427,T,IEX,343.790000,3
2019-11-01 19:17:40.41552896,2019-11-01 19:17:40.41533612,10851057,T,IEX,343.790000,45
2019-11-01 19:18:38.798671872,2019-11-01 19:18:38.798651472,10872976,T,IEX,343.920000,100
2019-11-01 19:19:01.513051904,2019-11-01 19:19:01.513032602,10884352,T,IEX,343.920000,100
2019-11-01 19:19:19.884836096,2019-11-01 19:19:19.884818451,10890061,T,IEX,343.870000,100
2019-11-01 19:20:22.234479104,2019-11-01 19:20:22.234463871,10914278,T,IEX,343.880000,100
2019-11-01 19:21:31.913150976,2019-11-01 19:21:31.913133741,10945841,T,IEX,343.715000,100
2019-11-01 19:21:44.838298880,2019-11-01 19:21:44.838280581,10951496,T,IEX,343.690000,100
2019-11-01 19:22:20.713728000,2019-11-01 19:22:20.713707209,10965896,T,IEX,343.715000,100
2019-11-01 19:22:50.797989888,2019-11-01 19:22:50.797969412,10978614,T,IEX,343.760000,20
2019-11-01 19:22:51.315847936,2019-11-01 19:22:51.315828338,10979873,T,IEX,343.690000,100
2019-11-01 19:23:14.377159936,2019-11-01 19:23:14.377140509,10988672,T,IEX,343.700000,100
2019-11-01 19:24:12.928477952,2019-11-01 19:24:12.928461126,11015097,T,IEX,343.815000,100
2019-11-01 19:25:01.491027968,2019-11-01 19:25:01.491009198,11040002,T,IEX,343.695000,100
2019-11-01 19:25:06.858572032,2019-11-01 19:25:06.858553662,11042659,T,IEX,343.700000,75
2019-11-01 19:25:06.858639104,2019-11-01 19:25:06.858620944,11042661,T,IEX,343.700000,100
2019-11-01 19:25:06.860695040,2019-11-01 19:25:06.860675388,11042665,T,IEX,343.700000,100
2019-11-01 19:25:06.861155072,2019-11-01 19:25:06.861137355,11042668,T,IEX,343.700000,100
2019-11-01 19:25:06.861208064,2019-11-01 19:25:06.861189351,11042670,T,IEX,343.700000,29
2019-11-01 19:25:06.861278976,2019-11-01 19:25:06.861260201,11042672,T,IEX,343.700000,100
2019-11-01 19:25:06.861342976,2019-11-01 19:25:06.861324328,11042674,T,IEX,343.700000,100
2019-11-01 19:25:06.861353984,2019-11-01 19:25:06.861334690,11042675,T,IEX,343.700000,100
2019-11-01 19:25:06.861488896,2019-11-01 19:25:06.861470875,11042677,T,IEX,343.700000,20
2019-11-01 19:25:06.861549056,2019-11-01 19:25:06.861530607,11042679,T,IEX,343.700000,100
2019-11-01 19:25:15.818757120,2019-11-01 19:25:15.818741011,11046925,T,IEX,343.680000,76
2019-11-01 19:25:22.82700032,2019-11-01 19:25:22.82681074,11049909,T,IEX,343.760000,15
2019-11-01 19:25:47.927691008,2019-11-01 19:25:47.927674985,11060642,T,IEX,343.780000,100
2019-11-01 19:26:52.358277888,2019-11-01 19:26:52.358258826,11092349,T,IEX,343.810000,100
2019-11-01 19:27:28.946548992,2019-11-01 19:27:28.946529306,11109518,T,IEX,343.900000,100
2019-11-01 19:28:16.667023872,2019-11-01 19:28:16.667005835,11130236,T,IEX,343.925000,100
2019-11-01 19:29:27.264014080,2019-11-01 19:29:27.263995563,11161160,T,IEX,343.855000,100
2019-11-01 19:29:27.508528128,2019-11-01 19:29:27.508513215,11161288,T,IEX,343.830000,100
2019-11-01 19:30:25.951337984,2019-11-01 19:30:25.951319832,11192379,T,IEX,343.780000,4
2019-11-01 19:30:25.951355904,2019-11-01 19:30:25.951338418,11192380,T,IEX,343.780000,2
2019-11-01 19:30:37.506362880,2019-11-01 19:30:37.506344386,11199711,T,IEX,343.795000,100
2019-11-01 19:31:13.344502016,2019-11-01 19:31:13.344481388,11220804,T,IEX,343.860000,10
2019-11-01 19:31:56.236177920,2019-11-01 19:31:56.236160084,11243586,T,IEX,343.880000,100
2019-11-01 19:32:15.788355072,2019-11-01 19:32:15.788337589,11252705,T,IEX,343.905000,200
2019-11-01 19:32:31.147506944,2019-11-01 19:32:31.147491489,11261369,T,IEX,343.765000,100
2019-11-01 19:32:34.25383936,2019-11-01 19:32:34.25368337,11262868,T,IEX,343.765000,100
2019-11-01 19:32:35.343439104,2019-11-01 19:32:35.343423779,11263491,T,IEX,343.765000,31
2019-11-01 19:33:09.762982912,2019-11-01 19:33:09.762962588,11280021,T,IEX,343.760000,210
2019-11-01 19:33:31.488185088,2019-11-01 19:33:31.488166438,11288723,T,IEX,343.690000,100
2019-11-01 19:33:40.698392064,2019-11-01 19:33:40.698370377,11292284,T,IEX,343.655000,100
2019-11-01 19:34:04.650765056,2019-11-01 19:34:04.650747135,11304236,T,IEX,343.580000,15
2019-11-01 19:34:08.884726016,2019-11-01 19:34:08.884700934,11306160,T,IEX,343.550000,85
2019-11-01 19:34:08.884737024,2019-11-01 19:34:08.884719275,11306161,T,IEX,343.550000,15
2019-11-01 19:34:08.884753920,2019-11-01 19:34:08.884736296,11306162,T,IEX,343.550000,100
2019-11-01 19:34:08.896014080,2019-11-01 19:34:08.895992654,11306170,T,IEX,343.550000,32
2019-11-01 19:34:08.896023040,2019-11-01 19:34:08.896008147,11306171,T,IEX,343.550000,68
2019-11-01 19:34:18.560680960,2019-11-01 19:34:18.560659006,11310376,T,IEX,343.620000,100
2019-11-01 19:34:34.11831040,2019-11-01 19:34:34.11812930,11318415,T,IEX,343.680000,100
2019-11-01 19:35:05.5080064,2019-11-01 19:35:05.5054489,11332914,T,IEX,343.740000,11
2019-11-01 19:35:05.440628992,2019-11-01 19:35:05.440606002,11333416,T,IEX,343.720000,100
2019-11-01 19:35:51.24449024,2019-11-01 19:35:51.24431294,11360168,T,IEX,343.940000,100
2019-11-01 19:35:51.24463104,2019-11-01 19:35:51.24447778,11360169,T,IEX,343.940000,300
2019-11-01 19:36:19.250941952,2019-11-01 19:36:19.250922910,11377358,T,IEX,343.980000,100
2019-11-01 19:36:47.677229056,2019-11-01 19:36:47.677212758,11391924,T,IEX,343.955000,100
2019-11-01 19:37:02.878192128,2019-11-01 19:37:02.878173150,11399501,T,IEX,343.930000,100
2019-11-01 19:37:09.741115904,2019-11-01 19:37:09.741096162,11402772,T,IEX,344.020000,19
2019-11-01 19:37:09.742518016,2019-11-01 19:37:09.742500825,11402774,T,IEX,344.020000,81
2019-11-01 19:37:31.825777920,2019-11-01 19:37:31.825757521,11414844,T,IEX,344.220000,50
2019-11-01 19:37:47.540009984,2019-11-01 19:37:47.539992185,11422289,T,IEX,344.250000,1
2019-11-01 19:39:27.453293056,2019-11-01 19:39:27.453276403,11472094,T,IEX,344.680000,100
2019-11-01 19:40:03.114054912,2019-11-01 19:40:03.114036356,11490619,T,IEX,344.760000,155
2019-11-01 19:40:03.115558912,2019-11-01 19:40:03.115541333,11490621,T,IEX,344.760000,45
2019-11-01 19:40:47.623433984,2019-11-01 19:40:47.623419130,11510999,T,IEX,345.065000,4
2019-11-01 19:40:48.388125952,2019-11-01 19:40:48.388105942,11511313,T,IEX,345.070000,100
2019-11-01 19:42:37.97132032,2019-11-01 19:42:37.97112364,11577152,T,IEX,344.810000,3
2019-11-01 19:43:29.858373888,2019-11-01 19:43:29.858356914,11603506,T,IEX,344.640000,100
2019-11-01 19:44:00.17499904,2019-11-01 19:44:00.17479775,11619924,T,IEX,344.540000,100
2019-11-01 19:44:09.802846976,2019-11-01 19:44:09.802829654,11625106,T,IEX,344.490000,100
2019-11-01 19:45:05.365764096,2019-11-01 19:45:05.365743945,11660130,T,IEX,344.460000,6
2019-11-01 19:45:27.804759040,2019-11-01 19:45:27.804740775,11676586,T,IEX,344.500000,100
2019-11-01 19:45:27.804801024,2019-11-01 19:45:27.804781966,11676588,T,IEX,344.500000,100
2019-11-01 19:46:27.835525888,2019-11-01 19:46:27.835504003,11712925,T,IEX,344.515000,127
2019-11-01 19:47:07.248067072,2019-11-01 19:47:07.248046742,11738684,T,IEX,344.525000,100
2019-11-01 19:47:07.787454976,2019-11-01 19:47:07.787435213,11739094,T,IEX,344.530000,400
2019-11-01 19:47:36.859473920,2019-11-01 19:47:36.859458846,11758117,T,IEX,344.445000,3
2019-11-01 19:47:52.847613952,2019-11-01 19:47:52.847593510,11768121,T,IEX,344.445000,31
2019-11-01 19:48:02.344171008,2019-11-01 19:48:02.344152244,11773136,T,IEX,344.440000,100
2019-11-01 19:48:04.857288960,2019-11-01 19:48:04.857260964,11775510,T,IEX,344.430000,100
2019-11-01 19:48:11.928297984,2019-11-01 19:48:11.928281002,11779663,T,IEX,344.335000,12
2019-11-01 19:48:48.713206016,2019-11-01 19:48:48.713187837,11801109,T,IEX,344.450000,10
2019-11-01 19:48:48.713219072,2019-11-01 19:48:48.713201202,11801110,T,IEX,344.450000,100
2019-11-01 19:48:55.435996928,2019-11-01 19:48:55.435978493,11804508,T,IEX,344.545000,300
2019-11-01 19:49:03.79732992,2019-11-01 19:49:03.79712847,11809844,T,IEX,344.550000,100
2019-11-01 19:49:06.240190976,2019-11-01 19:49:06.240173353,11811969,T,IEX,344.540000,100
2019-11-01 19:49:12.80433920,2019-11-01 19:49:12.80418726,11817807,T,IEX,344.540000,15
2019-11-01 19:49:12.325844992,2019-11-01 19:49:12.325824670,11821313,T,IEX,344.630000,11
2019-11-01 19:49:13.534227968,2019-11-01 19:49:13.534208784,11823108,T,IEX,344.550000,100
2019-11-01 19:49:44.54138880,2019-11-01 19:49:44.54119071,11843933,T,IEX,344.535000,100
2019-11-01 19:50:28.11052032,2019-11-01 19:50:28.11032360,11885957,T,IEX,344.650000,6
2019-11-01 19:50:30.263063040,2019-11-01 19:50:30.263044372,11887544,T,IEX,344.640000,100
2019-11-01 19:50:30.965006080,2019-11-01 19:50:30.964985952,11887973,T,IEX,344.640000,100
2019-11-01 19:50:37.713644032,2019-11-01 19:50:37.713626317,11892323,T,IEX,344.640000,200
2019-11-01 19:50:39.926526976,2019-11-01 19:50:39.926510739,11893643,T,IEX,344.605000,100
2019-11-01 19:50:39.928219904,2019-11-01 19:50:39.928199954,11893644,T,IEX,344.605000,100
2019-11-01 19:50:39.932418048,2019-11-01 19:50:39.932395759,11893648,T,IEX,344.605000,200
2019-11-01 19:50:40.599328000,2019-11-01 19:50:40.599312140,11894113,T,IEX,344.605000,500
2019-11-01 19:50:43.968950016,2019-11-01 19:50:43.968931257,11896539,T,IEX,344.605000,100
2019-11-01 19:50:45.622565888,2019-11-01 19:50:45.622551168,11898519,T,IEX,344.605000,300
2019-11-01 19:50:52.84876032,2019-11-01 19:50:52.84858203,11903652,T,IEX,344.660000,100
2019-11-01 19:51:19.682201088,2019-11-01 19:51:19.682180622,11925877,T,IEX,344.760000,100
2019-11-01 19:51:31.474524928,2019-11-01 19:51:31.474505185,11933669,T,IEX,344.755000,5
2019-11-01 19:51:31.474535936,2019-11-01 19:51:31.474517557,11933670,T,IEX,344.750000,94
2019-11-01 19:51:31.475209984,2019-11-01 19:51:31.475193047,11933682,T,IEX,344.755000,6
2019-11-01 19:51:40.953893888,2019-11-01 19:51:40.953877307,11945331,T,IEX,344.690000,1
2019-11-01 19:51:44.60218880,2019-11-01 19:51:44.60199996,11949951,T,IEX,344.660000,1
2019-11-01 19:51:44.64786944,2019-11-01 19:51:44.64699032,11949953,T,IEX,344.650000,8
2019-11-01 19:52:16.481043968,2019-11-01 19:52:16.481025938,11976521,T,IEX,344.775000,100
2019-11-01 19:52:16.557987072,2019-11-01 19:52:16.557969542,11976573,T,IEX,344.775000,100
2019-11-01 19:52:36.110637056,2019-11-01 19:52:36.110618586,11989374,T,IEX,344.610000,1
2019-11-01 19:52:38.418992128,2019-11-01 19:52:38.418970704,11991458,T,IEX,344.630000,70
2019-11-01 19:52:51.861360128,2019-11-01 19:52:51.861342549,12001500,T,IEX,344.620000,100
2019-11-01 19:52:53.297976064,2019-11-01 19:52:53.297956948,12002516,T,IEX,344.620000,76
2019-11-01 19:52:59.43106048,2019-11-01 19:52:59.43090565,12007238,T,IEX,344.660000,24
2019-11-01 19:52:59.90733056,2019-11-01 19:52:59.90713582,12007277,T,IEX,344.650000,100
2019-11-01 19:53:03.69739008,2019-11-01 19:53:03.69720329,12011106,T,IEX,344.620000,5
2019-11-01 19:53:21.620296960,2019-11-01 19:53:21.620278343,12024003,T,IEX,344.630000,100
2019-11-01 19:53:51.523578880,2019-11-01 19:53:51.523560291,12043289,T,IEX,344.610000,100
2019-11-01 19:54:00.91365120,2019-11-01 19:54:00.91348327,12050786,T,IEX,344.620000,100
2019-11-01 19:54:05.137231104,2019-11-01 19:54:05.137215928,12056355,T,IEX,344.660000,100
2019-11-01 19:54:13.502650112,2019-11-01 19:54:13.502633546,12062564,T,IEX,344.650000,100
2019-11-01 19:54:14.299196928,2019-11-01 19:54:14.299178421,12063200,T,IEX,344.645000,100
2019-11-01 19:54:26.767009024,2019-11-01 19:54:26.766991269,12074935,T,IEX,344.680000,100
2019-11-01 19:54:33.96171008,2019-11-01 19:54:33.96152942,12080388,T,IEX,344.675000,100
2019-11-01 19:54:35.923535872,2019-11-01 19:54:35.923519548,12082793,T,IEX,344.650000,400
2019-11-01 19:54:38.910988032,2019-11-01 19:54:38.910968798,12085003,T,IEX,344.645000,200
2019-11-01 19:54:42.115377920,2019-11-01 19:54:42.115360055,12089034,T,IEX,344.670000,19
2019-11-01 19:54:48.883678976,2019-11-01 19:54:48.883657809,12097722,T,IEX,344.670000,100
2019-11-01 19:54:51.142330880,2019-11-01 19:54:51.142312266,12100617,T,IEX,344.650000,100
2019-11-01 19:54:52.519258880,2019-11-01 19:54:52.519242131,12101865,T,IEX,344.680000,400
2019-11-01 19:54:54.409552896,2019-11-01 19:54:54.409537133,12103876,T,IEX,344.680000,100
2019-11-01 19:54:54.900160000,2019-11-01 19:54:54.900142951,12106422,T,IEX,344.730000,100
2019-11-01 19:55:02.654964992,2019-11-01 19:55:02.654945302,12125851,T,IEX,344.710000,100
2019-11-01 19:55:08.410529024,2019-11-01 19:55:08.410513403,12138407,T,IEX,344.685000,400
2019-11-01 19:55:08.902928896,2019-11-01 19:55:08.902910080,12139222,T,IEX,344.685000,100
2019-11-01 19:55:13.611596032,2019-11-01 19:55:13.611573556,12146831,T,IEX,344.730000,100
2019-11-01 19:55:13.611606016,2019-11-01 19:55:13.611587394,12146832,T,IEX,344.730000,100
2019-11-01 19:55:13.623318016,2019-11-01 19:55:13.623300254,12146848,T,IEX,344.720000,100
2019-11-01 19:55:13.625445120,2019-11-01 19:55:13.625430412,12146852,T,IEX,344.690000,300
2019-11-01 19:55:13.625644032,2019-11-01 19:55:13.625625179,12146853,T,IEX,344.690000,100
2019-11-01 19:55:13.626854912,2019-11-01 19:55:13.626836197,12146855,T,IEX,344.685000,100
2019-11-01 19:55:14.652254976,2019-11-01 19:55:14.652238857,12148513,T,IEX,344.720000,100
2019-11-01 19:55:28.629713920,2019-11-01 19:55:28.629697810,12164006,T,IEX,344.695000,100
2019-11-01 19:55:28.644817920,2019-11-01 19:55:28.644801021,12164014,T,IEX,344.695000,2
2019-11-01 19:55:28.644835072,2019-11-01 19:55:28.644819805,12164015,T,IEX,344.695000,4
2019-11-01 19:55:45.463600896,2019-11-01 19:55:45.463583217,12182881,T,IEX,344.710000,100
2019-11-01 19:56:12.734373888,2019-11-01 19:56:12.734358302,12214794,T,IEX,344.700000,120
2019-11-01 19:56:23.823880960,2019-11-01 19:56:23.823862601,12226533,T,IEX,344.720000,100
2019-11-01 19:56:24.55951104,2019-11-01 19:56:24.55933242,12226755,T,IEX,344.725000,12
2019-11-01 19:56:31.764452096,2019-11-01 19:56:31.764434858,12234832,T,IEX,344.725000,100
2019-11-01 19:56:35.884707072,2019-11-01 19:56:35.884688797,12238640,T,IEX,344.710000,9
2019-11-01 19:56:46.934099968,2019-11-01 19:56:46.934082640,12249716,T,IEX,344.780000,300
2019-11-01 19:56:58.265718016,2019-11-01 19:56:58.265697640,12265507,T,IEX,344.695000,7
2019-11-01 19:56:58.265729024,2019-11-01 19:56:58.265710108,12265508,T,IEX,344.695000,4
2019-11-01 19:57:04.602458880,2019-11-01 19:57:04.602443183,12277049,T,IEX,344.675000,3
2019-11-01 19:57:17.793008896,2019-11-01 19:57:17.792990008,12296532,T,IEX,344.650000,100
2019-11-01 19:57:22.975100928,2019-11-01 19:57:22.975080342,12301407,T,IEX,344.615000,1
2019-11-01 19:57:22.975110912,2019-11-01 19:57:22.975092224,12301408,T,IEX,344.615000,5
2019-11-01 19:57:22.975126016,2019-11-01 19:57:22.975108965,12301409,T,IEX,344.615000,7
2019-11-01 19:57:28.186988032,2019-11-01 19:57:28.186968491,12306620,T,IEX,344.500000,3
2019-11-01 19:57:28.202853120,2019-11-01 19:57:28.202832299,12306637,T,IEX,344.480000,100
2019-11-01 19:58:02.236028928,2019-11-01 19:58:02.236007157,12349679,T,IEX,344.450000,24
2019-11-01 19:58:02.280748032,2019-11-01 19:58:02.280724732,12349748,T,IEX,344.455000,100
2019-11-01 19:58:02.396665088,2019-11-01 19:58:02.396648912,12349945,T,IEX,344.440000,65
2019-11-01 19:58:02.396685056,2019-11-01 19:58:02.396668723,12349946,T,IEX,344.440000,100
2019-11-01 19:58:02.559696896,2019-11-01 19:58:02.559678223,12350286,T,IEX,344.455000,65
2019-11-01 19:58:02.559714048,2019-11-01 19:58:02.559697138,12350287,T,IEX,344.455000,100
2019-11-01 19:58:12.150423040,2019-11-01 19:58:12.150407237,12364793,T,IEX,344.400000,100
2019-11-01 19:58:14.757573120,2019-11-01 19:58:14.757555763,12368286,T,IEX,344.310000,100
2019-11-01 19:58:18.70479104,2019-11-01 19:58:18.70457573,12372040,T,IEX,344.280000,100
2019-11-01 19:58:18.225442048,2019-11-01 19:58:18.225425891,12372259,T,IEX,344.290000,100
2019-11-01 19:58:22.819319040,2019-11-01 19:58:22.819299440,12379094,T,IEX,344.320000,100
2019-11-01 19:58:23.69763072,2019-11-01 19:58:23.69745112,12379297,T,IEX,344.280000,100
2019-11-01 19:58:30.328975872,2019-11-01 19:58:30.328959726,12391147,T,IEX,344.290000,100
2019-11-01 19:58:35.411265024,2019-11-01 19:58:35.411245531,12398438,T,IEX,344.290000,92
2019-11-01 19:58:35.411279104,2019-11-01 19:58:35.411263141,12398439,T,IEX,344.290000,100
2019-11-01 19:58:44.763706880,2019-11-01 19:58:44.763688977,12411671,T,IEX,344.245000,18
2019-11-01 19:59:00.27843072,2019-11-01 19:59:00.27826867,12430676,T,IEX,344.235000,15
2019-11-01 19:59:00.27862016,2019-11-01 19:59:00.27845591,12430677,T,IEX,344.235000,4
2019-11-01 19:59:00.169233920,2019-11-01 19:59:00.169215014,12431361,T,IEX,344.250000,100
2019-11-01 19:59:00.171197952,2019-11-01 19:59:00.171180428,12431388,T,IEX,344.260000,1
2019-11-01 19:59:00.171214080,2019-11-01 19:59:00.171193773,12431389,T,IEX,344.260000,99
2019-11-01 19:59:03.193768960,2019-11-01 19:59:03.193746227,12438949,T,IEX,344.265000,100
2019-11-01 19:59:03.491245056,2019-11-01 19:59:03.491225432,12439732,T,IEX,344.290000,100
2019-11-01 19:59:04.9806080,2019-11-01 19:59:04.9786010,12440804,T,IEX,344.310000,100
2019-11-01 19:59:06.999627008,2019-11-01 19:59:06.999608304,12447591,T,IEX,344.390000,100
2019-11-01 19:59:18.483347968,2019-11-01 19:59:18.483331296,12469446,T,IEX,344.540000,10
2019-11-01 19:59:22.829876992,2019-11-01 19:59:22.829859710,12475761,T,IEX,344.590000,100
2019-11-01 19:59:22.829895936,2019-11-01 19:59:22.829877419,12475762,T,IEX,344.590000,100
2019-11-01 19:59:22.829908992,2019-11-01 19:59:22.829892703,12475763,T,IEX,344.590000,100
2019-11-01 19:59:23.301500928,2019-11-01 19:59:23.301483319,12476507,T,IEX,344.530000,100
2019-11-01 19:59:23.301518080,2019-11-01 19:59:23.301499112,12476508,T,IEX,344.530000,54
2019-11-01 19:59:23.301531904,2019-11-01 19:59:23.301512917,12476509,T,IEX,344.540000,100
2019-11-01 19:59:23.301544960,2019-11-01 19:59:23.301526464,12476510,T,IEX,344.550000,100
2019-11-01 19:59:23.301558016,2019-11-01 19:59:23.301539955,12476511,T,IEX,344.550000,46
2019-11-01 19:59:24.819933952,2019-11-01 19:59:24.819915282,12478564,T,IEX,344.570000,100
2019-11-01 19:59:24.819947008,2019-11-01 19:59:24.819928730,12478565,T,IEX,344.550000,200
2019-11-01 19:59:24.819961088,2019-11-01 19:59:24.819942552,12478566,T,IEX,344.540000,179
2019-11-01 19:59:26.4154880,2019-11-01 19:59:26.4137685,12480966,T,IEX,344.520000,100
2019-11-01 19:59:26.4167936,2019-11-01 19:59:26.4152531,12480967,T,IEX,344.520000,200
2019-11-01 19:59:26.4186880,2019-11-01 19:59:26.4168964,12480968,T,IEX,344.510000,200
2019-11-01 19:59:26.964354048,2019-11-01 19:59:26.964335914,12482674,T,IEX,344.420000,41
2019-11-01 19:59:26.965317120,2019-11-01 19:59:26.965301215,12482676,T,IEX,344.430000,20
2019-11-01 19:59:27.385829120,2019-11-01 19:59:27.385809755,12483320,T,IEX,344.420000,200
2019-11-01 19:59:27.385848064,2019-11-01 19:59:27.385830173,12483321,T,IEX,344.400000,39
2019-11-01 19:59:28.92091904,2019-11-01 19:59:28.92068358,12484608,T,IEX,344.440000,100
2019-11-01 19:59:28.551919104,2019-11-01 19:59:28.551900028,12485275,T,IEX,344.440000,100
2019-11-01 19:59:30.809035008,2019-11-01 19:59:30.809018957,12494997,T,IEX,344.570000,100
2019-11-01 19:59:30.809051904,2019-11-01 19:59:30.809034004,12494998,T,IEX,344.570000,100
2019-11-01 19:59:30.809064960,2019-11-01 19:59:30.809046508,12494999,T,IEX,344.570000,100
2019-11-01 19:59:31.446518016,2019-11-01 19:59:31.446502745,12499479,T,IEX,344.590000,100
2019-11-01 19:59:32.52916992,2019-11-01 19:59:32.52900831,12502598,T,IEX,344.650000,80
2019-11-01 19:59:33.75034112,2019-11-01 19:59:33.75017792,12508011,T,IEX,344.560000,42
2019-11-01 19:59:33.87564032,2019-11-01 19:59:33.87548094,12508090,T,IEX,344.610000,100
2019-11-01 19:59:33.87581952,2019-11-01 19:59:33.87563082,12508091,T,IEX,344.610000,100
2019-11-01 19:59:34.370714880,2019-11-01 19:59:34.370697148,12514128,T,IEX,344.625000,168
2019-11-01 19:59:34.769467904,2019-11-01 19:59:34.769451312,12517058,T,IEX,344.625000,102
2019-11-01 19:59:34.774387968,2019-11-01 19:59:34.774371375,12517075,T,IEX,344.570000,2
2019-11-01 19:59:34.774406912,2019-11-01 19:59:34.774389273,12517076,T,IEX,344.570000,100
2019-11-01 19:59:34.774420992,2019-11-01 19:59:34.774403158,12517077,T,IEX,344.560000,198
2019-11-01 19:59:36.857943040,2019-11-01 19:59:36.857924868,12528819,T,IEX,344.830000,100
2019-11-01 19:59:37.28166912,2019-11-01 19:59:37.28150210,12529600,T,IEX,344.920000,100
2019-11-01 19:59:37.349245952,2019-11-01 19:59:37.349228119,12530880,T,IEX,344.870000,17
2019-11-01 19:59:37.522888960,2019-11-01 19:59:37.522868739,12531579,T,IEX,344.810000,100
2019-11-01 19:59:40.818701056,2019-11-01 19:59:40.818683329,12551597,T,IEX,344.970000,100
2019-11-01 19:59:40.818723072,2019-11-01 19:59:40.818700800,12551598,T,IEX,344.970000,100
2019-11-01 19:59:40.818733056,2019-11-01 19:59:40.818714003,12551599,T,IEX,344.970000,100
2019-11-01 19:59:40.818748928,2019-11-01 19:59:40.818729678,12551600,T,IEX,344.980000,286
2019-11-01 19:59:40.819376896,2019-11-01 19:59:40.819358266,12551622,T,IEX,344.980000,100
2019-11-01 19:59:41.34280960,2019-11-01 19:59:41.34264025,12553385,T,IEX,345.040000,100
2019-11-01 19:59:41.34298112,2019-11-01 19:59:41.34279007,12553386,T,IEX,345.030000,100
2019-11-01 19:59:43.159134976,2019-11-01 19:59:43.159118884,12565735,T,IEX,344.925000,100
2019-11-01 19:59:44.409946880,2019-11-01 19:59:44.409929675,12572581,T,IEX,344.880000,90
2019-11-01 19:59:44.609308928,2019-11-01 19:59:44.609293679,12573261,T,IEX,344.960000,100
2019-11-01 19:59:44.609326080,2019-11-01 19:59:44.609310646,12573262,T,IEX,344.960000,100
2019-11-01 19:59:46.252901120,2019-11-01 19:59:46.252882095,12584379,T,IEX,344.905000,34
2019-11-01 19:59:48.475528960,2019-11-01 19:59:48.475509924,12596026,T,IEX,344.910000,100
2019-11-01 19:59:49.153675008,2019-11-01 19:59:49.153659547,12600155,T,IEX,344.880000,100
2019-11-01 19:59:52.927400960,2019-11-01 19:59:52.927386157,12622235,T,IEX,344.970000,24
2019-11-01 19:59:55.508091904,2019-11-01 19:59:55.508072963,12640148,T,IEX,344.950000,100
2019-11-01 19:59:56.78274048,2019-11-01 19:59:56.78257082,12644743,T,IEX,344.980000,100
2019-11-01 19:59:56.78582016,2019-11-01 19:59:56.78562487,12644751,T,IEX,344.980000,17
2019-11-01 19:59:57.755905024,2019-11-01 19:59:57.755887473,12655647,T,IEX,344.930000,100
2019-11-01 19:59:57.755919872,2019-11-01 19:59:57.755904107,12655648,T,IEX,344.910000,95
2019-11-01 19:59:58.453502976,2019-11-01 19:59:58.453483792,12661136,T,IEX,344.890000,100
