2019-10-30 13:30:55.486048000,2019-10-30 13:30:55.486020935,168701,T,IEX,128.990000,100
2019-10-30 13:32:33.319335936,2019-10-30 13:32:33.319315407,270245,T,IEX,128.855000,100
2019-10-30 13:34:23.157370880,2019-10-30 13:34:23.157350763,381541,T,IEX,129.000000,100
2019-10-30 13:34:36.587844096,2019-10-30 13:34:36.587824183,394671,T,IEX,128.965000,351
2019-10-30 13:35:39.610511104,2019-10-30 13:35:39.610492827,472130,T,IEX,129.050000,100
2019-10-30 13:40:43.47213056,2019-10-30 13:40:43.47191761,773026,T,IEX,129.015000,100
2019-10-30 13:40:48.615185920,2019-10-30 13:40:48.615168811,777767,T,IEX,129.010000,100
2019-10-30 13:42:52.790714880,2019-10-30 13:42:52.790692618,886161,T,IEX,128.945000,100
2019-10-30 13:42:53.145061120,2019-10-30 13:42:53.145043686,886431,T,IEX,128.945000,100
2019-10-30 13:42:58.362297088,2019-10-30 13:42:58.362280326,889939,T,IEX,128.970000,100
2019-10-30 13:43:52.43461120,2019-10-30 13:43:52.43440360,935272,T,IEX,129.080000,200
2019-10-30 13:44:06.43226880,2019-10-30 13:44:06.43211868,946683,T,IEX,129.120000,21
2019-10-30 13:44:14.43266048,2019-10-30 13:44:14.43249317,956037,T,IEX,129.180000,200
2019-10-30 13:44:15.433000960,2019-10-30 13:44:15.432982200,957726,T,IEX,129.110000,20
2019-10-30 13:44:15.434077952,2019-10-30 13:44:15.434060211,957727,T,IEX,129.110000,80
2019-10-30 13:45:03.328720896,2019-10-30 13:45:03.328693916,995183,T,IEX,129.080000,100
2019-10-30 13:45:14.957840896,2019-10-30 13:45:14.957821267,1009340,T,IEX,129.040000,100
2019-10-30 13:45:21.29240064,2019-10-30 13:45:21.29219683,1014103,T,IEX,129.040000,100
2019-10-30 13:45:59.521811968,2019-10-30 13:45:59.521793862,1045268,T,IEX,129.050000,100
2019-10-30 13:46:54.841906944,2019-10-30 13:46:54.841888234,1090791,T,IEX,128.950000,100
2019-10-30 13:47:33.967429120,2019-10-30 13:47:33.967405195,1120590,T,IEX,129.010000,200
2019-10-30 13:47:39.43549952,2019-10-30 13:47:39.43530441,1126396,T,IEX,128.980000,200
2019-10-30 13:48:46.6757888,2019-10-30 13:48:46.6736937,1177928,T,IEX,128.915000,100
2019-10-30 13:48:48.97710080,2019-10-30 13:48:48.97692352,1179857,T,IEX,128.915000,200
2019-10-30 13:49:05.529249024,2019-10-30 13:49:05.529231622,1193302,T,IEX,128.940000,100
2019-10-30 13:51:08.877106944,2019-10-30 13:51:08.877087370,1287433,T,IEX,128.920000,100
2019-10-30 13:53:09.590830080,2019-10-30 13:53:09.590808950,1389366,T,IEX,128.990000,100
2019-10-30 13:56:22.20474880,2019-10-30 13:56:22.20457966,1534715,T,IEX,129.165000,400
2019-10-30 13:57:05.705389056,2019-10-30 13:57:05.705363266,1565225,T,IEX,129.150000,100
2019-10-30 13:59:50.940005120,2019-10-30 13:59:50.939978560,1683723,T,IEX,129.085000,100
2019-10-30 14:00:12.320352000,2019-10-30 14:00:12.320334079,1701729,T,IEX,129.075000,100
2019-10-30 14:00:17.142540032,2019-10-30 14:00:17.142518952,1707156,T,IEX,129.085000,100
2019-10-30 14:00:40.207780096,2019-10-30 14:00:40.207761742,1728604,T,IEX,129.120000,200
2019-10-30 14:00:53.392345088,2019-10-30 14:00:53.392329046,1743936,T,IEX,129.075000,100
2019-10-30 14:01:13.290749952,2019-10-30 14:01:13.290729118,1761064,T,IEX,129.105000,100
2019-10-30 14:01:24.242597888,2019-10-30 14:01:24.242579415,1772976,T,IEX,129.105000,100
2019-10-30 14:02:03.694169088,2019-10-30 14:02:03.694150707,1807242,T,IEX,129.155000,100
2019-10-30 14:02:20.709850112,2019-10-30 14:02:20.709832172,1822691,T,IEX,129.150000,144
2019-10-30 14:03:40.207706880,2019-10-30 14:03:40.207686962,1881592,T,IEX,129.065000,100
2019-10-30 14:04:04.824335872,2019-10-30 14:04:04.824320264,1985516,T,IEX,128.790000,100
2019-10-30 14:04:32.725251072,2019-10-30 14:04:32.725122378,2127552,T,IEX,128.980000,200
2019-10-30 14:04:40.211593984,2019-10-30 14:04:40.211573759,2156323,T,IEX,128.945000,300
2019-10-30 14:04:44.718007040,2019-10-30 14:04:44.717989619,2168706,T,IEX,128.920000,200
2019-10-30 14:05:13.304500992,2019-10-30 14:05:13.304479321,2231020,T,IEX,129.050000,100
2019-10-30 14:06:11.268171008,2019-10-30 14:06:11.268150655,2318007,T,IEX,129.015000,200
2019-10-30 14:06:17.508520960,2019-10-30 14:06:17.508501945,2326773,T,IEX,129.015000,200
2019-10-30 14:06:40.208679936,2019-10-30 14:06:40.208660900,2353788,T,IEX,129.015000,300
2019-10-30 14:06:49.772371968,2019-10-30 14:06:49.772351046,2367863,T,IEX,128.970000,22
2019-10-30 14:06:49.772592128,2019-10-30 14:06:49.772572842,2367873,T,IEX,128.970000,37
2019-10-30 14:06:49.773007872,2019-10-30 14:06:49.772988397,2367888,T,IEX,128.970000,41
2019-10-30 14:06:50.145731072,2019-10-30 14:06:50.145711281,2369555,T,IEX,128.960000,100
2019-10-30 14:06:59.492235008,2019-10-30 14:06:59.492218770,2378933,T,IEX,128.970000,200
2019-10-30 14:07:01.738562048,2019-10-30 14:07:01.738542059,2382003,T,IEX,128.970000,100
2019-10-30 14:07:11.904794112,2019-10-30 14:07:11.904770410,2396839,T,IEX,129.005000,1
2019-10-30 14:08:16.850772992,2019-10-30 14:08:16.850752336,2461057,T,IEX,129.040000,100
2019-10-30 14:08:40.208786944,2019-10-30 14:08:40.208767814,2482653,T,IEX,129.040000,100
2019-10-30 14:09:26.804296960,2019-10-30 14:09:26.804279648,2526156,T,IEX,129.055000,200
2019-10-30 14:09:30.120648960,2019-10-30 14:09:30.120629504,2529114,T,IEX,129.060000,100
2019-10-30 14:10:35.829786880,2019-10-30 14:10:35.829768830,2584626,T,IEX,129.020000,100
2019-10-30 14:10:41.50010112,2019-10-30 14:10:41.49992205,2589294,T,IEX,129.015000,100
2019-10-30 14:13:50.798903040,2019-10-30 14:13:50.798882509,2724267,T,IEX,128.955000,100
2019-10-30 14:14:20.28551936,2019-10-30 14:14:20.28530837,2751788,T,IEX,128.990000,100
2019-10-30 14:14:29.707072000,2019-10-30 14:14:29.707049613,2758274,T,IEX,129.080000,100
2019-10-30 14:15:57.594689024,2019-10-30 14:15:57.594670244,2825283,T,IEX,129.040000,300
2019-10-30 14:16:05.227030016,2019-10-30 14:16:05.227008303,2830781,T,IEX,129.010000,200
2019-10-30 14:16:09.506718976,2019-10-30 14:16:09.506700369,2834757,T,IEX,129.025000,100
2019-10-30 14:18:59.110170112,2019-10-30 14:18:59.110150097,2950976,T,IEX,129.015000,100
2019-10-30 14:19:48.244283904,2019-10-30 14:19:48.244264068,2987421,T,IEX,128.980000,100
2019-10-30 14:19:53.636636928,2019-10-30 14:19:53.636619746,2991684,T,IEX,128.950000,200
2019-10-30 14:20:33.431058944,2019-10-30 14:20:33.431038134,3017577,T,IEX,128.900000,100
2019-10-30 14:20:40.210348032,2019-10-30 14:20:40.210325735,3021409,T,IEX,128.900000,100
2019-10-30 14:20:59.108579072,2019-10-30 14:20:59.108563682,3031987,T,IEX,128.945000,100
2019-10-30 14:22:56.718793984,2019-10-30 14:22:56.718774834,3105912,T,IEX,128.930000,100
2019-10-30 14:23:40.210061056,2019-10-30 14:23:40.210042471,3133423,T,IEX,128.945000,100
2019-10-30 14:23:58.883203072,2019-10-30 14:23:58.883185302,3144128,T,IEX,128.940000,100
2019-10-30 14:24:06.375143936,2019-10-30 14:24:06.375123453,3149975,T,IEX,128.940000,100
2019-10-30 14:24:32.22242048,2019-10-30 14:24:32.22222379,3168267,T,IEX,128.955000,200
2019-10-30 14:25:16.214578944,2019-10-30 14:25:16.214558266,3195976,T,IEX,129.015000,100
2019-10-30 14:25:53.850479104,2019-10-30 14:25:53.850456365,3220461,T,IEX,128.910000,200
2019-10-30 14:26:51.401884928,2019-10-30 14:26:51.401865304,3257606,T,IEX,128.940000,100
2019-10-30 14:27:02.233746944,2019-10-30 14:27:02.233728911,3267616,T,IEX,128.940000,200
2019-10-30 14:27:02.235468032,2019-10-30 14:27:02.235449520,3267640,T,IEX,128.940000,300
2019-10-30 14:27:02.235493120,2019-10-30 14:27:02.235475035,3267641,T,IEX,128.940000,200
2019-10-30 14:27:28.171237120,2019-10-30 14:27:28.171218575,3288228,T,IEX,128.935000,100
2019-10-30 14:27:41.879859968,2019-10-30 14:27:41.879839551,3297137,T,IEX,128.945000,10
2019-10-30 14:27:49.803453952,2019-10-30 14:27:49.803436979,3302013,T,IEX,128.955000,100
2019-10-30 14:28:12.168685056,2019-10-30 14:28:12.168663366,3318097,T,IEX,128.930000,260
2019-10-30 14:29:13.540624896,2019-10-30 14:29:13.540607896,3359390,T,IEX,128.900000,100
2019-10-30 14:30:57.67729920,2019-10-30 14:30:57.67710316,3439973,T,IEX,128.930000,100
2019-10-30 14:31:32.223280128,2019-10-30 14:31:32.223259898,3470059,T,IEX,128.925000,100
2019-10-30 14:32:33.361202944,2019-10-30 14:32:33.361180180,3513635,T,IEX,128.830000,100
2019-10-30 14:32:36.981310976,2019-10-30 14:32:36.981290238,3516851,T,IEX,128.795000,200
2019-10-30 14:33:03.843405056,2019-10-30 14:33:03.843386906,3534774,T,IEX,128.770000,100
2019-10-30 14:33:17.922603008,2019-10-30 14:33:17.922581651,3544808,T,IEX,128.750000,200
2019-10-30 14:33:17.962562048,2019-10-30 14:33:17.962542848,3544819,T,IEX,128.770000,10
2019-10-30 14:34:14.777691904,2019-10-30 14:34:14.777672682,3576442,T,IEX,128.790000,1
2019-10-30 14:34:40.209556992,2019-10-30 14:34:40.209539579,3594179,T,IEX,128.800000,100
2019-10-30 14:34:43.453099008,2019-10-30 14:34:43.453079636,3596006,T,IEX,128.790000,100
2019-10-30 14:35:02.870228992,2019-10-30 14:35:02.870208287,3608451,T,IEX,128.750000,400
2019-10-30 14:35:58.824552960,2019-10-30 14:35:58.824532422,3654542,T,IEX,128.790000,1
2019-10-30 14:36:05.247936000,2019-10-30 14:36:05.247917374,3659663,T,IEX,128.810000,100
2019-10-30 14:36:20.805544960,2019-10-30 14:36:20.805524001,3669953,T,IEX,128.840000,100
2019-10-30 14:36:27.122280960,2019-10-30 14:36:27.122258839,3678402,T,IEX,128.890000,100
2019-10-30 14:36:40.209433088,2019-10-30 14:36:40.209411039,3689319,T,IEX,128.845000,100
2019-10-30 14:36:44.237745920,2019-10-30 14:36:44.237726884,3692760,T,IEX,128.845000,200
2019-10-30 14:36:44.237764096,2019-10-30 14:36:44.237746040,3692761,T,IEX,128.845000,100
2019-10-30 14:36:59.108377088,2019-10-30 14:36:59.108357167,3702936,T,IEX,128.825000,200
2019-10-30 14:37:47.767375872,2019-10-30 14:37:47.767356144,3738504,T,IEX,128.890000,100
2019-10-30 14:38:07.673778944,2019-10-30 14:38:07.673758922,3749744,T,IEX,128.880000,200
2019-10-30 14:38:15.903787008,2019-10-30 14:38:15.903769293,3756339,T,IEX,128.875000,200
2019-10-30 14:38:36.618302976,2019-10-30 14:38:36.618280506,3770091,T,IEX,128.845000,200
2019-10-30 14:39:11.557624064,2019-10-30 14:39:11.557604258,3795002,T,IEX,128.830000,50
2019-10-30 14:39:16.150844928,2019-10-30 14:39:16.150823501,3798931,T,IEX,128.820000,100
2019-10-30 14:39:16.577186048,2019-10-30 14:39:16.577165419,3799304,T,IEX,128.820000,100
2019-10-30 14:39:19.765212928,2019-10-30 14:39:19.765192227,3801085,T,IEX,128.830000,50
2019-10-30 14:39:21.162298112,2019-10-30 14:39:21.162280923,3802295,T,IEX,128.860000,100
2019-10-30 14:39:29.150543872,2019-10-30 14:39:29.150525740,3807894,T,IEX,128.865000,300
2019-10-30 14:39:32.226412032,2019-10-30 14:39:32.226387426,3809849,T,IEX,128.865000,200
2019-10-30 14:39:32.326524928,2019-10-30 14:39:32.326505490,3809890,T,IEX,128.865000,100
2019-10-30 14:41:15.536396032,2019-10-30 14:41:15.536373021,3879333,T,IEX,128.950000,200
2019-10-30 14:42:17.288452096,2019-10-30 14:42:17.288432522,3916772,T,IEX,128.980000,100
2019-10-30 14:42:17.288476928,2019-10-30 14:42:17.288458724,3916773,T,IEX,128.980000,100
2019-10-30 14:42:17.290554112,2019-10-30 14:42:17.290531849,3916776,T,IEX,128.980000,100
2019-10-30 14:44:00.308258048,2019-10-30 14:44:00.308239768,3979626,T,IEX,129.060000,41
2019-10-30 14:44:00.984079104,2019-10-30 14:44:00.984057731,3981496,T,IEX,129.070000,59
2019-10-30 14:44:21.429910016,2019-10-30 14:44:21.429889724,3995885,T,IEX,129.055000,10
2019-10-30 14:46:21.128195072,2019-10-30 14:46:21.128173406,4073069,T,IEX,129.165000,100
2019-10-30 14:47:27.857285888,2019-10-30 14:47:27.857268067,4113696,T,IEX,129.170000,10
2019-10-30 14:48:21.604570112,2019-10-30 14:48:21.604549698,4147202,T,IEX,129.130000,10
2019-10-30 14:52:08.184819968,2019-10-30 14:52:08.184798923,4282989,T,IEX,129.325000,38
2019-10-30 14:52:24.589329920,2019-10-30 14:52:24.589309767,4292752,T,IEX,129.360000,10
2019-10-30 14:52:30.188766976,2019-10-30 14:52:30.188747474,4295111,T,IEX,129.380000,100
2019-10-30 14:52:32.718539008,2019-10-30 14:52:32.718520608,4297235,T,IEX,129.380000,200
2019-10-30 14:52:32.787195904,2019-10-30 14:52:32.787177543,4297336,T,IEX,129.380000,100
2019-10-30 14:53:47.283913984,2019-10-30 14:53:47.283892789,4340578,T,IEX,129.470000,100
2019-10-30 14:53:48.294065920,2019-10-30 14:53:48.294044713,4340910,T,IEX,129.485000,100
2019-10-30 14:56:05.958202880,2019-10-30 14:56:05.958182980,4423858,T,IEX,129.555000,100
2019-10-30 14:56:42.416591872,2019-10-30 14:56:42.416571019,4445303,T,IEX,129.560000,100
2019-10-30 14:56:59.583182080,2019-10-30 14:56:59.583161821,4453785,T,IEX,129.625000,100
2019-10-30 14:57:03.773049088,2019-10-30 14:57:03.773027669,4456485,T,IEX,129.645000,100
2019-10-30 14:57:59.96396032,2019-10-30 14:57:59.96378326,4491597,T,IEX,129.700000,5
2019-10-30 14:58:03.370112000,2019-10-30 14:58:03.370092728,4494128,T,IEX,129.640000,100
2019-10-30 14:58:30.941039104,2019-10-30 14:58:30.941021329,4510159,T,IEX,129.580000,100
2019-10-30 15:04:28.312043008,2019-10-30 15:04:28.312025786,4736536,T,IEX,129.670000,37
2019-10-30 15:05:38.510137088,2019-10-30 15:05:38.510116987,4778449,T,IEX,129.685000,500
2019-10-30 15:05:55.343243008,2019-10-30 15:05:55.343220192,4786479,T,IEX,129.670000,100
2019-10-30 15:06:04.279054080,2019-10-30 15:06:04.279036151,4791968,T,IEX,129.670000,94
2019-10-30 15:06:05.601605120,2019-10-30 15:06:05.601585755,4792542,T,IEX,129.670000,6
2019-10-30 15:06:18.25114112,2019-10-30 15:06:18.25096342,4800593,T,IEX,129.600000,100
2019-10-30 15:06:18.630599936,2019-10-30 15:06:18.630578731,4800859,T,IEX,129.600000,100
2019-10-30 15:08:40.26045952,2019-10-30 15:08:40.26027106,4882058,T,IEX,129.665000,100
2019-10-30 15:09:19.41502976,2019-10-30 15:09:19.41481313,4900709,T,IEX,129.690000,100
2019-10-30 15:09:19.41515008,2019-10-30 15:09:19.41498603,4900710,T,IEX,129.690000,100
2019-10-30 15:09:19.41534976,2019-10-30 15:09:19.41518938,4900711,T,IEX,129.690000,200
2019-10-30 15:09:19.41552896,2019-10-30 15:09:19.41536650,4900712,T,IEX,129.690000,400
2019-10-30 15:09:20.69478912,2019-10-30 15:09:20.69451066,4901095,T,IEX,129.690000,100
2019-10-30 15:10:39.650511104,2019-10-30 15:10:39.650488187,4939561,T,IEX,129.725000,100
2019-10-30 15:11:12.708044032,2019-10-30 15:11:12.708026741,4954198,T,IEX,129.700000,100
2019-10-30 15:11:24.122678016,2019-10-30 15:11:24.122661448,4961803,T,IEX,129.670000,100
2019-10-30 15:13:43.121743872,2019-10-30 15:13:43.121725368,5031040,T,IEX,129.715000,100
2019-10-30 15:22:58.866526976,2019-10-30 15:22:58.866506832,5346788,T,IEX,129.565000,100
2019-10-30 15:24:24.15587072,2019-10-30 15:24:24.15564555,5391713,T,IEX,129.585000,100
2019-10-30 15:28:01.544753920,2019-10-30 15:28:01.544734112,5511467,T,IEX,129.490000,100
2019-10-30 15:30:12.386608896,2019-10-30 15:30:12.386590257,5582452,T,IEX,129.605000,100
2019-10-30 15:31:21.882928128,2019-10-30 15:31:21.882908834,5622259,T,IEX,129.500000,23
2019-10-30 15:34:17.497782016,2019-10-30 15:34:17.497761946,5725577,T,IEX,129.600000,400
2019-10-30 15:34:32.799085056,2019-10-30 15:34:32.799064553,5732615,T,IEX,129.600000,300
2019-10-30 15:37:37.384186112,2019-10-30 15:37:37.384164012,5832924,T,IEX,129.700000,100
2019-10-30 15:38:06.900793088,2019-10-30 15:38:06.900773153,5846046,T,IEX,129.690000,29
2019-10-30 15:39:36.826804992,2019-10-30 15:39:36.826788074,5898382,T,IEX,129.700000,1
2019-10-30 15:39:44.270447104,2019-10-30 15:39:44.270427609,5901919,T,IEX,129.690000,100
2019-10-30 15:39:59.659496960,2019-10-30 15:39:59.659475639,5908758,T,IEX,129.665000,100
2019-10-30 15:42:04.925925120,2019-10-30 15:42:04.925905604,5986073,T,IEX,129.570000,100
2019-10-30 15:42:32.194616064,2019-10-30 15:42:32.194596382,6001993,T,IEX,129.535000,100
2019-10-30 15:43:21.379111936,2019-10-30 15:43:21.379090353,6032241,T,IEX,129.605000,100
2019-10-30 15:44:05.999416064,2019-10-30 15:44:05.999393496,6060051,T,IEX,129.610000,100
2019-10-30 15:45:47.81208064,2019-10-30 15:45:47.81187117,6115849,T,IEX,129.570000,100
2019-10-30 15:45:47.82174976,2019-10-30 15:45:47.82155491,6115850,T,IEX,129.570000,100
2019-10-30 15:45:48.668325120,2019-10-30 15:45:48.668304359,6116450,T,IEX,129.570000,100
2019-10-30 15:49:49.606813952,2019-10-30 15:49:49.606795775,6245927,T,IEX,129.540000,100
2019-10-30 15:51:03.709182976,2019-10-30 15:51:03.709163733,6285638,T,IEX,129.600000,100
2019-10-30 15:53:19.639162112,2019-10-30 15:53:19.639141791,6357975,T,IEX,129.630000,100
2019-10-30 15:53:21.507160064,2019-10-30 15:53:21.507141141,6359071,T,IEX,129.620000,100
2019-10-30 15:53:29.429270016,2019-10-30 15:53:29.429249331,6364057,T,IEX,129.590000,100
2019-10-30 15:53:29.429286912,2019-10-30 15:53:29.429269655,6364058,T,IEX,129.580000,100
2019-10-30 15:53:29.429306112,2019-10-30 15:53:29.429289484,6364059,T,IEX,129.580000,100
2019-10-30 15:54:30.269561088,2019-10-30 15:54:30.269539771,6393739,T,IEX,129.595000,100
2019-10-30 15:54:30.272922112,2019-10-30 15:54:30.272902115,6393740,T,IEX,129.595000,200
2019-10-30 15:57:09.370959104,2019-10-30 15:57:09.370939584,6479355,T,IEX,129.655000,100
2019-10-30 15:58:15.532499968,2019-10-30 15:58:15.532478943,6515130,T,IEX,129.735000,100
2019-10-30 16:00:16.209323008,2019-10-30 16:00:16.209305499,6577428,T,IEX,129.835000,100
2019-10-30 16:03:33.404691968,2019-10-30 16:03:33.404670961,6698655,T,IEX,129.840000,19
2019-10-30 16:04:40.292631040,2019-10-30 16:04:40.292608103,6729966,T,IEX,129.880000,300
2019-10-30 16:12:15.598468096,2019-10-30 16:12:15.598451546,6963623,T,IEX,129.920000,100
2019-10-30 16:12:46.994272000,2019-10-30 16:12:46.994255993,6976530,T,IEX,129.940000,200
2019-10-30 16:13:43.844241920,2019-10-30 16:13:43.844223167,7001987,T,IEX,130.000000,37
2019-10-30 16:13:43.844315904,2019-10-30 16:13:43.844298797,7001989,T,IEX,130.000000,19
2019-10-30 16:13:43.844352000,2019-10-30 16:13:43.844334940,7001990,T,IEX,130.000000,37
2019-10-30 16:13:43.844391936,2019-10-30 16:13:43.844374791,7001991,T,IEX,130.000000,7
2019-10-30 16:16:37.337561088,2019-10-30 16:16:37.337540020,7088543,T,IEX,129.990000,100
2019-10-30 16:17:56.811826944,2019-10-30 16:17:56.811805645,7121785,T,IEX,130.100000,100
2019-10-30 16:20:56.174201088,2019-10-30 16:20:56.174180472,7204215,T,IEX,130.210000,500
2019-10-30 16:21:28.121000960,2019-10-30 16:21:28.120979893,7218952,T,IEX,130.180000,100
2019-10-30 16:21:28.121248000,2019-10-30 16:21:28.121230556,7218954,T,IEX,130.180000,100
2019-10-30 16:26:24.434381056,2019-10-30 16:26:24.434358570,7343805,T,IEX,130.225000,100
2019-10-30 16:27:16.469306112,2019-10-30 16:27:16.469284734,7371853,T,IEX,130.190000,100
2019-10-30 16:32:40.789552896,2019-10-30 16:32:40.789532911,7522022,T,IEX,130.150000,700
2019-10-30 16:33:24.388560896,2019-10-30 16:33:24.388538859,7538832,T,IEX,130.190000,80
2019-10-30 16:33:38.861242880,2019-10-30 16:33:38.861226932,7545466,T,IEX,130.150000,100
2019-10-30 16:35:23.748553984,2019-10-30 16:35:23.748533206,7593561,T,IEX,130.095000,100
2019-10-30 16:36:32.850452992,2019-10-30 16:36:32.850432244,7618516,T,IEX,130.100000,100
2019-10-30 16:36:43.713639936,2019-10-30 16:36:43.713620035,7622314,T,IEX,130.085000,100
2019-10-30 16:49:56.574940928,2019-10-30 16:49:56.574920988,7910045,T,IEX,130.050000,400
2019-10-30 16:49:56.577820928,2019-10-30 16:49:56.577800802,7910046,T,IEX,130.050000,300
2019-10-30 16:49:56.578725120,2019-10-30 16:49:56.578705134,7910049,T,IEX,130.050000,500
2019-10-30 16:49:57.140472064,2019-10-30 16:49:57.140454376,7910332,T,IEX,130.050000,500
2019-10-30 16:49:57.141443072,2019-10-30 16:49:57.141423854,7910333,T,IEX,130.050000,500
2019-10-30 16:49:57.142394880,2019-10-30 16:49:57.142376055,7910334,T,IEX,130.050000,100
2019-10-30 16:50:15.302430976,2019-10-30 16:50:15.302410265,7916446,T,IEX,130.055000,100
2019-10-30 16:50:55.153558016,2019-10-30 16:50:55.153540100,7928149,T,IEX,130.010000,100
2019-10-30 16:51:26.60449024,2019-10-30 16:51:26.60428773,7940138,T,IEX,129.980000,300
2019-10-30 16:52:15.682781952,2019-10-30 16:52:15.682763551,7956177,T,IEX,129.970000,100
2019-10-30 16:52:29.292912896,2019-10-30 16:52:29.292891543,7962332,T,IEX,129.920000,100
2019-10-30 16:52:29.292928000,2019-10-30 16:52:29.292911357,7962333,T,IEX,129.920000,100
2019-10-30 16:54:12.723636992,2019-10-30 16:54:12.723619029,7997286,T,IEX,129.890000,61
2019-10-30 16:54:12.724462080,2019-10-30 16:54:12.724445695,7997289,T,IEX,129.890000,39
2019-10-30 16:59:28.609657088,2019-10-30 16:59:28.609635717,8107426,T,IEX,129.830000,100
2019-10-30 17:02:30.889027072,2019-10-30 17:02:30.889005951,8175648,T,IEX,129.865000,100
2019-10-30 17:03:30.130808064,2019-10-30 17:03:30.130789171,8200442,T,IEX,129.880000,100
2019-10-30 17:04:24.858064896,2019-10-30 17:04:24.858044594,8219201,T,IEX,129.890000,100
2019-10-30 17:04:32.731431936,2019-10-30 17:04:32.731410443,8222222,T,IEX,129.930000,100
2019-10-30 17:05:36.48960000,2019-10-30 17:05:36.48943176,8243474,T,IEX,129.910000,24
2019-10-30 17:06:19.133158912,2019-10-30 17:06:19.133141308,8262483,T,IEX,129.880000,74
2019-10-30 17:06:52.673914112,2019-10-30 17:06:52.673894592,8277528,T,IEX,129.840000,100
2019-10-30 17:06:52.674743040,2019-10-30 17:06:52.674722175,8277530,T,IEX,129.840000,100
2019-10-30 17:07:07.469671936,2019-10-30 17:07:07.469653148,8283182,T,IEX,129.870000,100
2019-10-30 17:07:59.37765888,2019-10-30 17:07:59.37745127,8298399,T,IEX,129.880000,300
2019-10-30 17:07:59.37779968,2019-10-30 17:07:59.37763981,8298400,T,IEX,129.880000,100
2019-10-30 17:07:59.38893056,2019-10-30 17:07:59.38875263,8298402,T,IEX,129.880000,100
2019-10-30 17:07:59.40628992,2019-10-30 17:07:59.40606927,8298404,T,IEX,129.880000,100
2019-10-30 17:07:59.667742976,2019-10-30 17:07:59.667722331,8298547,T,IEX,129.880000,100
2019-10-30 17:09:58.2494976,2019-10-30 17:09:58.2477099,8336689,T,IEX,129.870000,100
2019-10-30 17:09:58.41835008,2019-10-30 17:09:58.41813930,8336701,T,IEX,129.850000,100
2019-10-30 17:09:58.42857984,2019-10-30 17:09:58.42836428,8336702,T,IEX,129.850000,100
2019-10-30 17:09:58.42864128,2019-10-30 17:09:58.42846082,8336703,T,IEX,129.850000,100
2019-10-30 17:09:58.42878976,2019-10-30 17:09:58.42860192,8336704,T,IEX,129.850000,100
2019-10-30 17:10:26.53411072,2019-10-30 17:10:26.53389922,8347836,T,IEX,129.835000,100
2019-10-30 17:15:01.995425024,2019-10-30 17:15:01.995404798,8434729,T,IEX,129.870000,406
2019-10-30 17:16:21.938757120,2019-10-30 17:16:21.938733539,8459075,T,IEX,129.880000,100
2019-10-30 17:17:14.334696960,2019-10-30 17:17:14.334678671,8475391,T,IEX,129.810000,100
2019-10-30 17:17:14.334716928,2019-10-30 17:17:14.334697508,8475392,T,IEX,129.810000,100
2019-10-30 17:17:14.334735104,2019-10-30 17:17:14.334711422,8475394,T,IEX,129.810000,100
2019-10-30 17:17:14.334754048,2019-10-30 17:17:14.334734687,8475396,T,IEX,129.810000,100
2019-10-30 17:17:14.334761984,2019-10-30 17:17:14.334741645,8475397,T,IEX,129.810000,100
2019-10-30 17:17:14.334771968,2019-10-30 17:17:14.334754585,8475398,T,IEX,129.810000,100
2019-10-30 17:17:22.41888000,2019-10-30 17:17:22.41870669,8479015,T,IEX,129.810000,100
2019-10-30 17:21:41.568252928,2019-10-30 17:21:41.568229858,8557611,T,IEX,129.850000,100
2019-10-30 17:21:41.568265984,2019-10-30 17:21:41.568249460,8557612,T,IEX,129.850000,100
2019-10-30 17:23:17.256402944,2019-10-30 17:23:17.256380734,8584521,T,IEX,129.865000,100
2019-10-30 17:24:42.465805056,2019-10-30 17:24:42.465787653,8612963,T,IEX,129.855000,100
2019-10-30 17:28:46.569794048,2019-10-30 17:28:46.569772680,8697094,T,IEX,129.760000,100
2019-10-30 17:29:47.330522112,2019-10-30 17:29:47.330503694,8716688,T,IEX,129.720000,100
2019-10-30 17:33:13.61073920,2019-10-30 17:33:13.61057055,8782255,T,IEX,129.670000,100
2019-10-30 17:33:13.61089024,2019-10-30 17:33:13.61072465,8782256,T,IEX,129.670000,100
2019-10-30 17:33:13.61102080,2019-10-30 17:33:13.61085484,8782257,T,IEX,129.670000,100
2019-10-30 17:33:13.61122048,2019-10-30 17:33:13.61104963,8782258,T,IEX,129.670000,100
2019-10-30 17:43:00.567662080,2019-10-30 17:43:00.567645230,8979485,T,IEX,129.565000,300
2019-10-30 17:43:00.994615040,2019-10-30 17:43:00.994593638,8979652,T,IEX,129.565000,200
2019-10-30 17:45:41.193189120,2019-10-30 17:45:41.193167272,9033214,T,IEX,129.490000,1
2019-10-30 17:45:41.193202944,2019-10-30 17:45:41.193186303,9033215,T,IEX,129.490000,6
2019-10-30 17:51:04.241250048,2019-10-30 17:51:04.241228134,9220199,T,IEX,129.405000,100
2019-10-30 17:51:22.781632000,2019-10-30 17:51:22.781612103,9228429,T,IEX,129.435000,100
2019-10-30 17:52:16.275688960,2019-10-30 17:52:16.275669768,9247459,T,IEX,129.385000,100
2019-10-30 17:53:24.871148032,2019-10-30 17:53:24.871120308,9276505,T,IEX,129.440000,100
2019-10-30 17:55:00.919973888,2019-10-30 17:55:00.919952639,9317242,T,IEX,129.390000,300
2019-10-30 17:55:18.665373952,2019-10-30 17:55:18.665357641,9323808,T,IEX,129.370000,100
2019-10-30 17:55:57.120836096,2019-10-30 17:55:57.120814952,9348816,T,IEX,129.310000,47
2019-10-30 17:55:57.120851968,2019-10-30 17:55:57.120834909,9348817,T,IEX,129.310000,53
2019-10-30 17:55:58.543176960,2019-10-30 17:55:58.543156285,9349301,T,IEX,129.310000,100
2019-10-30 17:55:59.987812096,2019-10-30 17:55:59.987790489,9349747,T,IEX,129.310000,100
2019-10-30 17:56:01.423745024,2019-10-30 17:56:01.423726880,9350777,T,IEX,129.310000,100
2019-10-30 17:56:01.427642880,2019-10-30 17:56:01.427624685,9350783,T,IEX,129.310000,100
2019-10-30 17:56:05.735266048,2019-10-30 17:56:05.735246360,9352396,T,IEX,129.310000,100
2019-10-30 17:56:25.213412096,2019-10-30 17:56:25.213390129,9360150,T,IEX,129.330000,100
2019-10-30 17:56:35.627827968,2019-10-30 17:56:35.627810165,9363532,T,IEX,129.330000,100
2019-10-30 17:56:55.775133952,2019-10-30 17:56:55.775113151,9370853,T,IEX,129.330000,100
2019-10-30 17:57:11.60638976,2019-10-30 17:57:11.60617941,9377555,T,IEX,129.270000,100
2019-10-30 17:58:25.79153920,2019-10-30 17:58:25.79133464,9405109,T,IEX,129.270000,46
2019-10-30 17:59:03.709510912,2019-10-30 17:59:03.709490810,9427527,T,IEX,129.300000,300
2019-10-30 17:59:07.865948928,2019-10-30 17:59:07.865928240,9429592,T,IEX,129.270000,37
2019-10-30 17:59:24.432733952,2019-10-30 17:59:24.432712193,9437205,T,IEX,129.260000,100
2019-10-30 17:59:25.848153088,2019-10-30 17:59:25.848136939,9438185,T,IEX,129.260000,100
2019-10-30 17:59:42.559532032,2019-10-30 17:59:42.559515523,9446137,T,IEX,129.270000,41
2019-10-30 18:01:06.688143104,2019-10-30 18:01:06.688125056,9573686,T,IEX,129.130000,100
2019-10-30 18:01:09.908453888,2019-10-30 18:01:09.908433596,9579993,T,IEX,129.250000,100
2019-10-30 18:02:36.824296960,2019-10-30 18:02:36.824276077,9688748,T,IEX,129.290000,100
2019-10-30 18:02:38.69358080,2019-10-30 18:02:38.69337560,9690192,T,IEX,129.290000,38
2019-10-30 18:03:34.261425920,2019-10-30 18:03:34.261405749,9739142,T,IEX,129.250000,100
2019-10-30 18:08:04.744902912,2019-10-30 18:08:04.744884076,9956087,T,IEX,129.480000,8
2019-10-30 18:08:04.745067008,2019-10-30 18:08:04.745048388,9956090,T,IEX,129.480000,82
2019-10-30 18:08:04.745103104,2019-10-30 18:08:04.745085497,9956091,T,IEX,129.480000,10
2019-10-30 18:09:50.721465088,2019-10-30 18:09:50.721446611,10026012,T,IEX,129.550000,100
2019-10-30 18:11:06.945693952,2019-10-30 18:11:06.945672482,10102619,T,IEX,129.615000,100
2019-10-30 18:11:32.149342976,2019-10-30 18:11:32.149323344,10122724,T,IEX,129.605000,100
2019-10-30 18:11:32.149556992,2019-10-30 18:11:32.149540070,10122725,T,IEX,129.580000,100
2019-10-30 18:11:32.149743104,2019-10-30 18:11:32.149718987,10122728,T,IEX,129.580000,37
2019-10-30 18:11:32.149880064,2019-10-30 18:11:32.149863451,10122730,T,IEX,129.580000,37
2019-10-30 18:11:32.150053120,2019-10-30 18:11:32.150035272,10122733,T,IEX,129.580000,37
2019-10-30 18:11:32.150162944,2019-10-30 18:11:32.150145447,10122735,T,IEX,129.580000,72
2019-10-30 18:11:32.150208000,2019-10-30 18:11:32.150191338,10122736,T,IEX,129.580000,17
2019-10-30 18:11:32.150219008,2019-10-30 18:11:32.150202581,10122737,T,IEX,129.580000,44
2019-10-30 18:11:32.150355968,2019-10-30 18:11:32.150339357,10122738,T,IEX,129.580000,11
2019-10-30 18:19:57.661327104,2019-10-30 18:19:57.661306196,10477084,T,IEX,129.475000,100
2019-10-30 18:24:39.595392000,2019-10-30 18:24:39.595370972,10635126,T,IEX,129.510000,10
2019-10-30 18:24:39.820226048,2019-10-30 18:24:39.820210003,10635386,T,IEX,129.525000,100
2019-10-30 18:24:40.863240960,2019-10-30 18:24:40.863220809,10636301,T,IEX,129.525000,100
2019-10-30 18:24:43.744350976,2019-10-30 18:24:43.744334685,10638060,T,IEX,129.510000,100
2019-10-30 18:24:50.595586048,2019-10-30 18:24:50.595565681,10643259,T,IEX,129.550000,100
2019-10-30 18:26:29.532845056,2019-10-30 18:26:29.532818690,10698901,T,IEX,129.490000,100
2019-10-30 18:27:20.797227008,2019-10-30 18:27:20.797207673,10723425,T,IEX,129.430000,40
2019-10-30 18:28:25.411512064,2019-10-30 18:28:25.411492070,10757122,T,IEX,129.440000,56
2019-10-30 18:30:01.492963072,2019-10-30 18:30:01.492945445,10801407,T,IEX,129.420000,10
2019-10-30 18:30:02.193475072,2019-10-30 18:30:02.193456140,10801778,T,IEX,129.460000,37
2019-10-30 18:30:02.193660928,2019-10-30 18:30:02.193643327,10801781,T,IEX,129.460000,30
2019-10-30 18:30:25.588990976,2019-10-30 18:30:25.588969988,10812415,T,IEX,129.490000,100
2019-10-30 18:30:29.412491008,2019-10-30 18:30:29.412467040,10814522,T,IEX,129.490000,200
2019-10-30 18:30:47.918251008,2019-10-30 18:30:47.918227898,10825988,T,IEX,129.480000,100
2019-10-30 18:31:01.67200000,2019-10-30 18:31:01.67169609,10836908,T,IEX,129.490000,100
2019-10-30 18:31:04.821766912,2019-10-30 18:31:04.821747996,10842006,T,IEX,129.480000,200
2019-10-30 18:32:22.541519104,2019-10-30 18:32:22.541497892,10917832,T,IEX,129.430000,100
2019-10-30 18:33:17.595072000,2019-10-30 18:33:17.595047756,10950685,T,IEX,129.430000,100
2019-10-30 18:34:22.78927104,2019-10-30 18:34:22.78909530,11038494,T,IEX,129.305000,100
2019-10-30 18:34:52.504711936,2019-10-30 18:34:52.504691846,11072570,T,IEX,129.350000,100
2019-10-30 18:36:01.140912128,2019-10-30 18:36:01.140891906,11147146,T,IEX,129.355000,100
2019-10-30 18:37:45.742395904,2019-10-30 18:37:45.742377689,11253281,T,IEX,129.335000,100
2019-10-30 18:38:44.43385088,2019-10-30 18:38:44.43367077,11308974,T,IEX,129.380000,100
2019-10-30 18:41:14.54490112,2019-10-30 18:41:14.54471267,11489978,T,IEX,129.400000,100
2019-10-30 18:42:02.508709120,2019-10-30 18:42:02.508688990,11533807,T,IEX,129.450000,200
2019-10-30 18:42:35.899401984,2019-10-30 18:42:35.899384653,11558581,T,IEX,129.340000,100
2019-10-30 18:42:35.899420928,2019-10-30 18:42:35.899403313,11558582,T,IEX,129.340000,100
2019-10-30 18:42:35.899437056,2019-10-30 18:42:35.899419141,11558583,T,IEX,129.340000,100
2019-10-30 18:44:41.544492032,2019-10-30 18:44:41.544470487,11676134,T,IEX,129.370000,5
2019-10-30 18:46:57.373122048,2019-10-30 18:46:57.373102761,11773951,T,IEX,129.430000,100
2019-10-30 18:47:15.594522112,2019-10-30 18:47:15.594500680,11786141,T,IEX,129.420000,100
2019-10-30 18:51:42.78956032,2019-10-30 18:51:42.78935572,12028371,T,IEX,129.690000,100
2019-10-30 18:55:16.691979008,2019-10-30 18:55:16.691959205,12239042,T,IEX,129.810000,2
2019-10-30 18:56:34.467515904,2019-10-30 18:56:34.467492841,12309635,T,IEX,129.830000,100
2019-10-30 19:01:53.631873024,2019-10-30 19:01:53.631855339,12562033,T,IEX,129.740000,100
2019-10-30 19:01:53.631982080,2019-10-30 19:01:53.631964326,12562036,T,IEX,129.740000,10
2019-10-30 19:02:26.94443008,2019-10-30 19:02:26.94424234,12586202,T,IEX,129.740000,37
2019-10-30 19:02:26.95667968,2019-10-30 19:02:26.95650415,12586208,T,IEX,129.740000,48
2019-10-30 19:03:16.603309056,2019-10-30 19:03:16.603290377,12626267,T,IEX,129.800000,6
2019-10-30 19:05:05.646671104,2019-10-30 19:05:05.646651033,12699133,T,IEX,129.810000,50
2019-10-30 19:06:25.786641920,2019-10-30 19:06:25.786620286,12745517,T,IEX,129.840000,100
2019-10-30 19:06:28.868443904,2019-10-30 19:06:28.868427700,12746620,T,IEX,129.870000,10
2019-10-30 19:06:33.786246912,2019-10-30 19:06:33.786227900,12748666,T,IEX,129.860000,100
2019-10-30 19:07:01.452997888,2019-10-30 19:07:01.452976646,12766620,T,IEX,129.885000,100
2019-10-30 19:07:05.314747904,2019-10-30 19:07:05.314728185,12770051,T,IEX,129.885000,113
2019-10-30 19:07:06.758627072,2019-10-30 19:07:06.758609033,12771009,T,IEX,129.890000,100
2019-10-30 19:07:51.96633088,2019-10-30 19:07:51.96611943,12807768,T,IEX,129.870000,100
2019-10-30 19:09:20.87851008,2019-10-30 19:09:20.87830545,12870136,T,IEX,129.850000,100
2019-10-30 19:09:30.327303936,2019-10-30 19:09:30.327285378,12876041,T,IEX,129.850000,7
2019-10-30 19:09:59.519147008,2019-10-30 19:09:59.519123548,12891623,T,IEX,129.840000,10
2019-10-30 19:12:07.440730880,2019-10-30 19:12:07.440705522,12971954,T,IEX,129.850000,100
2019-10-30 19:12:07.440847104,2019-10-30 19:12:07.440825036,12971957,T,IEX,129.850000,2
2019-10-30 19:12:28.48466944,2019-10-30 19:12:28.48444540,12989567,T,IEX,129.850000,60
2019-10-30 19:13:28.27475968,2019-10-30 19:13:28.27457143,13029031,T,IEX,129.810000,100
2019-10-30 19:13:34.937870080,2019-10-30 19:13:34.937851500,13032944,T,IEX,129.775000,25
2019-10-30 19:13:36.943265024,2019-10-30 19:13:36.943244332,13034516,T,IEX,129.790000,100
2019-10-30 19:13:42.176190976,2019-10-30 19:13:42.176171114,13037104,T,IEX,129.765000,29
2019-10-30 19:13:44.247371008,2019-10-30 19:13:44.247350102,13039930,T,IEX,129.775000,10
2019-10-30 19:15:02.377165056,2019-10-30 19:15:02.377145390,13082205,T,IEX,129.770000,100
2019-10-30 19:15:02.396796928,2019-10-30 19:15:02.396778755,13082212,T,IEX,129.780000,100
2019-10-30 19:21:48.459383040,2019-10-30 19:21:48.459362012,13333324,T,IEX,129.900000,50
2019-10-30 19:21:51.243101952,2019-10-30 19:21:51.243085433,13334663,T,IEX,129.890000,100
2019-10-30 19:27:02.164460032,2019-10-30 19:27:02.164442020,13606503,T,IEX,129.900000,100
2019-10-30 19:28:29.125783040,2019-10-30 19:28:29.125762896,13660711,T,IEX,129.920000,1
2019-10-30 19:30:41.845259008,2019-10-30 19:30:41.845243110,13747445,T,IEX,129.910000,100
2019-10-30 19:31:15.858875904,2019-10-30 19:31:15.858855987,13768755,T,IEX,129.870000,3
2019-10-30 19:32:31.367186944,2019-10-30 19:32:31.367166172,13826059,T,IEX,129.845000,100
2019-10-30 19:34:04.55186944,2019-10-30 19:34:04.55166348,13884182,T,IEX,129.875000,100
2019-10-30 19:34:44.452905984,2019-10-30 19:34:44.452888635,13910682,T,IEX,129.860000,100
2019-10-30 19:37:39.474852096,2019-10-30 19:37:39.474831666,14011597,T,IEX,129.920000,5
2019-10-30 19:38:58.835875072,2019-10-30 19:38:58.835852460,14059850,T,IEX,129.905000,100
2019-10-30 19:39:04.340552960,2019-10-30 19:39:04.340531388,14064110,T,IEX,129.900000,100
2019-10-30 19:39:28.205624064,2019-10-30 19:39:28.205596821,14081562,T,IEX,129.860000,100
2019-10-30 19:39:28.205806080,2019-10-30 19:39:28.205787019,14081567,T,IEX,129.860000,100
2019-10-30 19:40:39.730167040,2019-10-30 19:40:39.730146539,14128840,T,IEX,129.855000,72
2019-10-30 19:42:20.72827904,2019-10-30 19:42:20.72807969,14190225,T,IEX,129.850000,100
2019-10-30 19:42:34.877741056,2019-10-30 19:42:34.877718220,14198775,T,IEX,129.850000,100
2019-10-30 19:43:09.740229120,2019-10-30 19:43:09.740212492,14224768,T,IEX,129.840000,20
2019-10-30 19:43:22.545539072,2019-10-30 19:43:22.545498939,14231461,T,IEX,129.840000,80
2019-10-30 19:43:22.545559040,2019-10-30 19:43:22.545527164,14231463,T,IEX,129.830000,120
2019-10-30 19:43:22.546285056,2019-10-30 19:43:22.546266854,14231495,T,IEX,129.830000,80
2019-10-30 19:43:25.969206016,2019-10-30 19:43:25.969186254,14234244,T,IEX,129.820000,100
2019-10-30 19:43:44.425245952,2019-10-30 19:43:44.425225927,14245673,T,IEX,129.800000,100
2019-10-30 19:43:44.466396928,2019-10-30 19:43:44.466376004,14245692,T,IEX,129.790000,100
2019-10-30 19:44:03.416903936,2019-10-30 19:44:03.416885345,14258795,T,IEX,129.815000,100
2019-10-30 19:44:05.997862912,2019-10-30 19:44:05.997844393,14260889,T,IEX,129.815000,20
2019-10-30 19:45:51.812049920,2019-10-30 19:45:51.812030928,14331593,T,IEX,129.810000,37
2019-10-30 19:45:54.889417984,2019-10-30 19:45:54.889398429,14333691,T,IEX,129.835000,100
2019-10-30 19:46:00.593285120,2019-10-30 19:46:00.593266176,14339427,T,IEX,129.850000,57
2019-10-30 19:46:00.593296896,2019-10-30 19:46:00.593281224,14339428,T,IEX,129.850000,43
2019-10-30 19:46:11.881835008,2019-10-30 19:46:11.881813381,14347685,T,IEX,129.840000,7
2019-10-30 19:46:20.176121088,2019-10-30 19:46:20.176102879,14352051,T,IEX,129.850000,29
2019-10-30 19:46:20.176139008,2019-10-30 19:46:20.176121610,14352052,T,IEX,129.850000,5
2019-10-30 19:47:08.780350976,2019-10-30 19:47:08.780333077,14389478,T,IEX,129.820000,100
2019-10-30 19:47:08.780731904,2019-10-30 19:47:08.780712686,14389482,T,IEX,129.820000,100
2019-10-30 19:47:49.175268096,2019-10-30 19:47:49.175248094,14420271,T,IEX,129.780000,100
2019-10-30 19:48:12.650263040,2019-10-30 19:48:12.650243087,14438362,T,IEX,129.770000,50
2019-10-30 19:48:44.909774080,2019-10-30 19:48:44.909755175,14463433,T,IEX,129.850000,100
2019-10-30 19:49:01.438624000,2019-10-30 19:49:01.438603344,14477286,T,IEX,129.850000,100
2019-10-30 19:49:01.700041984,2019-10-30 19:49:01.700024889,14477651,T,IEX,129.840000,4
2019-10-30 19:49:09.968503040,2019-10-30 19:49:09.968482964,14486887,T,IEX,129.820000,100
2019-10-30 19:51:11.351140096,2019-10-30 19:51:11.351121971,14604390,T,IEX,129.845000,100
2019-10-30 19:51:18.819077120,2019-10-30 19:51:18.819056276,14611683,T,IEX,129.835000,100
2019-10-30 19:51:40.597988096,2019-10-30 19:51:40.597967950,14628406,T,IEX,129.820000,100
2019-10-30 19:52:03.37383936,2019-10-30 19:52:03.37363960,14646454,T,IEX,129.810000,100
2019-10-30 19:52:06.761575936,2019-10-30 19:52:06.761559868,14650235,T,IEX,129.805000,100
2019-10-30 19:52:06.770012928,2019-10-30 19:52:06.769990619,14650246,T,IEX,129.800000,100
2019-10-30 19:52:33.221216000,2019-10-30 19:52:33.221194532,14673262,T,IEX,129.775000,100
2019-10-30 19:52:44.182091008,2019-10-30 19:52:44.182072922,14681097,T,IEX,129.770000,100
2019-10-30 19:53:05.579849984,2019-10-30 19:53:05.579831976,14698524,T,IEX,129.770000,100
2019-10-30 19:53:58.53492992,2019-10-30 19:53:58.53470103,14743988,T,IEX,129.825000,72
2019-10-30 19:53:59.722327040,2019-10-30 19:53:59.722311375,14746569,T,IEX,129.820000,100
2019-10-30 19:54:00.776930048,2019-10-30 19:54:00.776911241,14754027,T,IEX,129.850000,100
2019-10-30 19:54:04.904733952,2019-10-30 19:54:04.904714384,14761421,T,IEX,129.850000,100
2019-10-30 19:54:50.762188032,2019-10-30 19:54:50.762170829,14809850,T,IEX,129.890000,2
2019-10-30 19:55:01.105544960,2019-10-30 19:55:01.105525832,14825488,T,IEX,129.890000,20
2019-10-30 19:55:01.105560064,2019-10-30 19:55:01.105542931,14825489,T,IEX,129.880000,80
2019-10-30 19:55:01.106117888,2019-10-30 19:55:01.106101041,14825496,T,IEX,129.880000,20
2019-10-30 19:55:01.617860096,2019-10-30 19:55:01.617841513,14826991,T,IEX,129.880000,100
2019-10-30 19:55:43.712413952,2019-10-30 19:55:43.712392488,14879972,T,IEX,129.865000,100
2019-10-30 19:55:45.855480064,2019-10-30 19:55:45.855453900,14881922,T,IEX,129.865000,100
2019-10-30 19:55:51.70176000,2019-10-30 19:55:51.70151438,14886452,T,IEX,129.865000,100
2019-10-30 19:55:51.71166976,2019-10-30 19:55:51.71149966,14886456,T,IEX,129.865000,300
2019-10-30 19:56:00.352869120,2019-10-30 19:56:00.352850037,14895959,T,IEX,129.865000,100
2019-10-30 19:56:00.704598016,2019-10-30 19:56:00.704580857,14896423,T,IEX,129.880000,1
2019-10-30 19:56:15.893626112,2019-10-30 19:56:15.893609807,14914526,T,IEX,129.930000,200
2019-10-30 19:56:17.423299072,2019-10-30 19:56:17.423283080,14915927,T,IEX,129.930000,100
2019-10-30 19:56:22.761005056,2019-10-30 19:56:22.760985778,14921677,T,IEX,129.955000,100
2019-10-30 19:56:22.762733056,2019-10-30 19:56:22.762703904,14921736,T,IEX,129.940000,100
2019-10-30 19:56:25.657734912,2019-10-30 19:56:25.657716040,14925503,T,IEX,129.930000,13
2019-10-30 19:56:27.824295936,2019-10-30 19:56:27.824277549,14927964,T,IEX,129.925000,87
2019-10-30 19:56:55.494059008,2019-10-30 19:56:55.494040699,14957692,T,IEX,129.935000,20
2019-10-30 19:57:00.835938048,2019-10-30 19:57:00.835917530,14964769,T,IEX,129.920000,100
2019-10-30 19:57:02.450476032,2019-10-30 19:57:02.450451900,14967391,T,IEX,129.910000,100
2019-10-30 19:57:05.953594112,2019-10-30 19:57:05.953576339,14972053,T,IEX,129.905000,100
2019-10-30 19:57:07.23266048,2019-10-30 19:57:07.23249673,14973609,T,IEX,129.905000,100
2019-10-30 19:57:47.469065984,2019-10-30 19:57:47.469047473,15027467,T,IEX,129.865000,5
2019-10-30 19:57:49.19707904,2019-10-30 19:57:49.19686160,15029562,T,IEX,129.840000,20
2019-10-30 19:58:08.510187008,2019-10-30 19:58:08.510169937,15056066,T,IEX,129.810000,100
2019-10-30 19:58:20.103707904,2019-10-30 19:58:20.103687516,15071534,T,IEX,129.800000,90
2019-10-30 19:58:36.292762880,2019-10-30 19:58:36.292743682,15092266,T,IEX,129.820000,100
2019-10-30 19:58:40.803879936,2019-10-30 19:58:40.803863417,15098099,T,IEX,129.825000,100
2019-10-30 19:58:41.224816128,2019-10-30 19:58:41.224797901,15098501,T,IEX,129.830000,1
2019-10-30 19:59:06.794950912,2019-10-30 19:59:06.794933456,15137382,T,IEX,129.835000,20
2019-10-30 19:59:07.717719040,2019-10-30 19:59:07.717697477,15139346,T,IEX,129.830000,100
2019-10-30 19:59:07.736304896,2019-10-30 19:59:07.736280559,15139364,T,IEX,129.830000,100
2019-10-30 19:59:16.591111936,2019-10-30 19:59:16.591091162,15155587,T,IEX,129.820000,20
2019-10-30 19:59:21.596069120,2019-10-30 19:59:21.596052342,15162919,T,IEX,129.820000,100
2019-10-30 19:59:29.598562048,2019-10-30 19:59:29.598546005,15175048,T,IEX,129.775000,100
2019-10-30 19:59:36.48716032,2019-10-30 19:59:36.48695145,15211402,T,IEX,129.770000,2
2019-10-30 19:59:40.17193984,2019-10-30 19:59:40.17175385,15234060,T,IEX,129.780000,100
2019-10-30 19:59:45.525701120,2019-10-30 19:59:45.525685797,15264852,T,IEX,129.830000,9
