2019-10-22 13:41:28.615193088,2019-10-22 13:41:28.615175214,778328,T,IEX,268.240000,100
2019-10-22 13:41:28.615222016,2019-10-22 13:41:28.615206713,778329,T,IEX,268.240000,100
2019-10-22 13:46:07.448509952,2019-10-22 13:46:07.448492464,1011030,T,IEX,268.040000,100
2019-10-22 13:46:31.178392064,2019-10-22 13:46:31.178373308,1030807,T,IEX,268.070000,100
2019-10-22 13:46:31.242164992,2019-10-22 13:46:31.242145476,1030851,T,IEX,268.080000,100
2019-10-22 13:46:35.262755072,2019-10-22 13:46:35.262737523,1033686,T,IEX,268.090000,100
2019-10-22 13:46:35.568670976,2019-10-22 13:46:35.568653771,1033810,T,IEX,268.090000,100
2019-10-22 13:46:45.116588032,2019-10-22 13:46:45.116569308,1040814,T,IEX,268.100000,900
2019-10-22 14:08:20.166227968,2019-10-22 14:08:20.166212143,2109565,T,IEX,268.345000,100
2019-10-22 14:16:36.162840064,2019-10-22 14:16:36.162821449,2461767,T,IEX,268.060000,100
2019-10-22 14:17:10.343472128,2019-10-22 14:17:10.343452041,2486237,T,IEX,267.960000,200
2019-10-22 14:19:15.236811008,2019-10-22 14:19:15.236787891,2572291,T,IEX,267.980000,100
2019-10-22 15:01:55.401268992,2019-10-22 15:01:55.401248905,4212058,T,IEX,268.475000,15
2019-10-22 15:10:57.235568128,2019-10-22 15:10:57.235550034,4561781,T,IEX,268.660000,100
2019-10-22 15:20:26.868307968,2019-10-22 15:20:26.868290296,4903969,T,IEX,268.620000,100
2019-10-22 15:20:27.589934080,2019-10-22 15:20:27.589916371,4904843,T,IEX,268.620000,100
2019-10-22 15:30:01.184992000,2019-10-22 15:30:01.184974326,5234073,T,IEX,268.610000,100
2019-10-22 15:34:09.355088896,2019-10-22 15:34:09.355070462,5372889,T,IEX,268.590000,25
2019-10-22 15:35:03.459202048,2019-10-22 15:35:03.459182788,5400476,T,IEX,268.650000,100
2019-10-22 15:38:14.688894976,2019-10-22 15:38:14.688875315,5480001,T,IEX,268.700000,2
2019-10-22 16:08:49.22334976,2019-10-22 16:08:49.22315491,6308664,T,IEX,268.770000,100
2019-10-22 16:37:08.893617920,2019-10-22 16:37:08.893597448,6985875,T,IEX,269.120000,148
2019-10-22 16:40:36.519672064,2019-10-22 16:40:36.519653889,7054983,T,IEX,269.120000,100
2019-10-22 16:40:36.521451008,2019-10-22 16:40:36.521434420,7054986,T,IEX,269.120000,200
2019-10-22 16:49:50.122191872,2019-10-22 16:49:50.122174997,7258390,T,IEX,269.150000,9
2019-10-22 16:58:53.499201024,2019-10-22 16:58:53.499183864,7449234,T,IEX,269.100000,100
2019-10-22 17:33:13.549556992,2019-10-22 17:33:13.549535567,8117964,T,IEX,269.050000,100
2019-10-22 17:33:55.531600896,2019-10-22 17:33:55.531582000,8134268,T,IEX,269.070000,100
2019-10-22 17:50:23.30426112,2019-10-22 17:50:23.30409997,8459664,T,IEX,269.020000,100
2019-10-22 18:00:59.860614912,2019-10-22 18:00:59.860597668,8712143,T,IEX,269.180000,100
2019-10-22 18:30:05.476641024,2019-10-22 18:30:05.476624817,9540466,T,IEX,269.110000,100
2019-10-22 18:31:49.193022976,2019-10-22 18:31:49.193002131,9685101,T,IEX,268.970000,100
2019-10-22 18:36:14.360589056,2019-10-22 18:36:14.360570193,9980076,T,IEX,268.790000,100
2019-10-22 18:37:30.646759936,2019-10-22 18:37:30.646736296,10032697,T,IEX,268.970000,100
2019-10-22 18:37:31.890682880,2019-10-22 18:37:31.890665369,10034635,T,IEX,268.990000,100
2019-10-22 18:46:38.63849984,2019-10-22 18:46:38.63829639,10369090,T,IEX,268.660000,100
2019-10-22 18:50:27.54835968,2019-10-22 18:50:27.54816826,10509246,T,IEX,268.600000,100
2019-10-22 18:51:12.745598976,2019-10-22 18:51:12.745579915,10546523,T,IEX,268.480000,100
2019-10-22 18:55:28.437874944,2019-10-22 18:55:28.437852977,10729769,T,IEX,268.630000,100
2019-10-22 18:55:37.814516992,2019-10-22 18:55:37.814492996,10737038,T,IEX,268.660000,100
2019-10-22 19:05:49.195877120,2019-10-22 19:05:49.195848861,11178142,T,IEX,268.030000,100
2019-10-22 19:07:57.143371008,2019-10-22 19:07:57.143348921,11256172,T,IEX,268.210000,100
2019-10-22 19:12:46.364352000,2019-10-22 19:12:46.364334395,11418519,T,IEX,268.230000,100
2019-10-22 19:13:14.189267968,2019-10-22 19:13:14.189240259,11429106,T,IEX,268.250000,100
2019-10-22 19:13:21.404264960,2019-10-22 19:13:21.404245786,11432027,T,IEX,268.270000,100
2019-10-22 19:13:23.87290112,2019-10-22 19:13:23.87271672,11432717,T,IEX,268.280000,100
2019-10-22 19:15:08.242083072,2019-10-22 19:15:08.242063689,11493048,T,IEX,268.320000,100
2019-10-22 19:15:55.43419904,2019-10-22 19:15:55.43389172,11524422,T,IEX,268.370000,100
2019-10-22 19:16:10.782215936,2019-10-22 19:16:10.782196771,11532818,T,IEX,268.380000,100
2019-10-22 19:16:10.782482944,2019-10-22 19:16:10.782457485,11532832,T,IEX,268.380000,100
2019-10-22 19:17:13.407819008,2019-10-22 19:17:13.407801489,11582809,T,IEX,268.265000,100
2019-10-22 19:17:13.411454976,2019-10-22 19:17:13.411433099,11582855,T,IEX,268.270000,100
2019-10-22 19:21:11.941797888,2019-10-22 19:21:11.941751795,11719606,T,IEX,268.370000,100
2019-10-22 19:27:26.6561024,2019-10-22 19:27:26.6545320,11901809,T,IEX,268.560000,3
2019-10-22 19:40:54.382614016,2019-10-22 19:40:54.382596726,12327420,T,IEX,268.440000,100
2019-10-22 19:40:55.962284032,2019-10-22 19:40:55.962265154,12327958,T,IEX,268.440000,50
2019-10-22 19:40:58.683104000,2019-10-22 19:40:58.683084816,12329595,T,IEX,268.440000,100
2019-10-22 19:40:58.755548928,2019-10-22 19:40:58.755533741,12330541,T,IEX,268.410000,100
2019-10-22 19:41:05.391676928,2019-10-22 19:41:05.391654965,12335363,T,IEX,268.400000,100
2019-10-22 19:41:45.763009024,2019-10-22 19:41:45.762990690,12358486,T,IEX,268.460000,100
2019-10-22 19:47:12.991558912,2019-10-22 19:47:12.991539969,12592717,T,IEX,267.920000,600
2019-10-22 19:47:33.994505984,2019-10-22 19:47:33.994484371,12613640,T,IEX,268.020000,100
2019-10-22 19:48:55.696145920,2019-10-22 19:48:55.696126325,12677357,T,IEX,268.000000,56
2019-10-22 19:51:08.992240128,2019-10-22 19:51:08.992221747,12784372,T,IEX,268.130000,100
2019-10-22 19:56:01.920773120,2019-10-22 19:56:01.920754441,13056361,T,IEX,268.110000,100
2019-10-22 19:56:59.68747008,2019-10-22 19:56:59.68726837,13118844,T,IEX,267.955000,10
2019-10-22 19:57:01.325307904,2019-10-22 19:57:01.325283763,13121526,T,IEX,267.960000,100
2019-10-22 19:58:17.696402944,2019-10-22 19:58:17.696384360,13204550,T,IEX,267.935000,4
2019-10-22 19:58:32.678897920,2019-10-22 19:58:32.678880191,13219873,T,IEX,267.920000,100
2019-10-22 19:58:41.191314944,2019-10-22 19:58:41.191300086,13230653,T,IEX,267.950000,100
2019-10-22 19:58:59.187644928,2019-10-22 19:58:59.187625136,13253498,T,IEX,267.960000,100
2019-10-22 19:59:00.906436096,2019-10-22 19:59:00.906395374,13256982,T,IEX,267.960000,100
2019-10-22 19:59:00.966905088,2019-10-22 19:59:00.966884708,13257179,T,IEX,267.960000,100
2019-10-22 19:59:01.195687936,2019-10-22 19:59:01.195670007,13257569,T,IEX,267.950000,100
2019-10-22 19:59:02.959953920,2019-10-22 19:59:02.959932638,13260046,T,IEX,267.955000,100
2019-10-22 19:59:02.959962880,2019-10-22 19:59:02.959942856,13260047,T,IEX,267.960000,100
2019-10-22 19:59:10.421899008,2019-10-22 19:59:10.421881280,13271803,T,IEX,267.955000,100
2019-10-22 19:59:10.421917952,2019-10-22 19:59:10.421900630,13271804,T,IEX,267.970000,100
2019-10-22 19:59:16.608446976,2019-10-22 19:59:16.608427912,13281451,T,IEX,267.920000,100
2019-10-22 19:59:16.608474112,2019-10-22 19:59:16.608450279,13281453,T,IEX,267.920000,100
2019-10-22 19:59:19.234094080,2019-10-22 19:59:19.234075986,13284954,T,IEX,267.910000,100
2019-10-22 19:59:27.41046016,2019-10-22 19:59:27.41024608,13294328,T,IEX,267.890000,100
2019-10-22 19:59:33.894701056,2019-10-22 19:59:33.894679751,13318343,T,IEX,267.850000,100
2019-10-22 19:59:40.796305920,2019-10-22 19:59:40.796253731,13356614,T,IEX,267.770000,100
2019-10-22 19:59:44.50580992,2019-10-22 19:59:44.50562168,13375732,T,IEX,267.760000,100
2019-10-22 19:59:48.283790080,2019-10-22 19:59:48.283772468,13405548,T,IEX,267.810000,100
2019-10-22 19:59:53.305384960,2019-10-22 19:59:53.305365217,13434173,T,IEX,267.890000,100
2019-10-22 19:59:53.309483008,2019-10-22 19:59:53.309464521,13434489,T,IEX,267.900000,100
2019-10-22 19:59:53.312058112,2019-10-22 19:59:53.312036434,13434674,T,IEX,267.910000,100
2019-10-22 19:59:53.339869952,2019-10-22 19:59:53.339849266,13436917,T,IEX,267.910000,100
2019-10-22 19:59:55.198793984,2019-10-22 19:59:55.198775161,13451124,T,IEX,267.940000,100
2019-10-22 19:59:55.198808064,2019-10-22 19:59:55.198790713,13451125,T,IEX,267.940000,100
2019-10-22 19:59:55.599642112,2019-10-22 19:59:55.599624129,13454757,T,IEX,267.900000,100
