2019-10-15 13:31:17.647365120,2019-10-15 13:31:17.647343068,197012,T,IEX,53.865000,106
2019-10-15 13:31:19.806124032,2019-10-15 13:31:19.806103047,199015,T,IEX,53.850000,100
2019-10-15 13:32:51.720368896,2019-10-15 13:32:51.720348056,290205,T,IEX,54.010000,100
2019-10-15 13:32:52.511760896,2019-10-15 13:32:52.511739833,291327,T,IEX,53.960000,100
2019-10-15 13:32:52.511894016,2019-10-15 13:32:52.511874460,291330,T,IEX,53.960000,100
2019-10-15 13:32:52.511998976,2019-10-15 13:32:52.511979239,291332,T,IEX,53.960000,100
2019-10-15 13:34:40.223728896,2019-10-15 13:34:40.223708472,393100,T,IEX,53.730000,31
2019-10-15 13:34:43.214999040,2019-10-15 13:34:43.214977995,395346,T,IEX,53.740000,100
2019-10-15 13:34:53.562980096,2019-10-15 13:34:53.562959407,403576,T,IEX,53.740000,102
2019-10-15 13:34:59.157227008,2019-10-15 13:34:59.157207805,408294,T,IEX,53.795000,100
2019-10-15 13:35:19.114611968,2019-10-15 13:35:19.114589728,430080,T,IEX,53.780000,113
2019-10-15 13:35:21.889312000,2019-10-15 13:35:21.889290323,432386,T,IEX,53.870000,80
2019-10-15 13:35:21.889358080,2019-10-15 13:35:21.889341803,432387,T,IEX,53.880000,20
2019-10-15 13:35:21.896118016,2019-10-15 13:35:21.896098603,432389,T,IEX,53.880000,100
2019-10-15 13:35:46.272457984,2019-10-15 13:35:46.272441917,454538,T,IEX,53.875000,100
2019-10-15 13:36:31.798082048,2019-10-15 13:36:31.798062554,500099,T,IEX,53.830000,100
2019-10-15 13:36:50.552386048,2019-10-15 13:36:50.552367972,518885,T,IEX,53.810000,58
2019-10-15 13:36:51.378068992,2019-10-15 13:36:51.378051243,520486,T,IEX,53.870000,400
2019-10-15 13:36:51.534088960,2019-10-15 13:36:51.534071851,520783,T,IEX,53.870000,100
2019-10-15 13:36:56.759585024,2019-10-15 13:36:56.759567007,527174,T,IEX,53.870000,100
2019-10-15 13:37:31.414095104,2019-10-15 13:37:31.414077378,561264,T,IEX,53.910000,100
2019-10-15 13:38:17.619234048,2019-10-15 13:38:17.619219183,605313,T,IEX,53.935000,100
2019-10-15 13:38:21.220334080,2019-10-15 13:38:21.220317862,608282,T,IEX,53.875000,154
2019-10-15 13:38:46.233476096,2019-10-15 13:38:46.233458832,628768,T,IEX,53.940000,100
2019-10-15 13:40:05.603151872,2019-10-15 13:40:05.603131356,689950,T,IEX,53.940000,100
2019-10-15 13:41:17.342968064,2019-10-15 13:41:17.342950318,747411,T,IEX,53.850000,100
2019-10-15 13:44:45.871055872,2019-10-15 13:44:45.871038188,918325,T,IEX,54.030000,100
2019-10-15 13:45:00.415002880,2019-10-15 13:45:00.414983353,929004,T,IEX,54.050000,200
2019-10-15 13:45:15.898514944,2019-10-15 13:45:15.898495664,948053,T,IEX,54.020000,100
2019-10-15 13:45:15.899954944,2019-10-15 13:45:15.899938318,948059,T,IEX,54.020000,150
2019-10-15 13:45:15.901298944,2019-10-15 13:45:15.901284131,948065,T,IEX,54.020000,100
2019-10-15 13:48:15.298302976,2019-10-15 13:48:15.298281423,1105474,T,IEX,54.080000,29
2019-10-15 13:48:19.668819968,2019-10-15 13:48:19.668801858,1109943,T,IEX,54.100000,11
2019-10-15 13:48:19.668935936,2019-10-15 13:48:19.668918888,1109945,T,IEX,54.100000,11
2019-10-15 13:48:19.668986880,2019-10-15 13:48:19.668971048,1109946,T,IEX,54.100000,75
2019-10-15 13:48:19.669038080,2019-10-15 13:48:19.669020642,1109947,T,IEX,54.100000,3
2019-10-15 13:48:19.670070016,2019-10-15 13:48:19.670051145,1109948,T,IEX,54.100000,100
2019-10-15 13:56:55.61165056,2019-10-15 13:56:55.61144659,1510254,T,IEX,54.030000,100
2019-10-15 13:57:45.662224896,2019-10-15 13:57:45.662206993,1542954,T,IEX,54.090000,100
2019-10-15 13:57:45.678841088,2019-10-15 13:57:45.678822311,1543177,T,IEX,54.090000,100
2019-10-15 13:58:33.808168960,2019-10-15 13:58:33.808150825,1575409,T,IEX,54.075000,100
2019-10-15 13:58:33.812215040,2019-10-15 13:58:33.812194000,1575411,T,IEX,54.080000,99
2019-10-15 13:58:33.813158912,2019-10-15 13:58:33.813140064,1575413,T,IEX,54.080000,72
2019-10-15 13:59:51.156797952,2019-10-15 13:59:51.156778858,1632484,T,IEX,54.155000,1100
2019-10-15 14:00:58.957986048,2019-10-15 14:00:58.957967717,1680142,T,IEX,54.125000,104
2019-10-15 14:01:43.726426880,2019-10-15 14:01:43.726408229,1714612,T,IEX,54.095000,400
2019-10-15 14:04:11.694187008,2019-10-15 14:04:11.694167092,1840257,T,IEX,54.150000,100
2019-10-15 14:04:11.695164928,2019-10-15 14:04:11.695145489,1840258,T,IEX,54.150000,250
2019-10-15 14:04:11.696112128,2019-10-15 14:04:11.696092807,1840259,T,IEX,54.150000,700
2019-10-15 14:04:11.696129024,2019-10-15 14:04:11.696110894,1840260,T,IEX,54.150000,150
2019-10-15 14:04:11.722524928,2019-10-15 14:04:11.722507083,1840281,T,IEX,54.150000,100
2019-10-15 14:04:11.723639040,2019-10-15 14:04:11.723619639,1840289,T,IEX,54.150000,100
2019-10-15 14:06:10.795118080,2019-10-15 14:06:10.795096841,1926315,T,IEX,54.100000,100
2019-10-15 14:07:46.168165888,2019-10-15 14:07:46.168146254,1984891,T,IEX,54.170000,100
2019-10-15 14:07:58.709637888,2019-10-15 14:07:58.709618329,1993030,T,IEX,54.220000,100
2019-10-15 14:07:58.709662976,2019-10-15 14:07:58.709644909,1993031,T,IEX,54.220000,1000
2019-10-15 14:11:30.491329024,2019-10-15 14:11:30.491307904,2147058,T,IEX,54.210000,100
2019-10-15 14:12:04.403535872,2019-10-15 14:12:04.403515235,2172503,T,IEX,54.205000,100
2019-10-15 14:12:14.448327936,2019-10-15 14:12:14.448307479,2181873,T,IEX,54.215000,100
2019-10-15 14:12:14.453643008,2019-10-15 14:12:14.453625161,2181879,T,IEX,54.215000,100
2019-10-15 14:14:22.301412096,2019-10-15 14:14:22.301395808,2281356,T,IEX,54.365000,1
2019-10-15 14:14:22.301433088,2019-10-15 14:14:22.301415789,2281357,T,IEX,54.365000,1
2019-10-15 14:14:22.316904960,2019-10-15 14:14:22.316886976,2281367,T,IEX,54.360000,100
2019-10-15 14:14:22.316914944,2019-10-15 14:14:22.316896684,2281368,T,IEX,54.360000,200
2019-10-15 14:14:22.318003968,2019-10-15 14:14:22.317985364,2281370,T,IEX,54.360000,448
2019-10-15 14:15:04.694437120,2019-10-15 14:15:04.694415155,2311373,T,IEX,54.335000,100
2019-10-15 14:15:54.203400960,2019-10-15 14:15:54.203382622,2349072,T,IEX,54.350000,3
2019-10-15 14:15:56.513291008,2019-10-15 14:15:56.513275596,2351281,T,IEX,54.380000,100
2019-10-15 14:15:56.932692992,2019-10-15 14:15:56.932674872,2351783,T,IEX,54.385000,2
2019-10-15 14:17:05.242011904,2019-10-15 14:17:05.241993774,2397798,T,IEX,54.440000,100
2019-10-15 14:18:28.92225024,2019-10-15 14:18:28.92208014,2451717,T,IEX,54.380000,100
2019-10-15 14:18:31.449890048,2019-10-15 14:18:31.449873994,2454083,T,IEX,54.390000,8
2019-10-15 14:18:48.615892992,2019-10-15 14:18:48.615876005,2464116,T,IEX,54.390000,83
2019-10-15 14:18:49.1099008,2019-10-15 14:18:49.1083702,2464431,T,IEX,54.390000,3
2019-10-15 14:18:52.250515968,2019-10-15 14:18:52.250494648,2465882,T,IEX,54.390000,2
2019-10-15 14:18:54.771213056,2019-10-15 14:18:54.771193319,2468108,T,IEX,54.390000,9
2019-10-15 14:19:20.250906880,2019-10-15 14:19:20.250887135,2486645,T,IEX,54.430000,1
2019-10-15 14:19:20.258326016,2019-10-15 14:19:20.258304926,2486656,T,IEX,54.440000,300
2019-10-15 14:19:20.258339072,2019-10-15 14:19:20.258321547,2486657,T,IEX,54.440000,300
2019-10-15 14:19:20.258351104,2019-10-15 14:19:20.258334600,2486658,T,IEX,54.440000,13
2019-10-15 14:19:25.859636992,2019-10-15 14:19:25.859620722,2492892,T,IEX,54.460000,3
2019-10-15 14:19:48.198861056,2019-10-15 14:19:48.198841580,2508485,T,IEX,54.440000,100
2019-10-15 14:22:55.509549056,2019-10-15 14:22:55.509528723,2621717,T,IEX,54.260000,100
2019-10-15 14:24:26.407481088,2019-10-15 14:24:26.407461369,2683421,T,IEX,54.225000,2
2019-10-15 14:24:26.407500032,2019-10-15 14:24:26.407480299,2683422,T,IEX,54.230000,98
2019-10-15 14:24:51.742354944,2019-10-15 14:24:51.742334523,2697598,T,IEX,54.200000,100
2019-10-15 14:25:29.142962944,2019-10-15 14:25:29.142944514,2721337,T,IEX,54.170000,100
2019-10-15 14:25:29.143008000,2019-10-15 14:25:29.142991110,2721339,T,IEX,54.170000,100
2019-10-15 14:25:29.863811072,2019-10-15 14:25:29.863790117,2721738,T,IEX,54.180000,100
2019-10-15 14:27:11.508986880,2019-10-15 14:27:11.508969234,2794305,T,IEX,54.230000,100
2019-10-15 14:29:11.585600000,2019-10-15 14:29:11.585582553,3010757,T,IEX,54.410000,16
2019-10-15 14:29:11.585681920,2019-10-15 14:29:11.585664960,3010759,T,IEX,54.410000,84
2019-10-15 14:30:02.127371008,2019-10-15 14:30:02.127352286,3083339,T,IEX,54.380000,200
2019-10-15 14:30:04.30045952,2019-10-15 14:30:04.30028066,3086659,T,IEX,54.380000,100
2019-10-15 14:30:11.834465024,2019-10-15 14:30:11.834449333,3097650,T,IEX,54.390000,105
2019-10-15 14:30:25.720353024,2019-10-15 14:30:25.720286218,3118191,T,IEX,54.380000,100
2019-10-15 14:31:05.208602112,2019-10-15 14:31:05.208581762,3163727,T,IEX,54.370000,100
2019-10-15 14:31:05.928848896,2019-10-15 14:31:05.928830786,3164572,T,IEX,54.400000,100
2019-10-15 14:31:05.937115904,2019-10-15 14:31:05.937099041,3164593,T,IEX,54.400000,100
2019-10-15 14:31:47.774320128,2019-10-15 14:31:47.774301544,3214791,T,IEX,54.440000,100
2019-10-15 14:31:51.149137920,2019-10-15 14:31:51.149116086,3220079,T,IEX,54.425000,100
2019-10-15 14:32:34.533072896,2019-10-15 14:32:34.533046732,3279058,T,IEX,54.440000,4
2019-10-15 14:35:29.690640896,2019-10-15 14:35:29.690624389,3452444,T,IEX,54.445000,1
2019-10-15 14:36:05.595024896,2019-10-15 14:36:05.595006974,3505161,T,IEX,54.500000,4
2019-10-15 14:36:11.756798976,2019-10-15 14:36:11.756780409,3514161,T,IEX,54.490000,100
2019-10-15 14:36:19.311537920,2019-10-15 14:36:19.311517223,3523401,T,IEX,54.480000,3
2019-10-15 14:36:19.319656960,2019-10-15 14:36:19.319641266,3523403,T,IEX,54.480000,6
2019-10-15 14:36:43.547617024,2019-10-15 14:36:43.547597402,3555493,T,IEX,54.440000,4
2019-10-15 14:39:05.549524992,2019-10-15 14:39:05.549506102,3697554,T,IEX,54.450000,100
2019-10-15 14:39:09.21499904,2019-10-15 14:39:09.21480477,3701994,T,IEX,54.470000,100
2019-10-15 14:39:15.76317952,2019-10-15 14:39:15.76299999,3709803,T,IEX,54.440000,3
2019-10-15 14:39:37.288270080,2019-10-15 14:39:37.288250370,3733521,T,IEX,54.420000,100
2019-10-15 14:40:20.367141120,2019-10-15 14:40:20.367123455,3783367,T,IEX,54.445000,100
2019-10-15 14:42:06.829530880,2019-10-15 14:42:06.829511742,3921443,T,IEX,54.430000,100
2019-10-15 14:46:09.602947072,2019-10-15 14:46:09.602929332,4172032,T,IEX,54.440000,6
2019-10-15 14:47:25.139625984,2019-10-15 14:47:25.139605454,4235484,T,IEX,54.495000,6
2019-10-15 14:48:16.618872064,2019-10-15 14:48:16.618854349,4274669,T,IEX,54.540000,2
2019-10-15 14:48:16.626633984,2019-10-15 14:48:16.626612722,4274673,T,IEX,54.540000,2
2019-10-15 14:49:55.595503104,2019-10-15 14:49:55.595484136,4352313,T,IEX,54.525000,1
2019-10-15 14:50:00.300177920,2019-10-15 14:50:00.300157738,4355423,T,IEX,54.515000,5
2019-10-15 14:51:15.750778880,2019-10-15 14:51:15.750758473,4415858,T,IEX,54.580000,100
2019-10-15 14:51:43.564083968,2019-10-15 14:51:43.564063110,4439834,T,IEX,54.530000,4
2019-10-15 14:51:43.567944960,2019-10-15 14:51:43.567928060,4439836,T,IEX,54.530000,100
2019-10-15 14:52:55.16410112,2019-10-15 14:52:55.16389942,4500185,T,IEX,54.550000,3
2019-10-15 14:52:57.3521024,2019-10-15 14:52:57.3500673,4501687,T,IEX,54.550000,2
2019-10-15 14:53:06.143401984,2019-10-15 14:53:06.143380317,4509094,T,IEX,54.555000,1
2019-10-15 14:53:17.531040000,2019-10-15 14:53:17.531018671,4517806,T,IEX,54.550000,2
2019-10-15 14:53:26.906828032,2019-10-15 14:53:26.906804994,4523872,T,IEX,54.540000,75
2019-10-15 14:53:26.906968064,2019-10-15 14:53:26.906951030,4523874,T,IEX,54.540000,25
2019-10-15 14:53:55.67588096,2019-10-15 14:53:55.67572763,4543770,T,IEX,54.555000,6
2019-10-15 14:54:05.17212928,2019-10-15 14:54:05.17178839,4552093,T,IEX,54.530000,100
2019-10-15 14:55:55.347108096,2019-10-15 14:55:55.347088399,4649487,T,IEX,54.540000,100
2019-10-15 14:57:56.265010944,2019-10-15 14:57:56.264990937,4750905,T,IEX,54.580000,100
2019-10-15 14:57:56.265061888,2019-10-15 14:57:56.265043947,4750908,T,IEX,54.580000,100
2019-10-15 14:58:14.100057088,2019-10-15 14:58:14.100033377,4766822,T,IEX,54.570000,100
2019-10-15 14:58:38.959312896,2019-10-15 14:58:38.959293340,4783935,T,IEX,54.550000,4
2019-10-15 14:58:48.189972992,2019-10-15 14:58:48.189951716,4791793,T,IEX,54.525000,100
2019-10-15 14:58:50.985925888,2019-10-15 14:58:50.985905779,4794671,T,IEX,54.500000,100
2019-10-15 14:59:15.524122880,2019-10-15 14:59:15.524105526,4812906,T,IEX,54.505000,2
2019-10-15 14:59:26.169509888,2019-10-15 14:59:26.169487727,4820709,T,IEX,54.520000,100
2019-10-15 14:59:28.943287040,2019-10-15 14:59:28.943271206,4826211,T,IEX,54.515000,100
2019-10-15 15:00:07.335301120,2019-10-15 15:00:07.335282972,4866884,T,IEX,54.550000,2
2019-10-15 15:00:07.335314944,2019-10-15 15:00:07.335296854,4866885,T,IEX,54.550000,1
2019-10-15 15:00:07.335329024,2019-10-15 15:00:07.335312438,4866886,T,IEX,54.560000,97
2019-10-15 15:00:23.930832896,2019-10-15 15:00:23.930814979,4886508,T,IEX,54.565000,100
2019-10-15 15:00:44.449719040,2019-10-15 15:00:44.449697164,4905152,T,IEX,54.520000,4
2019-10-15 15:01:00.338552064,2019-10-15 15:01:00.338535791,4917167,T,IEX,54.530000,102
2019-10-15 15:02:26.68720896,2019-10-15 15:02:26.68701083,5002509,T,IEX,54.510000,100
2019-10-15 15:03:32.814725120,2019-10-15 15:03:32.814702964,5073357,T,IEX,54.620000,100
2019-10-15 15:03:48.880026880,2019-10-15 15:03:48.880009365,5088680,T,IEX,54.620000,3
2019-10-15 15:04:21.933264896,2019-10-15 15:04:21.933247688,5116396,T,IEX,54.600000,100
2019-10-15 15:04:23.768610048,2019-10-15 15:04:23.768591570,5119189,T,IEX,54.600000,100
2019-10-15 15:04:56.736837888,2019-10-15 15:04:56.736816503,5153095,T,IEX,54.590000,111
2019-10-15 15:04:56.737795072,2019-10-15 15:04:56.737777391,5153097,T,IEX,54.590000,689
2019-10-15 15:04:57.186939904,2019-10-15 15:04:57.186918113,5153393,T,IEX,54.575000,100
2019-10-15 15:04:57.186946048,2019-10-15 15:04:57.186926788,5153394,T,IEX,54.575000,100
2019-10-15 15:05:58.528752896,2019-10-15 15:05:58.528734211,5201490,T,IEX,54.520000,100
2019-10-15 15:06:04.368322048,2019-10-15 15:06:04.368302199,5205619,T,IEX,54.505000,100
2019-10-15 15:06:21.887188992,2019-10-15 15:06:21.887170139,5218757,T,IEX,54.505000,100
2019-10-15 15:06:41.184275968,2019-10-15 15:06:41.184256050,5238060,T,IEX,54.500000,390
2019-10-15 15:06:44.462060032,2019-10-15 15:06:44.462038159,5239929,T,IEX,54.490000,100
2019-10-15 15:06:44.852877056,2019-10-15 15:06:44.852860383,5240149,T,IEX,54.480000,50
2019-10-15 15:06:44.852931072,2019-10-15 15:06:44.852913221,5240151,T,IEX,54.480000,50
2019-10-15 15:07:06.787272960,2019-10-15 15:07:06.787252327,5265241,T,IEX,54.470000,100
2019-10-15 15:07:29.462104064,2019-10-15 15:07:29.462083216,5279580,T,IEX,54.480000,100
2019-10-15 15:07:35.826629120,2019-10-15 15:07:35.826606603,5283742,T,IEX,54.500000,75
2019-10-15 15:07:36.647868928,2019-10-15 15:07:36.647847954,5283991,T,IEX,54.500000,100
2019-10-15 15:07:38.952288000,2019-10-15 15:07:38.952267386,5285868,T,IEX,54.500000,100
2019-10-15 15:07:49.530829056,2019-10-15 15:07:49.530809922,5292675,T,IEX,54.510000,1
2019-10-15 15:07:49.530846976,2019-10-15 15:07:49.530830052,5292676,T,IEX,54.510000,7
2019-10-15 15:07:50.557577984,2019-10-15 15:07:50.557560301,5293494,T,IEX,54.530000,100
2019-10-15 15:08:28.298788096,2019-10-15 15:08:28.298769102,5318174,T,IEX,54.530000,100
2019-10-15 15:08:51.921670912,2019-10-15 15:08:51.921652625,5334896,T,IEX,54.520000,1800
2019-10-15 15:08:51.930430976,2019-10-15 15:08:51.930413442,5334929,T,IEX,54.510000,300
2019-10-15 15:08:51.930451968,2019-10-15 15:08:51.930432761,5334930,T,IEX,54.510000,1300
2019-10-15 15:08:59.890179072,2019-10-15 15:08:59.890162007,5342006,T,IEX,54.505000,1300
2019-10-15 15:08:59.892616960,2019-10-15 15:08:59.892601953,5342010,T,IEX,54.500000,100
2019-10-15 15:08:59.997327872,2019-10-15 15:08:59.997307235,5342208,T,IEX,54.490000,100
2019-10-15 15:09:27.683211008,2019-10-15 15:09:27.683192493,5361993,T,IEX,54.470000,1
2019-10-15 15:09:46.341132032,2019-10-15 15:09:46.341110172,5377907,T,IEX,54.465000,100
2019-10-15 15:09:46.341351936,2019-10-15 15:09:46.341334901,5377908,T,IEX,54.465000,100
2019-10-15 15:09:46.341411072,2019-10-15 15:09:46.341393080,5377909,T,IEX,54.465000,100
2019-10-15 15:09:46.341479936,2019-10-15 15:09:46.341462634,5377910,T,IEX,54.465000,100
2019-10-15 15:09:46.341696000,2019-10-15 15:09:46.341679637,5377911,T,IEX,54.465000,100
2019-10-15 15:09:46.341733120,2019-10-15 15:09:46.341714833,5377912,T,IEX,54.465000,15
2019-10-15 15:09:46.343681024,2019-10-15 15:09:46.343663160,5377914,T,IEX,54.465000,75
2019-10-15 15:09:46.346073088,2019-10-15 15:09:46.346051468,5377915,T,IEX,54.465000,6
2019-10-15 15:09:46.350810112,2019-10-15 15:09:46.350789369,5377916,T,IEX,54.465000,100
2019-10-15 15:09:46.705960960,2019-10-15 15:09:46.705940041,5378130,T,IEX,54.465000,100
2019-10-15 15:09:57.345298944,2019-10-15 15:09:57.345278478,5384974,T,IEX,54.460000,100
2019-10-15 15:10:37.675709952,2019-10-15 15:10:37.675691907,5418259,T,IEX,54.450000,100
2019-10-15 15:10:38.1169920,2019-10-15 15:10:38.1151876,5418436,T,IEX,54.445000,100
2019-10-15 15:10:46.753660928,2019-10-15 15:10:46.753638602,5424649,T,IEX,54.425000,100
2019-10-15 15:11:17.873390080,2019-10-15 15:11:17.873367457,5448013,T,IEX,54.420000,100
2019-10-15 15:13:43.98036992,2019-10-15 15:13:43.98020306,5551933,T,IEX,54.400000,100
2019-10-15 15:14:59.706768896,2019-10-15 15:14:59.706751911,5621342,T,IEX,54.380000,100
2019-10-15 15:15:06.335643904,2019-10-15 15:15:06.335621997,5626387,T,IEX,54.385000,200
2019-10-15 15:15:13.919767040,2019-10-15 15:15:13.919747714,5637000,T,IEX,54.380000,96
2019-10-15 15:15:22.415975936,2019-10-15 15:15:22.415954481,5643668,T,IEX,54.355000,100
2019-10-15 15:15:24.260334080,2019-10-15 15:15:24.260312222,5645227,T,IEX,54.355000,100
2019-10-15 15:15:25.31863040,2019-10-15 15:15:25.31846297,5645866,T,IEX,54.360000,100
2019-10-15 15:15:25.33487872,2019-10-15 15:15:25.33470964,5645869,T,IEX,54.360000,100
2019-10-15 15:15:25.35405056,2019-10-15 15:15:25.35384831,5645871,T,IEX,54.360000,100
2019-10-15 15:15:25.273189120,2019-10-15 15:15:25.273168773,5646069,T,IEX,54.360000,100
2019-10-15 15:15:25.274531072,2019-10-15 15:15:25.274509761,5646070,T,IEX,54.355000,100
2019-10-15 15:15:37.440427008,2019-10-15 15:15:37.440405780,5657113,T,IEX,54.350000,22
2019-10-15 15:16:06.503410944,2019-10-15 15:16:06.503390494,5677191,T,IEX,54.335000,200
2019-10-15 15:16:11.561300992,2019-10-15 15:16:11.561283730,5680657,T,IEX,54.335000,100
2019-10-15 15:16:41.653148928,2019-10-15 15:16:41.653129897,5700373,T,IEX,54.325000,100
2019-10-15 15:16:45.624073984,2019-10-15 15:16:45.624053458,5702165,T,IEX,54.320000,100
2019-10-15 15:17:08.770555904,2019-10-15 15:17:08.770535773,5717498,T,IEX,54.335000,100
2019-10-15 15:17:12.75132928,2019-10-15 15:17:12.75113198,5719296,T,IEX,54.330000,100
2019-10-15 15:17:33.398532096,2019-10-15 15:17:33.398514579,5741358,T,IEX,54.310000,100
2019-10-15 15:17:42.641876992,2019-10-15 15:17:42.641859435,5747668,T,IEX,54.310000,100
2019-10-15 15:18:07.56375040,2019-10-15 15:18:07.56353346,5766235,T,IEX,54.300000,100
2019-10-15 15:18:19.887533056,2019-10-15 15:18:19.887516523,5775493,T,IEX,54.325000,100
2019-10-15 15:19:31.168862976,2019-10-15 15:19:31.168842357,5832064,T,IEX,54.320000,100
2019-10-15 15:19:41.39255040,2019-10-15 15:19:41.39239017,5839241,T,IEX,54.315000,100
2019-10-15 15:21:27.223360000,2019-10-15 15:21:27.223339054,5940290,T,IEX,54.320000,100
2019-10-15 15:23:31.968606976,2019-10-15 15:23:31.968585354,6063167,T,IEX,54.325000,15
2019-10-15 15:23:37.771756032,2019-10-15 15:23:37.771736935,6066271,T,IEX,54.330000,75
2019-10-15 15:25:53.153419008,2019-10-15 15:25:53.153399652,6161374,T,IEX,54.370000,9
2019-10-15 15:26:23.436793088,2019-10-15 15:26:23.436772629,6179831,T,IEX,54.390000,100
2019-10-15 15:27:08.263378944,2019-10-15 15:27:08.263358780,6206759,T,IEX,54.380000,100
2019-10-15 15:27:20.877672960,2019-10-15 15:27:20.877655525,6215088,T,IEX,54.370000,100
2019-10-15 15:28:30.745435904,2019-10-15 15:28:30.745411054,6257331,T,IEX,54.350000,100
2019-10-15 15:28:49.117112064,2019-10-15 15:28:49.117094051,6268735,T,IEX,54.360000,100
2019-10-15 15:29:36.911844096,2019-10-15 15:29:36.911822387,6300374,T,IEX,54.395000,15
2019-10-15 15:29:56.263060992,2019-10-15 15:29:56.263043888,6316733,T,IEX,54.430000,100
2019-10-15 15:29:57.248162048,2019-10-15 15:29:57.248140430,6319485,T,IEX,54.450000,100
2019-10-15 15:31:36.546745088,2019-10-15 15:31:36.546721768,6387603,T,IEX,54.340000,100
2019-10-15 15:35:12.535307008,2019-10-15 15:35:12.535285655,6510283,T,IEX,54.270000,100
2019-10-15 15:35:22.45597952,2019-10-15 15:35:22.45577071,6523848,T,IEX,54.310000,100
2019-10-15 15:35:31.646370048,2019-10-15 15:35:31.646351842,6531124,T,IEX,54.300000,100
2019-10-15 15:35:48.930409984,2019-10-15 15:35:48.930391748,6542351,T,IEX,54.300000,100
2019-10-15 15:35:48.931439104,2019-10-15 15:35:48.931419335,6542352,T,IEX,54.300000,100
2019-10-15 15:36:12.759645952,2019-10-15 15:36:12.759629295,6562030,T,IEX,54.305000,1
2019-10-15 15:37:07.681275904,2019-10-15 15:37:07.681260018,6611161,T,IEX,54.265000,2
2019-10-15 15:37:12.829883904,2019-10-15 15:37:12.829863769,6614294,T,IEX,54.250000,1
2019-10-15 15:37:12.836984064,2019-10-15 15:37:12.836963811,6614298,T,IEX,54.250000,1
2019-10-15 15:37:54.775336960,2019-10-15 15:37:54.775318953,6646115,T,IEX,54.240000,1
2019-10-15 15:37:59.633710080,2019-10-15 15:37:59.633690923,6649710,T,IEX,54.240000,100
2019-10-15 15:37:59.662501120,2019-10-15 15:37:59.662482840,6649969,T,IEX,54.235000,100
2019-10-15 15:38:22.416532992,2019-10-15 15:38:22.416512142,6662537,T,IEX,54.220000,4
2019-10-15 15:38:53.608086016,2019-10-15 15:38:53.608065526,6677308,T,IEX,54.245000,100
2019-10-15 15:39:12.612634112,2019-10-15 15:39:12.612613892,6689041,T,IEX,54.285000,100
2019-10-15 15:39:13.93253120,2019-10-15 15:39:13.93232300,6689210,T,IEX,54.285000,100
2019-10-15 15:39:14.943436032,2019-10-15 15:39:14.943414821,6690012,T,IEX,54.280000,100
2019-10-15 15:40:10.405189120,2019-10-15 15:40:10.405168042,6726008,T,IEX,54.310000,100
2019-10-15 15:40:10.407323904,2019-10-15 15:40:10.407305435,6726087,T,IEX,54.310000,100
2019-10-15 15:40:10.407454976,2019-10-15 15:40:10.407434324,6726093,T,IEX,54.310000,100
2019-10-15 15:40:10.407627008,2019-10-15 15:40:10.407605505,6726103,T,IEX,54.310000,3
2019-10-15 15:40:10.407638016,2019-10-15 15:40:10.407618566,6726104,T,IEX,54.310000,97
2019-10-15 15:41:24.169106944,2019-10-15 15:41:24.169087781,6767501,T,IEX,54.330000,50
2019-10-15 15:41:24.169419008,2019-10-15 15:41:24.169401943,6767506,T,IEX,54.330000,75
2019-10-15 15:41:25.481264896,2019-10-15 15:41:25.481248811,6768839,T,IEX,54.330000,100
2019-10-15 15:41:51.418767104,2019-10-15 15:41:51.418744703,6779709,T,IEX,54.325000,2
2019-10-15 15:41:51.877580032,2019-10-15 15:41:51.877564383,6779830,T,IEX,54.345000,100
2019-10-15 15:42:28.209203968,2019-10-15 15:42:28.209181104,6796431,T,IEX,54.335000,2
2019-10-15 15:42:39.223898880,2019-10-15 15:42:39.223881199,6800797,T,IEX,54.345000,400
2019-10-15 15:42:39.225383936,2019-10-15 15:42:39.225366457,6800810,T,IEX,54.345000,1
2019-10-15 15:42:42.186729984,2019-10-15 15:42:42.186707720,6802096,T,IEX,54.345000,3
2019-10-15 15:43:14.60201984,2019-10-15 15:43:14.60180668,6815468,T,IEX,54.355000,1
2019-10-15 15:43:14.949661952,2019-10-15 15:43:14.949639400,6815942,T,IEX,54.365000,100
2019-10-15 15:43:41.713543936,2019-10-15 15:43:41.713524667,6828424,T,IEX,54.365000,3
2019-10-15 15:43:44.829590016,2019-10-15 15:43:44.829568932,6829855,T,IEX,54.365000,1
2019-10-15 15:44:19.605408000,2019-10-15 15:44:19.605388699,6846480,T,IEX,54.365000,1
2019-10-15 15:44:19.605996032,2019-10-15 15:44:19.605977665,6846492,T,IEX,54.370000,100
2019-10-15 15:44:52.716251904,2019-10-15 15:44:52.716236860,6862990,T,IEX,54.385000,100
2019-10-15 15:44:52.742987008,2019-10-15 15:44:52.742965766,6862999,T,IEX,54.385000,100
2019-10-15 15:44:52.769266944,2019-10-15 15:44:52.769246652,6863001,T,IEX,54.385000,100
2019-10-15 15:45:02.296804096,2019-10-15 15:45:02.296783712,6868302,T,IEX,54.385000,300
2019-10-15 15:45:07.328001024,2019-10-15 15:45:07.327981177,6870890,T,IEX,54.380000,14
2019-10-15 15:45:15.929673984,2019-10-15 15:45:15.929656012,6875679,T,IEX,54.335000,100
2019-10-15 15:45:25.4817920,2019-10-15 15:45:25.4799920,6881061,T,IEX,54.335000,100
2019-10-15 15:45:25.817904128,2019-10-15 15:45:25.817882613,6881315,T,IEX,54.330000,4
2019-10-15 15:45:31.649419008,2019-10-15 15:45:31.649399766,6883854,T,IEX,54.325000,100
2019-10-15 15:45:31.675652096,2019-10-15 15:45:31.675629512,6883868,T,IEX,54.325000,100
2019-10-15 15:45:31.729099008,2019-10-15 15:45:31.729080910,6883884,T,IEX,54.325000,100
2019-10-15 15:45:33.871024128,2019-10-15 15:45:33.871002585,6885534,T,IEX,54.325000,100
2019-10-15 15:45:45.633422080,2019-10-15 15:45:45.633404905,6890378,T,IEX,54.330000,100
2019-10-15 15:45:45.836007936,2019-10-15 15:45:45.835990774,6890491,T,IEX,54.330000,100
2019-10-15 15:45:52.152406016,2019-10-15 15:45:52.152386561,6893755,T,IEX,54.310000,100
2019-10-15 15:45:52.153287936,2019-10-15 15:45:52.153267434,6893757,T,IEX,54.310000,100
2019-10-15 15:46:07.960465920,2019-10-15 15:46:07.960444938,6901249,T,IEX,54.290000,2
2019-10-15 15:46:11.322739968,2019-10-15 15:46:11.322720672,6902879,T,IEX,54.290000,1
2019-10-15 15:46:29.427462912,2019-10-15 15:46:29.427442954,6910627,T,IEX,54.285000,100
2019-10-15 15:46:43.134460928,2019-10-15 15:46:43.134441878,6920108,T,IEX,54.260000,100
2019-10-15 15:46:44.162809088,2019-10-15 15:46:44.162787246,6920532,T,IEX,54.260000,4
2019-10-15 15:47:10.664647936,2019-10-15 15:47:10.664628165,6933582,T,IEX,54.275000,100
2019-10-15 15:47:28.504753920,2019-10-15 15:47:28.504732717,6942234,T,IEX,54.275000,100
2019-10-15 15:47:39.238779904,2019-10-15 15:47:39.238757229,6945659,T,IEX,54.280000,100
2019-10-15 15:48:20.444555008,2019-10-15 15:48:20.444533890,6962878,T,IEX,54.315000,124
2019-10-15 15:48:34.708291072,2019-10-15 15:48:34.708270019,6970612,T,IEX,54.295000,100
2019-10-15 15:48:43.966497024,2019-10-15 15:48:43.966478547,6974538,T,IEX,54.295000,100
2019-10-15 15:49:09.195572992,2019-10-15 15:49:09.195555253,6987501,T,IEX,54.290000,100
2019-10-15 15:49:16.797793024,2019-10-15 15:49:16.797773776,6992847,T,IEX,54.310000,100
2019-10-15 15:49:59.969277952,2019-10-15 15:49:59.969259063,7016377,T,IEX,54.330000,100
2019-10-15 15:51:56.245030912,2019-10-15 15:51:56.245013434,7069768,T,IEX,54.310000,100
2019-10-15 15:51:56.247356928,2019-10-15 15:51:56.247335699,7069769,T,IEX,54.310000,100
2019-10-15 15:51:59.639714048,2019-10-15 15:51:59.639693612,7071020,T,IEX,54.295000,100
2019-10-15 15:52:01.827031040,2019-10-15 15:52:01.827010504,7071844,T,IEX,54.295000,100
2019-10-15 15:52:01.835120128,2019-10-15 15:52:01.835099530,7071846,T,IEX,54.290000,100
2019-10-15 15:52:01.836659968,2019-10-15 15:52:01.836641253,7071848,T,IEX,54.290000,100
2019-10-15 15:52:51.545149952,2019-10-15 15:52:51.545129839,7093346,T,IEX,54.335000,100
2019-10-15 15:53:07.554449920,2019-10-15 15:53:07.554430433,7101488,T,IEX,54.350000,100
2019-10-15 15:53:22.532544000,2019-10-15 15:53:22.532523124,7107386,T,IEX,54.360000,100
2019-10-15 15:53:46.58000896,2019-10-15 15:53:46.57983323,7116737,T,IEX,54.360000,100
2019-10-15 15:53:47.855867904,2019-10-15 15:53:47.855846550,7117629,T,IEX,54.360000,100
2019-10-15 15:53:47.856843008,2019-10-15 15:53:47.856825676,7117630,T,IEX,54.360000,200
2019-10-15 15:53:54.965963008,2019-10-15 15:53:54.965941082,7121249,T,IEX,54.335000,4
2019-10-15 15:53:55.255313920,2019-10-15 15:53:55.255293862,7121391,T,IEX,54.335000,100
2019-10-15 15:53:55.526593024,2019-10-15 15:53:55.526573964,7121466,T,IEX,54.325000,100
2019-10-15 15:53:55.791600128,2019-10-15 15:53:55.791578970,7121558,T,IEX,54.325000,100
2019-10-15 15:53:57.682678016,2019-10-15 15:53:57.682656753,7122227,T,IEX,54.325000,100
2019-10-15 15:54:33.703738880,2019-10-15 15:54:33.703716752,7138988,T,IEX,54.340000,100
2019-10-15 15:54:35.406861056,2019-10-15 15:54:35.406839924,7139715,T,IEX,54.340000,100
2019-10-15 15:55:59.130914048,2019-10-15 15:55:59.130893365,7181495,T,IEX,54.330000,100
2019-10-15 15:56:00.811613952,2019-10-15 15:56:00.811592755,7182195,T,IEX,54.340000,55
2019-10-15 15:56:13.412056064,2019-10-15 15:56:13.412034363,7189968,T,IEX,54.350000,4
2019-10-15 15:57:45.846813952,2019-10-15 15:57:45.846796644,7236670,T,IEX,54.360000,200
2019-10-15 15:57:55.792935936,2019-10-15 15:57:55.792916293,7239850,T,IEX,54.360000,100
2019-10-15 15:58:45.787258112,2019-10-15 15:58:45.787240174,7260096,T,IEX,54.350000,100
2019-10-15 15:58:47.890477056,2019-10-15 15:58:47.890457085,7260988,T,IEX,54.360000,3
2019-10-15 15:59:33.166304000,2019-10-15 15:59:33.166285775,7279922,T,IEX,54.380000,1
2019-10-15 15:59:49.795023104,2019-10-15 15:59:49.795002588,7287474,T,IEX,54.360000,100
2019-10-15 16:00:48.879035904,2019-10-15 16:00:48.879017336,7317281,T,IEX,54.410000,100
2019-10-15 16:02:04.392107008,2019-10-15 16:02:04.392070604,7352548,T,IEX,54.420000,100
2019-10-15 16:02:57.612640000,2019-10-15 16:02:57.612620731,7377759,T,IEX,54.440000,100
2019-10-15 16:03:37.163578880,2019-10-15 16:03:37.163557550,7395244,T,IEX,54.450000,100
2019-10-15 16:04:01.605708032,2019-10-15 16:04:01.605690291,7405189,T,IEX,54.440000,4
2019-10-15 16:04:33.802337024,2019-10-15 16:04:33.802315869,7420378,T,IEX,54.415000,100
2019-10-15 16:04:38.15860992,2019-10-15 16:04:38.15840648,7422535,T,IEX,54.410000,100
2019-10-15 16:04:38.16860928,2019-10-15 16:04:38.16841751,7422536,T,IEX,54.410000,100
2019-10-15 16:04:38.16879104,2019-10-15 16:04:38.16861256,7422537,T,IEX,54.410000,100
2019-10-15 16:05:26.16058880,2019-10-15 16:05:26.16038006,7440659,T,IEX,54.430000,100
2019-10-15 16:05:46.203345920,2019-10-15 16:05:46.203324097,7446842,T,IEX,54.440000,100
2019-10-15 16:05:46.203713024,2019-10-15 16:05:46.203694296,7446861,T,IEX,54.440000,100
2019-10-15 16:09:14.319788032,2019-10-15 16:09:14.319761848,7527880,T,IEX,54.430000,100
2019-10-15 16:09:14.319844096,2019-10-15 16:09:14.319824976,7527883,T,IEX,54.430000,100
2019-10-15 16:11:50.189523968,2019-10-15 16:11:50.189503843,7591640,T,IEX,54.440000,23
2019-10-15 16:15:49.560457984,2019-10-15 16:15:49.560437995,7685462,T,IEX,54.480000,100
2019-10-15 16:16:19.589293056,2019-10-15 16:16:19.589276248,7698534,T,IEX,54.480000,100
2019-10-15 16:16:26.543383040,2019-10-15 16:16:26.543366606,7704323,T,IEX,54.490000,100
2019-10-15 16:18:00.621876992,2019-10-15 16:18:00.621858830,7746128,T,IEX,54.505000,100
2019-10-15 16:19:52.445486080,2019-10-15 16:19:52.445465469,7794615,T,IEX,54.455000,300
2019-10-15 16:21:57.267308032,2019-10-15 16:21:57.267287929,7855417,T,IEX,54.460000,10
2019-10-15 16:22:32.452084992,2019-10-15 16:22:32.452061801,7872685,T,IEX,54.495000,10
2019-10-15 16:24:17.881884928,2019-10-15 16:24:17.881863455,7913829,T,IEX,54.455000,100
2019-10-15 16:24:22.508425984,2019-10-15 16:24:22.508405684,7916380,T,IEX,54.450000,100
2019-10-15 16:25:11.906882048,2019-10-15 16:25:11.906860698,7936284,T,IEX,54.445000,300
2019-10-15 16:25:40.958810112,2019-10-15 16:25:40.958790383,7950440,T,IEX,54.460000,100
2019-10-15 16:26:48.87778048,2019-10-15 16:26:48.87761497,7975370,T,IEX,54.440000,100
2019-10-15 16:26:48.450580992,2019-10-15 16:26:48.450560964,7975505,T,IEX,54.440000,900
2019-10-15 16:27:42.324096000,2019-10-15 16:27:42.324077857,8004599,T,IEX,54.455000,100
2019-10-15 16:28:36.223965952,2019-10-15 16:28:36.223945959,8028613,T,IEX,54.440000,100
2019-10-15 16:28:36.501463040,2019-10-15 16:28:36.501440135,8029397,T,IEX,54.435000,200
2019-10-15 16:28:56.760325888,2019-10-15 16:28:56.760307570,8040303,T,IEX,54.425000,400
2019-10-15 16:29:21.524171008,2019-10-15 16:29:21.524153485,8053871,T,IEX,54.415000,400
2019-10-15 16:34:45.246548992,2019-10-15 16:34:45.246525465,8184978,T,IEX,54.485000,100
2019-10-15 16:39:46.558543104,2019-10-15 16:39:46.558524212,8280176,T,IEX,54.500000,4
2019-10-15 16:39:46.578385920,2019-10-15 16:39:46.578363791,8280180,T,IEX,54.510000,11
2019-10-15 16:40:15.405093120,2019-10-15 16:40:15.405073665,8292966,T,IEX,54.530000,100
2019-10-15 16:40:15.704843008,2019-10-15 16:40:15.704822172,8293141,T,IEX,54.530000,100
2019-10-15 16:40:59.182509056,2019-10-15 16:40:59.182488843,8305803,T,IEX,54.520000,100
2019-10-15 16:42:23.55782912,2019-10-15 16:42:23.55762087,8338133,T,IEX,54.550000,100
2019-10-15 16:43:03.253274880,2019-10-15 16:43:03.253253033,8354605,T,IEX,54.610000,100
2019-10-15 16:43:58.442447872,2019-10-15 16:43:58.442425994,8371876,T,IEX,54.650000,100
2019-10-15 16:44:06.721558016,2019-10-15 16:44:06.721539203,8375788,T,IEX,54.630000,100
2019-10-15 16:44:37.668481024,2019-10-15 16:44:37.668458684,8385219,T,IEX,54.640000,100
2019-10-15 16:44:40.320060928,2019-10-15 16:44:40.320043217,8385867,T,IEX,54.630000,113
2019-10-15 16:45:02.157753088,2019-10-15 16:45:02.157735692,8395649,T,IEX,54.655000,100
2019-10-15 16:45:04.807796992,2019-10-15 16:45:04.807776839,8397508,T,IEX,54.660000,500
2019-10-15 16:45:09.798804992,2019-10-15 16:45:09.798784636,8398926,T,IEX,54.640000,100
2019-10-15 16:45:10.643414016,2019-10-15 16:45:10.643392814,8399375,T,IEX,54.640000,100
2019-10-15 16:45:28.673068032,2019-10-15 16:45:28.673050695,8405421,T,IEX,54.630000,100
2019-10-15 16:46:01.312055040,2019-10-15 16:46:01.312034778,8414922,T,IEX,54.605000,100
2019-10-15 16:46:07.971899904,2019-10-15 16:46:07.971877325,8416870,T,IEX,54.605000,100
2019-10-15 16:46:27.624510976,2019-10-15 16:46:27.624488493,8421527,T,IEX,54.605000,100
2019-10-15 16:46:27.628378112,2019-10-15 16:46:27.628356199,8421528,T,IEX,54.605000,100
2019-10-15 16:47:06.192059904,2019-10-15 16:47:06.192040538,8434143,T,IEX,54.610000,100
2019-10-15 16:48:06.172765952,2019-10-15 16:48:06.172747424,8455947,T,IEX,54.625000,400
2019-10-15 16:50:13.999749120,2019-10-15 16:50:13.999730251,8493088,T,IEX,54.600000,3
2019-10-15 16:50:13.999872000,2019-10-15 16:50:13.999854686,8493090,T,IEX,54.600000,75
2019-10-15 16:50:14.2048,2019-10-15 16:50:13.999985380,8493091,T,IEX,54.600000,22
2019-10-15 16:50:14.69120,2019-10-15 16:50:14.52590,8493092,T,IEX,54.600000,200
2019-10-15 16:52:17.305565952,2019-10-15 16:52:17.305544832,8533695,T,IEX,54.635000,200
2019-10-15 16:52:48.991888896,2019-10-15 16:52:48.991868139,8544222,T,IEX,54.640000,240
2019-10-15 16:54:19.676992000,2019-10-15 16:54:19.676969185,8577930,T,IEX,54.655000,100
2019-10-15 16:55:30.576443904,2019-10-15 16:55:30.576426618,8609373,T,IEX,54.680000,1
2019-10-15 16:55:36.94304000,2019-10-15 16:55:36.94283648,8611358,T,IEX,54.665000,300
2019-10-15 16:55:39.860719104,2019-10-15 16:55:39.860697274,8612563,T,IEX,54.665000,300
2019-10-15 16:56:38.276599040,2019-10-15 16:56:38.276575650,8635742,T,IEX,54.655000,500
2019-10-15 16:56:51.595283968,2019-10-15 16:56:51.595266216,8641732,T,IEX,54.670000,53
2019-10-15 16:57:14.1131008,2019-10-15 16:57:14.1113457,8652028,T,IEX,54.665000,100
2019-10-15 16:58:20.911687936,2019-10-15 16:58:20.911663078,8673375,T,IEX,54.660000,4
2019-10-15 16:59:11.670731008,2019-10-15 16:59:11.670714945,8690626,T,IEX,54.645000,300
2019-10-15 16:59:11.671930880,2019-10-15 16:59:11.671909868,8690627,T,IEX,54.645000,200
2019-10-15 17:00:42.918788096,2019-10-15 17:00:42.918769158,8729696,T,IEX,54.690000,5
2019-10-15 17:00:50.208619008,2019-10-15 17:00:50.208603020,8733750,T,IEX,54.690000,469
2019-10-15 17:00:50.209605888,2019-10-15 17:00:50.209588145,8733751,T,IEX,54.690000,3947
2019-10-15 17:00:50.210579968,2019-10-15 17:00:50.210560574,8733752,T,IEX,54.690000,988
2019-10-15 17:00:50.211513088,2019-10-15 17:00:50.211495178,8733753,T,IEX,54.690000,247
2019-10-15 17:00:50.212448000,2019-10-15 17:00:50.212429376,8733754,T,IEX,54.690000,449
2019-10-15 17:01:36.888112896,2019-10-15 17:01:36.888089962,8750287,T,IEX,54.670000,10
2019-10-15 17:02:19.290650880,2019-10-15 17:02:19.290632748,8766569,T,IEX,54.695000,578
2019-10-15 17:05:43.433131008,2019-10-15 17:05:43.433112647,8832832,T,IEX,54.690000,3
2019-10-15 17:08:53.497847040,2019-10-15 17:08:53.497825476,8895879,T,IEX,54.645000,100
2019-10-15 17:10:04.342493952,2019-10-15 17:10:04.342473593,8918907,T,IEX,54.640000,100
2019-10-15 17:11:07.196638976,2019-10-15 17:11:07.196619722,8943763,T,IEX,54.630000,100
2019-10-15 17:11:07.196656896,2019-10-15 17:11:07.196639746,8943764,T,IEX,54.630000,100
2019-10-15 17:11:07.196676096,2019-10-15 17:11:07.196659493,8943765,T,IEX,54.630000,100
2019-10-15 17:11:07.196692992,2019-10-15 17:11:07.196676353,8943766,T,IEX,54.630000,100
2019-10-15 17:11:07.209058048,2019-10-15 17:11:07.209036718,8943775,T,IEX,54.630000,100
2019-10-15 17:15:04.358330112,2019-10-15 17:15:04.358309414,9019669,T,IEX,54.665000,100
2019-10-15 17:15:44.572964096,2019-10-15 17:15:44.572945493,9033804,T,IEX,54.690000,100
2019-10-15 17:17:54.595717888,2019-10-15 17:17:54.595700785,9072709,T,IEX,54.675000,1
2019-10-15 17:19:56.153270016,2019-10-15 17:19:56.153247755,9103960,T,IEX,54.715000,1
2019-10-15 17:20:05.906284032,2019-10-15 17:20:05.906263270,9107429,T,IEX,54.720000,100
2019-10-15 17:20:34.655171072,2019-10-15 17:20:34.655152924,9119271,T,IEX,54.720000,32
2019-10-15 17:21:01.598749952,2019-10-15 17:21:01.598729786,9128998,T,IEX,54.710000,100
2019-10-15 17:21:14.813456896,2019-10-15 17:21:14.813440231,9132655,T,IEX,54.710000,100
2019-10-15 17:21:31.753401088,2019-10-15 17:21:31.753380276,9137610,T,IEX,54.695000,100
2019-10-15 17:22:26.208933888,2019-10-15 17:22:26.208913808,9156190,T,IEX,54.705000,300
2019-10-15 17:23:24.736125952,2019-10-15 17:23:24.736105782,9175839,T,IEX,54.685000,300
2019-10-15 17:25:19.539028992,2019-10-15 17:25:19.539010743,9229175,T,IEX,54.665000,300
2019-10-15 17:26:13.563866112,2019-10-15 17:26:13.563844512,9249714,T,IEX,54.665000,300
2019-10-15 17:27:00.335665920,2019-10-15 17:27:00.335647186,9266011,T,IEX,54.670000,100
2019-10-15 17:28:42.132050944,2019-10-15 17:28:42.132029261,9303567,T,IEX,54.655000,300
2019-10-15 17:29:53.378181888,2019-10-15 17:29:53.378164531,9329267,T,IEX,54.670000,100
2019-10-15 17:31:46.471282944,2019-10-15 17:31:46.471188097,9366977,T,IEX,54.675000,600
2019-10-15 17:32:53.321996032,2019-10-15 17:32:53.321978724,9386169,T,IEX,54.690000,101
2019-10-15 17:33:39.127557120,2019-10-15 17:33:39.127535825,9401679,T,IEX,54.705000,100
2019-10-15 17:34:22.627392000,2019-10-15 17:34:22.627376150,9419689,T,IEX,54.690000,100
2019-10-15 17:37:10.200072960,2019-10-15 17:37:10.200052249,9475492,T,IEX,54.710000,54
2019-10-15 17:37:10.200449024,2019-10-15 17:37:10.200432676,9475494,T,IEX,54.710000,46
2019-10-15 17:37:27.960594944,2019-10-15 17:37:27.960572535,9479817,T,IEX,54.720000,100
2019-10-15 17:37:41.174633984,2019-10-15 17:37:41.174614597,9484110,T,IEX,54.720000,100
2019-10-15 17:39:23.247611904,2019-10-15 17:39:23.247591510,9515986,T,IEX,54.700000,100
2019-10-15 17:40:57.52566016,2019-10-15 17:40:57.52545007,9552994,T,IEX,54.690000,1
2019-10-15 17:41:14.738448896,2019-10-15 17:41:14.738427032,9558875,T,IEX,54.680000,300
2019-10-15 17:41:37.826396928,2019-10-15 17:41:37.826377155,9566812,T,IEX,54.700000,100
2019-10-15 17:43:38.803557888,2019-10-15 17:43:38.803536286,9605914,T,IEX,54.705000,300
2019-10-15 17:43:44.638823936,2019-10-15 17:43:44.638805944,9607532,T,IEX,54.710000,2
2019-10-15 17:43:46.520232960,2019-10-15 17:43:46.520216548,9608136,T,IEX,54.725000,100
2019-10-15 17:44:35.160418048,2019-10-15 17:44:35.160396422,9620564,T,IEX,54.730000,100
2019-10-15 17:46:29.818533120,2019-10-15 17:46:29.818511168,9669113,T,IEX,54.740000,600
2019-10-15 17:46:39.140175104,2019-10-15 17:46:39.140154738,9671854,T,IEX,54.735000,300
2019-10-15 17:48:04.666892032,2019-10-15 17:48:04.666871980,9701839,T,IEX,54.730000,1
2019-10-15 17:49:12.213713920,2019-10-15 17:49:12.213694894,9720112,T,IEX,54.725000,300
2019-10-15 17:50:11.359672064,2019-10-15 17:50:11.359651937,9737252,T,IEX,54.730000,100
2019-10-15 17:50:11.359971072,2019-10-15 17:50:11.359952867,9737262,T,IEX,54.730000,13
2019-10-15 17:51:01.195535104,2019-10-15 17:51:01.195514851,9755731,T,IEX,54.750000,2
2019-10-15 17:52:03.294038016,2019-10-15 17:52:03.294019535,9777826,T,IEX,54.725000,300
2019-10-15 17:52:31.932055040,2019-10-15 17:52:31.932032558,9789654,T,IEX,54.720000,100
2019-10-15 17:53:14.58812928,2019-10-15 17:53:14.58793032,9804051,T,IEX,54.720000,100
2019-10-15 17:53:28.550199040,2019-10-15 17:53:28.550181917,9809279,T,IEX,54.720000,1
2019-10-15 17:54:20.606522880,2019-10-15 17:54:20.606505364,9826231,T,IEX,54.715000,500
2019-10-15 17:54:54.372349952,2019-10-15 17:54:54.372331474,9837332,T,IEX,54.715000,400
2019-10-15 17:55:34.890068992,2019-10-15 17:55:34.890049182,9852303,T,IEX,54.695000,400
2019-10-15 17:55:37.839656960,2019-10-15 17:55:37.839637086,9853007,T,IEX,54.720000,100
2019-10-15 17:55:53.520350976,2019-10-15 17:55:53.520332295,9857790,T,IEX,54.725000,200
2019-10-15 17:58:01.207085056,2019-10-15 17:58:01.207065019,9906055,T,IEX,54.680000,200
2019-10-15 17:59:08.194801920,2019-10-15 17:59:08.194782455,9926839,T,IEX,54.670000,75
2019-10-15 17:59:08.194923008,2019-10-15 17:59:08.194904962,9926841,T,IEX,54.670000,4
2019-10-15 17:59:08.195017984,2019-10-15 17:59:08.195001103,9926842,T,IEX,54.670000,21
2019-10-15 18:00:30.682571008,2019-10-15 18:00:30.682554707,9958776,T,IEX,54.675000,4
2019-10-15 18:05:09.656207104,2019-10-15 18:05:09.656192070,10059459,T,IEX,54.685000,392
2019-10-15 18:05:17.718519040,2019-10-15 18:05:17.718487931,10062504,T,IEX,54.670000,100
2019-10-15 18:05:17.720581120,2019-10-15 18:05:17.720562617,10062624,T,IEX,54.670000,100
2019-10-15 18:05:28.672816896,2019-10-15 18:05:28.672795171,10073028,T,IEX,54.650000,100
2019-10-15 18:05:28.673668096,2019-10-15 18:05:28.673649097,10073065,T,IEX,54.650000,100
2019-10-15 18:06:07.45229056,2019-10-15 18:06:07.45205517,10095271,T,IEX,54.660000,2
2019-10-15 18:08:49.56768000,2019-10-15 18:08:49.56747460,10149040,T,IEX,54.690000,100
2019-10-15 18:08:49.56783104,2019-10-15 18:08:49.56764581,10149041,T,IEX,54.690000,100
2019-10-15 18:08:49.56798976,2019-10-15 18:08:49.56780259,10149042,T,IEX,54.690000,100
2019-10-15 18:08:49.56813056,2019-10-15 18:08:49.56794813,10149043,T,IEX,54.690000,100
2019-10-15 18:10:07.374637056,2019-10-15 18:10:07.374619174,10173540,T,IEX,54.720000,100
2019-10-15 18:12:32.545707008,2019-10-15 18:12:32.545687342,10223201,T,IEX,54.710000,33
2019-10-15 18:12:39.381174016,2019-10-15 18:12:39.381153882,10225183,T,IEX,54.715000,100
2019-10-15 18:17:25.208976896,2019-10-15 18:17:25.208957181,10315253,T,IEX,54.750000,8
2019-10-15 18:17:25.209065984,2019-10-15 18:17:25.209046785,10315255,T,IEX,54.750000,92
2019-10-15 18:22:42.376055040,2019-10-15 18:22:42.376035196,10421074,T,IEX,54.795000,100
2019-10-15 18:24:51.794992128,2019-10-15 18:24:51.794970537,10463649,T,IEX,54.800000,100
2019-10-15 18:27:30.661086976,2019-10-15 18:27:30.661062894,10520176,T,IEX,54.760000,16400
2019-10-15 18:27:30.661092096,2019-10-15 18:27:30.661072083,10520177,T,IEX,54.760000,400
2019-10-15 18:27:30.662257920,2019-10-15 18:27:30.662238152,10520178,T,IEX,54.760000,1800
2019-10-15 18:27:30.665112064,2019-10-15 18:27:30.665092094,10520180,T,IEX,54.760000,1100
2019-10-15 18:27:30.666146048,2019-10-15 18:27:30.666125163,10520181,T,IEX,54.760000,300
2019-10-15 18:27:41.207368960,2019-10-15 18:27:41.207352707,10523503,T,IEX,54.775000,100
2019-10-15 18:29:25.60660992,2019-10-15 18:29:25.60641697,10564327,T,IEX,54.770000,200
2019-10-15 18:30:00.656742912,2019-10-15 18:30:00.656722949,10578929,T,IEX,54.775000,200
2019-10-15 18:30:57.6457088,2019-10-15 18:30:57.6436750,10600056,T,IEX,54.730000,2
2019-10-15 18:31:31.447269888,2019-10-15 18:31:31.447253229,10611524,T,IEX,54.735000,238
2019-10-15 18:31:42.928329984,2019-10-15 18:31:42.928312209,10615811,T,IEX,54.740000,4
2019-10-15 18:32:00.765623040,2019-10-15 18:32:00.765602136,10622599,T,IEX,54.755000,547
2019-10-15 18:33:45.786468096,2019-10-15 18:33:45.786440796,10662873,T,IEX,54.730000,100
2019-10-15 18:34:08.949307904,2019-10-15 18:34:08.949290637,10672526,T,IEX,54.720000,28
2019-10-15 18:34:11.727595008,2019-10-15 18:34:11.727578491,10673485,T,IEX,54.725000,900
2019-10-15 18:34:45.570763008,2019-10-15 18:34:45.570744426,10686249,T,IEX,54.695000,100
2019-10-15 18:34:47.23322112,2019-10-15 18:34:47.23305429,10686629,T,IEX,54.690000,100
2019-10-15 18:35:11.879346944,2019-10-15 18:35:11.879330466,10694381,T,IEX,54.705000,100
2019-10-15 18:35:11.880293888,2019-10-15 18:35:11.880275022,10694382,T,IEX,54.705000,100
2019-10-15 18:35:11.881239040,2019-10-15 18:35:11.881221526,10694383,T,IEX,54.705000,100
2019-10-15 18:35:17.306477056,2019-10-15 18:35:17.306453173,10697003,T,IEX,54.705000,100
2019-10-15 18:35:40.119569920,2019-10-15 18:35:40.119551954,10704567,T,IEX,54.725000,700
2019-10-15 18:38:08.531084032,2019-10-15 18:38:08.531063079,10751296,T,IEX,54.730000,100
2019-10-15 18:38:12.983780096,2019-10-15 18:38:12.983759898,10752616,T,IEX,54.755000,100
2019-10-15 18:38:51.837638912,2019-10-15 18:38:51.837620233,10765381,T,IEX,54.735000,100
2019-10-15 18:41:53.279008000,2019-10-15 18:41:53.278989195,10827056,T,IEX,54.760000,100
2019-10-15 18:41:53.398953984,2019-10-15 18:41:53.398936367,10829492,T,IEX,54.760000,100
2019-10-15 18:42:17.976015104,2019-10-15 18:42:17.975995637,10843278,T,IEX,54.750000,100
2019-10-15 18:42:33.198789120,2019-10-15 18:42:33.198767527,10847950,T,IEX,54.760000,200
2019-10-15 18:43:14.13850112,2019-10-15 18:43:14.13829289,10861877,T,IEX,54.770000,100
2019-10-15 18:43:19.280704000,2019-10-15 18:43:19.280681662,10863238,T,IEX,54.780000,100
2019-10-15 18:44:06.177605120,2019-10-15 18:44:06.177587108,10876305,T,IEX,54.800000,200
2019-10-15 18:44:15.882163968,2019-10-15 18:44:15.882146009,10879301,T,IEX,54.820000,100
2019-10-15 18:45:22.12807936,2019-10-15 18:45:22.12786883,10901073,T,IEX,54.850000,100
2019-10-15 18:45:24.663627008,2019-10-15 18:45:24.663608892,10901750,T,IEX,54.850000,100
2019-10-15 18:45:36.330521088,2019-10-15 18:45:36.330499792,10905572,T,IEX,54.840000,100
2019-10-15 18:46:08.622866944,2019-10-15 18:46:08.622848645,10918983,T,IEX,54.810000,4
2019-10-15 18:49:08.805105920,2019-10-15 18:49:08.805086790,10982382,T,IEX,54.795000,334
2019-10-15 18:50:47.725231104,2019-10-15 18:50:47.725210792,11021875,T,IEX,54.810000,100
2019-10-15 18:53:16.854640896,2019-10-15 18:53:16.854620086,11070893,T,IEX,54.795000,100
2019-10-15 18:53:23.215072000,2019-10-15 18:53:23.215050693,11072509,T,IEX,54.775000,2
2019-10-15 18:54:02.292395008,2019-10-15 18:54:02.292373531,11084908,T,IEX,54.740000,2
2019-10-15 18:58:57.90733056,2019-10-15 18:58:57.90715108,11198956,T,IEX,54.710000,2
2019-10-15 19:00:30.81325056,2019-10-15 19:00:30.81309251,11255694,T,IEX,54.710000,7
2019-10-15 19:00:32.179663104,2019-10-15 19:00:32.179641463,11256327,T,IEX,54.720000,100
2019-10-15 19:01:43.820784128,2019-10-15 19:01:43.820763165,11283810,T,IEX,54.730000,947
2019-10-15 19:01:50.242232064,2019-10-15 19:01:50.242210915,11286234,T,IEX,54.735000,100
2019-10-15 19:05:21.131480064,2019-10-15 19:05:21.131460577,11366791,T,IEX,54.710000,100
2019-10-15 19:05:21.313691904,2019-10-15 19:05:21.313671753,11366837,T,IEX,54.710000,31
2019-10-15 19:09:36.514294016,2019-10-15 19:09:36.514272859,11455958,T,IEX,54.665000,268
2019-10-15 19:09:45.170700032,2019-10-15 19:09:45.170678434,11459802,T,IEX,54.670000,100
2019-10-15 19:11:30.18123008,2019-10-15 19:11:30.18105681,11494902,T,IEX,54.670000,100
2019-10-15 19:12:16.135676928,2019-10-15 19:12:16.135661211,11510961,T,IEX,54.660000,100
2019-10-15 19:12:47.569330944,2019-10-15 19:12:47.569313970,11522502,T,IEX,54.680000,4
2019-10-15 19:12:48.888314112,2019-10-15 19:12:48.888297528,11523210,T,IEX,54.675000,96
2019-10-15 19:12:48.888333056,2019-10-15 19:12:48.888315981,11523211,T,IEX,54.675000,4
2019-10-15 19:12:48.890898944,2019-10-15 19:12:48.890878468,11523214,T,IEX,54.675000,100
2019-10-15 19:12:55.502010880,2019-10-15 19:12:55.501991392,11525324,T,IEX,54.675000,1
2019-10-15 19:13:06.308356096,2019-10-15 19:13:06.308336980,11528368,T,IEX,54.675000,1
2019-10-15 19:13:08.392050944,2019-10-15 19:13:08.392031665,11529686,T,IEX,54.690000,100
2019-10-15 19:14:47.196134912,2019-10-15 19:14:47.196115096,11559322,T,IEX,54.700000,100
2019-10-15 19:14:49.557963008,2019-10-15 19:14:49.557940460,11560619,T,IEX,54.710000,100
2019-10-15 19:14:59.308681984,2019-10-15 19:14:59.308660644,11564015,T,IEX,54.700000,2
2019-10-15 19:15:02.279730944,2019-10-15 19:15:02.279709486,11565413,T,IEX,54.690000,3
2019-10-15 19:15:05.416589056,2019-10-15 19:15:05.416569315,11566373,T,IEX,54.685000,100
2019-10-15 19:15:33.896655104,2019-10-15 19:15:33.896625307,11582023,T,IEX,54.700000,100
2019-10-15 19:15:40.23994112,2019-10-15 19:15:40.23962793,11586189,T,IEX,54.700000,100
2019-10-15 19:15:48.328707072,2019-10-15 19:15:48.328685194,11590848,T,IEX,54.710000,10
2019-10-15 19:17:00.616108032,2019-10-15 19:17:00.616088437,11614524,T,IEX,54.700000,100
2019-10-15 19:17:02.941496064,2019-10-15 19:17:02.941479631,11616116,T,IEX,54.695000,100
2019-10-15 19:17:04.852166912,2019-10-15 19:17:04.852145502,11617069,T,IEX,54.690000,82
2019-10-15 19:17:08.11449088,2019-10-15 19:17:08.11429577,11618581,T,IEX,54.695000,100
2019-10-15 19:17:27.475539968,2019-10-15 19:17:27.475521003,11626595,T,IEX,54.710000,100
2019-10-15 19:17:27.475558912,2019-10-15 19:17:27.475540987,11626596,T,IEX,54.710000,100
2019-10-15 19:17:27.484101888,2019-10-15 19:17:27.484080144,11626599,T,IEX,54.705000,100
2019-10-15 19:17:27.938557952,2019-10-15 19:17:27.938537121,11626707,T,IEX,54.705000,100
2019-10-15 19:17:48.356846080,2019-10-15 19:17:48.356820257,11636233,T,IEX,54.720000,100
2019-10-15 19:18:57.160559104,2019-10-15 19:18:57.160536788,11657563,T,IEX,54.715000,100
2019-10-15 19:18:57.740596992,2019-10-15 19:18:57.740576495,11657735,T,IEX,54.715000,100
2019-10-15 19:19:31.262993920,2019-10-15 19:19:31.262976419,11671631,T,IEX,54.715000,100
2019-10-15 19:21:50.56460032,2019-10-15 19:21:50.56439162,11715801,T,IEX,54.695000,100
2019-10-15 19:21:50.58132992,2019-10-15 19:21:50.58111378,11715802,T,IEX,54.695000,300
2019-10-15 19:23:08.393475072,2019-10-15 19:23:08.393454112,11742446,T,IEX,54.675000,100
2019-10-15 19:23:08.395118080,2019-10-15 19:23:08.395097229,11742447,T,IEX,54.675000,200
2019-10-15 19:23:28.962836992,2019-10-15 19:23:28.962817922,11748484,T,IEX,54.675000,100
2019-10-15 19:24:54.618270976,2019-10-15 19:24:54.618242667,11781047,T,IEX,54.680000,100
2019-10-15 19:24:54.620197120,2019-10-15 19:24:54.620178629,11781096,T,IEX,54.685000,300
2019-10-15 19:25:04.960620032,2019-10-15 19:25:04.960598268,11785822,T,IEX,54.690000,100
2019-10-15 19:25:04.962839040,2019-10-15 19:25:04.962821664,11785904,T,IEX,54.690000,100
2019-10-15 19:25:04.962989056,2019-10-15 19:25:04.962968829,11785909,T,IEX,54.690000,100
2019-10-15 19:25:04.963069952,2019-10-15 19:25:04.963052156,11785913,T,IEX,54.690000,100
2019-10-15 19:25:04.964184064,2019-10-15 19:25:04.964167471,11785940,T,IEX,54.690000,100
2019-10-15 19:25:44.880344064,2019-10-15 19:25:44.880321371,11804874,T,IEX,54.680000,1
2019-10-15 19:25:57.589434880,2019-10-15 19:25:57.589415121,11809832,T,IEX,54.680000,9
2019-10-15 19:25:57.589458944,2019-10-15 19:25:57.589440886,11809834,T,IEX,54.680000,91
2019-10-15 19:26:54.924081920,2019-10-15 19:26:54.924052814,11833786,T,IEX,54.670000,100
2019-10-15 19:27:12.113434112,2019-10-15 19:27:12.113414000,11842304,T,IEX,54.675000,100
2019-10-15 19:27:12.115120128,2019-10-15 19:27:12.115098290,11842305,T,IEX,54.675000,600
2019-10-15 19:27:12.118305024,2019-10-15 19:27:12.118283937,11842308,T,IEX,54.675000,100
2019-10-15 19:27:12.123303936,2019-10-15 19:27:12.123282244,11842313,T,IEX,54.675000,100
2019-10-15 19:27:22.61454080,2019-10-15 19:27:22.61436823,11845032,T,IEX,54.675000,100
2019-10-15 19:27:22.738297088,2019-10-15 19:27:22.738276303,11845224,T,IEX,54.680000,100
2019-10-15 19:27:22.738308096,2019-10-15 19:27:22.738289365,11845225,T,IEX,54.680000,8
2019-10-15 19:27:22.738319872,2019-10-15 19:27:22.738303705,11845226,T,IEX,54.680000,10
2019-10-15 19:27:22.738337024,2019-10-15 19:27:22.738320267,11845227,T,IEX,54.680000,5
2019-10-15 19:27:26.118181120,2019-10-15 19:27:26.118162179,11846757,T,IEX,54.690000,100
2019-10-15 19:28:35.957806080,2019-10-15 19:28:35.957788586,11870390,T,IEX,54.690000,100
2019-10-15 19:28:36.353957120,2019-10-15 19:28:36.353936313,11870580,T,IEX,54.690000,300
2019-10-15 19:28:40.158320128,2019-10-15 19:28:40.158300029,11871707,T,IEX,54.690000,24
2019-10-15 19:29:57.162402048,2019-10-15 19:29:57.162384826,11901153,T,IEX,54.675000,100
2019-10-15 19:29:57.164109056,2019-10-15 19:29:57.164088416,11901155,T,IEX,54.675000,200
2019-10-15 19:30:00.56098048,2019-10-15 19:30:00.56079305,11904714,T,IEX,54.685000,100
2019-10-15 19:30:23.594171904,2019-10-15 19:30:23.594152633,11922772,T,IEX,54.675000,100
2019-10-15 19:30:29.991132928,2019-10-15 19:30:29.991114141,11925956,T,IEX,54.675000,100
2019-10-15 19:30:52.209108992,2019-10-15 19:30:52.209091796,11937600,T,IEX,54.675000,100
2019-10-15 19:30:52.636044032,2019-10-15 19:30:52.636023618,11937844,T,IEX,54.680000,100
2019-10-15 19:30:52.636061952,2019-10-15 19:30:52.636042807,11937845,T,IEX,54.680000,100
2019-10-15 19:30:52.636075008,2019-10-15 19:30:52.636056627,11937846,T,IEX,54.680000,9
2019-10-15 19:30:52.636089088,2019-10-15 19:30:52.636073267,11937847,T,IEX,54.680000,4
2019-10-15 19:30:59.366105088,2019-10-15 19:30:59.366083633,11941891,T,IEX,54.680000,100
2019-10-15 19:31:03.820186112,2019-10-15 19:31:03.820163423,11944106,T,IEX,54.680000,5
2019-10-15 19:31:03.820244992,2019-10-15 19:31:03.820227385,11944108,T,IEX,54.680000,95
2019-10-15 19:31:07.88118016,2019-10-15 19:31:07.88100220,11946310,T,IEX,54.690000,100
2019-10-15 19:31:07.88184064,2019-10-15 19:31:07.88166580,11946312,T,IEX,54.690000,32
2019-10-15 19:31:28.9735936,2019-10-15 19:31:28.9716896,11955487,T,IEX,54.690000,100
2019-10-15 19:31:38.36600064,2019-10-15 19:31:38.36579612,11962342,T,IEX,54.700000,100
2019-10-15 19:31:39.363800064,2019-10-15 19:31:39.363778288,11963416,T,IEX,54.700000,5
2019-10-15 19:31:41.23931904,2019-10-15 19:31:41.23914006,11964101,T,IEX,54.700000,100
2019-10-15 19:31:41.24772096,2019-10-15 19:31:41.24753328,11964104,T,IEX,54.695000,100
2019-10-15 19:31:54.303934976,2019-10-15 19:31:54.303913886,11969764,T,IEX,54.690000,100
2019-10-15 19:32:06.591854080,2019-10-15 19:32:06.591833083,11975378,T,IEX,54.670000,100
2019-10-15 19:32:24.976337920,2019-10-15 19:32:24.976317928,11984725,T,IEX,54.675000,100
2019-10-15 19:32:25.771629056,2019-10-15 19:32:25.771607735,11984972,T,IEX,54.675000,100
2019-10-15 19:32:26.558617088,2019-10-15 19:32:26.558597602,11985364,T,IEX,54.670000,5
2019-10-15 19:32:31.269303040,2019-10-15 19:32:31.269279995,11988493,T,IEX,54.680000,100
2019-10-15 19:32:31.269317120,2019-10-15 19:32:31.269299975,11988494,T,IEX,54.680000,100
2019-10-15 19:32:41.344294912,2019-10-15 19:32:41.344271906,11992881,T,IEX,54.710000,100
2019-10-15 19:32:42.891226880,2019-10-15 19:32:42.891209093,11993763,T,IEX,54.710000,100
2019-10-15 19:32:52.306381056,2019-10-15 19:32:52.306360689,12001348,T,IEX,54.695000,100
2019-10-15 19:32:54.192461056,2019-10-15 19:32:54.192441730,12002871,T,IEX,54.710000,100
2019-10-15 19:32:54.192476928,2019-10-15 19:32:54.192459142,12002872,T,IEX,54.710000,100
2019-10-15 19:33:24.847016960,2019-10-15 19:33:24.846998474,12017800,T,IEX,54.690000,5
2019-10-15 19:33:24.847139072,2019-10-15 19:33:24.847120698,12017802,T,IEX,54.690000,95
2019-10-15 19:33:32.299994880,2019-10-15 19:33:32.299975651,12023202,T,IEX,54.680000,5
2019-10-15 19:33:33.50343936,2019-10-15 19:33:33.50323905,12023856,T,IEX,54.675000,300
2019-10-15 19:33:42.467923968,2019-10-15 19:33:42.467907018,12032148,T,IEX,54.670000,100
2019-10-15 19:33:42.467942912,2019-10-15 19:33:42.467926099,12032149,T,IEX,54.670000,100
2019-10-15 19:34:02.704071936,2019-10-15 19:34:02.704051039,12042382,T,IEX,54.665000,100
2019-10-15 19:34:20.734752000,2019-10-15 19:34:20.734732403,12051004,T,IEX,54.670000,100
2019-10-15 19:34:20.734766080,2019-10-15 19:34:20.734745986,12051005,T,IEX,54.670000,100
2019-10-15 19:34:20.734784000,2019-10-15 19:34:20.734765311,12051006,T,IEX,54.670000,100
2019-10-15 19:34:21.348549120,2019-10-15 19:34:21.348528185,12051301,T,IEX,54.665000,300
2019-10-15 19:34:23.548064000,2019-10-15 19:34:23.548045727,12051980,T,IEX,54.670000,100
2019-10-15 19:34:23.555663872,2019-10-15 19:34:23.555641420,12051992,T,IEX,54.670000,100
2019-10-15 19:34:31.783150080,2019-10-15 19:34:31.783132530,12061437,T,IEX,54.685000,100
2019-10-15 19:35:00.135702016,2019-10-15 19:35:00.135680792,12080779,T,IEX,54.680000,100
2019-10-15 19:35:07.446684928,2019-10-15 19:35:07.446663091,12084311,T,IEX,54.690000,100
2019-10-15 19:35:25.157117952,2019-10-15 19:35:25.157099184,12092813,T,IEX,54.700000,100
2019-10-15 19:35:29.559731968,2019-10-15 19:35:29.559710868,12096369,T,IEX,54.700000,200
2019-10-15 19:35:38.152891904,2019-10-15 19:35:38.152872829,12101118,T,IEX,54.695000,100
2019-10-15 19:35:38.154930944,2019-10-15 19:35:38.154913228,12101121,T,IEX,54.700000,100
2019-10-15 19:35:59.205308928,2019-10-15 19:35:59.205287186,12110084,T,IEX,54.710000,100
2019-10-15 19:35:59.210110976,2019-10-15 19:35:59.210089462,12110087,T,IEX,54.710000,18
2019-10-15 19:36:22.34403072,2019-10-15 19:36:22.34385854,12120388,T,IEX,54.710000,3
2019-10-15 19:36:22.34490112,2019-10-15 19:36:22.34473012,12120390,T,IEX,54.710000,97
2019-10-15 19:36:22.201404928,2019-10-15 19:36:22.201389753,12120478,T,IEX,54.705000,100
2019-10-15 19:36:24.198375936,2019-10-15 19:36:24.198359700,12121339,T,IEX,54.695000,100
2019-10-15 19:36:24.200342016,2019-10-15 19:36:24.200320193,12121340,T,IEX,54.700000,100
2019-10-15 19:36:25.200653056,2019-10-15 19:36:25.200633054,12121796,T,IEX,54.710000,100
2019-10-15 19:36:25.203630080,2019-10-15 19:36:25.203607030,12121798,T,IEX,54.710000,100
2019-10-15 19:36:37.145229056,2019-10-15 19:36:37.145212159,12127506,T,IEX,54.720000,100
2019-10-15 19:36:38.146935040,2019-10-15 19:36:38.146915570,12127863,T,IEX,54.715000,100
2019-10-15 19:36:50.29220096,2019-10-15 19:36:50.29197055,12132491,T,IEX,54.700000,498
2019-10-15 19:37:00.131694080,2019-10-15 19:37:00.131672947,12138680,T,IEX,54.695000,100
2019-10-15 19:37:07.935569920,2019-10-15 19:37:07.935553947,12142146,T,IEX,54.700000,100
2019-10-15 19:37:07.935590912,2019-10-15 19:37:07.935574057,12142147,T,IEX,54.700000,100
2019-10-15 19:37:07.935648000,2019-10-15 19:37:07.935630837,12142149,T,IEX,54.700000,100
2019-10-15 19:37:07.936407040,2019-10-15 19:37:07.936387298,12142150,T,IEX,54.700000,100
2019-10-15 19:37:31.680564992,2019-10-15 19:37:31.680542712,12152112,T,IEX,54.690000,100
2019-10-15 19:37:37.189248000,2019-10-15 19:37:37.189228518,12155734,T,IEX,54.680000,100
2019-10-15 19:37:38.48579072,2019-10-15 19:37:38.48560814,12156591,T,IEX,54.670000,10
2019-10-15 19:37:38.989843968,2019-10-15 19:37:38.989821198,12157254,T,IEX,54.670000,90
2019-10-15 19:37:48.842673920,2019-10-15 19:37:48.842654154,12163369,T,IEX,54.665000,100
2019-10-15 19:38:00.132574976,2019-10-15 19:38:00.132555063,12169353,T,IEX,54.655000,100
2019-10-15 19:38:20.132690944,2019-10-15 19:38:20.132669846,12178498,T,IEX,54.645000,100
2019-10-15 19:38:21.712869120,2019-10-15 19:38:21.712848000,12179170,T,IEX,54.645000,200
2019-10-15 19:38:23.833484032,2019-10-15 19:38:23.833464639,12180433,T,IEX,54.650000,100
2019-10-15 19:38:34.129287936,2019-10-15 19:38:34.129269659,12185424,T,IEX,54.645000,200
2019-10-15 19:38:36.104388096,2019-10-15 19:38:36.104370214,12186129,T,IEX,54.645000,100
2019-10-15 19:38:43.320315904,2019-10-15 19:38:43.320297374,12189777,T,IEX,54.650000,100
2019-10-15 19:38:47.718159104,2019-10-15 19:38:47.718141435,12191696,T,IEX,54.640000,100
2019-10-15 19:38:57.227959040,2019-10-15 19:38:57.227940994,12195281,T,IEX,54.630000,100
2019-10-15 19:39:05.491621888,2019-10-15 19:39:05.491604164,12199587,T,IEX,54.645000,300
2019-10-15 19:39:05.492550912,2019-10-15 19:39:05.492534938,12199589,T,IEX,54.645000,1200
2019-10-15 19:39:05.493486080,2019-10-15 19:39:05.493469801,12199591,T,IEX,54.645000,400
2019-10-15 19:39:07.493093120,2019-10-15 19:39:07.493070776,12200662,T,IEX,54.650000,100
2019-10-15 19:39:09.19910912,2019-10-15 19:39:09.19891219,12202496,T,IEX,54.650000,23
2019-10-15 19:39:39.323614976,2019-10-15 19:39:39.323597917,12218374,T,IEX,54.655000,100
2019-10-15 19:39:42.711515904,2019-10-15 19:39:42.711498157,12219858,T,IEX,54.645000,100
2019-10-15 19:39:48.825004032,2019-10-15 19:39:48.824984170,12222316,T,IEX,54.640000,100
2019-10-15 19:39:54.883222016,2019-10-15 19:39:54.883198573,12225082,T,IEX,54.660000,100
2019-10-15 19:39:58.614032896,2019-10-15 19:39:58.614012011,12226626,T,IEX,54.670000,100
2019-10-15 19:40:00.133656064,2019-10-15 19:40:00.133635896,12227980,T,IEX,54.665000,100
2019-10-15 19:40:13.233341952,2019-10-15 19:40:13.233324829,12235069,T,IEX,54.670000,1700
2019-10-15 19:40:23.679289088,2019-10-15 19:40:23.679271330,12239520,T,IEX,54.670000,100
2019-10-15 19:40:54.334631936,2019-10-15 19:40:54.334615122,12253115,T,IEX,54.675000,100
2019-10-15 19:40:57.264645888,2019-10-15 19:40:57.264623928,12254826,T,IEX,54.680000,100
2019-10-15 19:40:57.264659968,2019-10-15 19:40:57.264634382,12254827,T,IEX,54.680000,100
2019-10-15 19:40:57.264676096,2019-10-15 19:40:57.264647037,12254828,T,IEX,54.680000,100
2019-10-15 19:41:09.432596992,2019-10-15 19:41:09.432581139,12261989,T,IEX,54.660000,100
2019-10-15 19:41:30.959229952,2019-10-15 19:41:30.959209891,12273957,T,IEX,54.660000,100
2019-10-15 19:41:30.959261952,2019-10-15 19:41:30.959242186,12273960,T,IEX,54.660000,100
2019-10-15 19:41:30.961222912,2019-10-15 19:41:30.961196967,12274037,T,IEX,54.660000,9
2019-10-15 19:41:30.961243904,2019-10-15 19:41:30.961220478,12274039,T,IEX,54.660000,100
2019-10-15 19:42:11.160643072,2019-10-15 19:42:11.160621464,12292739,T,IEX,54.660000,50
2019-10-15 19:42:19.773414912,2019-10-15 19:42:19.773393077,12296656,T,IEX,54.660000,1
2019-10-15 19:42:45.535214080,2019-10-15 19:42:45.535196933,12311001,T,IEX,54.640000,4
2019-10-15 19:42:55.501742080,2019-10-15 19:42:55.501720586,12316566,T,IEX,54.640000,100
2019-10-15 19:42:55.501754112,2019-10-15 19:42:55.501737305,12316567,T,IEX,54.640000,200
2019-10-15 19:42:55.503493120,2019-10-15 19:42:55.503476087,12316570,T,IEX,54.635000,500
2019-10-15 19:42:57.578785024,2019-10-15 19:42:57.578753192,12317245,T,IEX,54.640000,100
2019-10-15 19:42:57.579968000,2019-10-15 19:42:57.579946759,12317293,T,IEX,54.640000,100
2019-10-15 19:43:14.6932992,2019-10-15 19:43:14.6912503,12325579,T,IEX,54.650000,100
2019-10-15 19:43:15.769579008,2019-10-15 19:43:15.769556107,12327024,T,IEX,54.650000,100
2019-10-15 19:43:35.769388032,2019-10-15 19:43:35.769370997,12334647,T,IEX,54.650000,100
2019-10-15 19:43:42.454240000,2019-10-15 19:43:42.454221013,12337687,T,IEX,54.660000,100
2019-10-15 19:43:50.834722048,2019-10-15 19:43:50.834701926,12340927,T,IEX,54.670000,100
2019-10-15 19:43:50.834893056,2019-10-15 19:43:50.834875603,12340929,T,IEX,54.665000,100
2019-10-15 19:43:52.632420096,2019-10-15 19:43:52.632402667,12342240,T,IEX,54.665000,100
2019-10-15 19:44:13.120196096,2019-10-15 19:44:13.120179362,12354680,T,IEX,54.660000,47
2019-10-15 19:44:13.120318976,2019-10-15 19:44:13.120302764,12354682,T,IEX,54.660000,2
2019-10-15 19:44:13.120339968,2019-10-15 19:44:13.120322580,12354683,T,IEX,54.660000,53
2019-10-15 19:44:18.953677056,2019-10-15 19:44:18.953659158,12357743,T,IEX,54.655000,6
2019-10-15 19:44:18.953696000,2019-10-15 19:44:18.953679023,12357744,T,IEX,54.655000,100
2019-10-15 19:45:07.306743040,2019-10-15 19:45:07.306722481,12391277,T,IEX,54.630000,10
2019-10-15 19:45:08.106181120,2019-10-15 19:45:08.106160084,12391648,T,IEX,54.630000,100
2019-10-15 19:45:10.105059072,2019-10-15 19:45:10.105037611,12393201,T,IEX,54.625000,100
2019-10-15 19:45:10.417817088,2019-10-15 19:45:10.417797769,12393472,T,IEX,54.625000,100
2019-10-15 19:45:10.807845888,2019-10-15 19:45:10.807825684,12394580,T,IEX,54.630000,78
2019-10-15 19:45:10.807866112,2019-10-15 19:45:10.807848374,12394581,T,IEX,54.630000,12
2019-10-15 19:45:13.664770048,2019-10-15 19:45:13.664741206,12396395,T,IEX,54.640000,200
2019-10-15 19:45:45.290119936,2019-10-15 19:45:45.290102953,12416373,T,IEX,54.650000,100
2019-10-15 19:45:51.783758080,2019-10-15 19:45:51.783739399,12420950,T,IEX,54.660000,100
2019-10-15 19:46:01.375003904,2019-10-15 19:46:01.374983930,12425875,T,IEX,54.670000,100
2019-10-15 19:46:07.706212096,2019-10-15 19:46:07.706195674,12429953,T,IEX,54.680000,100
2019-10-15 19:46:44.921340928,2019-10-15 19:46:44.921325004,12451410,T,IEX,54.680000,100
2019-10-15 19:46:44.921359104,2019-10-15 19:46:44.921340414,12451411,T,IEX,54.680000,36
2019-10-15 19:46:44.921560064,2019-10-15 19:46:44.921541885,12451414,T,IEX,54.680000,1
2019-10-15 19:46:44.921573888,2019-10-15 19:46:44.921554169,12451415,T,IEX,54.680000,64
2019-10-15 19:46:54.214323968,2019-10-15 19:46:54.214303303,12455880,T,IEX,54.670000,100
2019-10-15 19:46:54.214337024,2019-10-15 19:46:54.214318382,12455881,T,IEX,54.670000,100
2019-10-15 19:46:54.214362880,2019-10-15 19:46:54.214344113,12455882,T,IEX,54.670000,100
2019-10-15 19:46:57.774062080,2019-10-15 19:46:57.774042379,12458426,T,IEX,54.665000,100
2019-10-15 19:47:00.940068096,2019-10-15 19:47:00.940044017,12459944,T,IEX,54.670000,100
2019-10-15 19:47:04.437210112,2019-10-15 19:47:04.437192306,12461728,T,IEX,54.670000,100
2019-10-15 19:47:37.831613952,2019-10-15 19:47:37.831593774,12483773,T,IEX,54.670000,100
2019-10-15 19:47:48.363713024,2019-10-15 19:47:48.363691451,12489848,T,IEX,54.670000,100
2019-10-15 19:47:48.363729920,2019-10-15 19:47:48.363704799,12489849,T,IEX,54.670000,100
2019-10-15 19:47:48.364203008,2019-10-15 19:47:48.364185335,12489851,T,IEX,54.670000,100
2019-10-15 19:48:02.203938048,2019-10-15 19:48:02.203916226,12498580,T,IEX,54.670000,100
2019-10-15 19:48:02.305796096,2019-10-15 19:48:02.305777735,12498642,T,IEX,54.660000,100
2019-10-15 19:48:07.407165952,2019-10-15 19:48:07.407146881,12502194,T,IEX,54.650000,2
2019-10-15 19:48:07.407176960,2019-10-15 19:48:07.407159929,12502195,T,IEX,54.650000,4
2019-10-15 19:48:21.160835072,2019-10-15 19:48:21.160812257,12511657,T,IEX,54.660000,13
2019-10-15 19:48:21.160930048,2019-10-15 19:48:21.160910759,12511659,T,IEX,54.660000,100
2019-10-15 19:48:21.161062912,2019-10-15 19:48:21.161045390,12511661,T,IEX,54.660000,4
2019-10-15 19:48:21.161078016,2019-10-15 19:48:21.161059302,12511662,T,IEX,54.660000,5
2019-10-15 19:48:21.161093120,2019-10-15 19:48:21.161074430,12511663,T,IEX,54.660000,87
2019-10-15 19:48:21.161168896,2019-10-15 19:48:21.161151400,12511664,T,IEX,54.660000,100
2019-10-15 19:48:22.797978880,2019-10-15 19:48:22.797958878,12513315,T,IEX,54.670000,100
2019-10-15 19:48:42.372218112,2019-10-15 19:48:42.372201221,12528638,T,IEX,54.660000,1
2019-10-15 19:49:22.30147072,2019-10-15 19:49:22.30125158,12558863,T,IEX,54.640000,2
2019-10-15 19:49:27.76132096,2019-10-15 19:49:27.76104734,12562016,T,IEX,54.650000,100
2019-10-15 19:49:27.76144896,2019-10-15 19:49:27.76124284,12562018,T,IEX,54.650000,100
2019-10-15 19:49:27.76155904,2019-10-15 19:49:27.76133799,12562019,T,IEX,54.650000,100
2019-10-15 19:49:46.852559872,2019-10-15 19:49:46.852541985,12573639,T,IEX,54.630000,100
2019-10-15 19:49:46.852574976,2019-10-15 19:49:46.852557996,12573640,T,IEX,54.630000,200
2019-10-15 19:49:46.852847104,2019-10-15 19:49:46.852827709,12573642,T,IEX,54.630000,100
2019-10-15 19:50:01.504192000,2019-10-15 19:50:01.504173313,12590420,T,IEX,54.650000,100
2019-10-15 19:50:02.141730048,2019-10-15 19:50:02.141704205,12593803,T,IEX,54.640000,100
2019-10-15 19:50:02.511325952,2019-10-15 19:50:02.511308013,12594431,T,IEX,54.635000,7
2019-10-15 19:50:06.352616960,2019-10-15 19:50:06.352596054,12598152,T,IEX,54.650000,100
2019-10-15 19:50:06.352628992,2019-10-15 19:50:06.352611436,12598153,T,IEX,54.650000,100
2019-10-15 19:50:06.353049088,2019-10-15 19:50:06.353030923,12598155,T,IEX,54.650000,25
2019-10-15 19:50:06.353062912,2019-10-15 19:50:06.353045696,12598156,T,IEX,54.650000,100
2019-10-15 19:50:09.222725888,2019-10-15 19:50:09.222701971,12600302,T,IEX,54.640000,100
2019-10-15 19:50:13.635854080,2019-10-15 19:50:13.635832950,12602952,T,IEX,54.640000,99
2019-10-15 19:50:15.416440064,2019-10-15 19:50:15.416418325,12604172,T,IEX,54.640000,7
2019-10-15 19:50:15.416634880,2019-10-15 19:50:15.416617947,12604173,T,IEX,54.640000,20
2019-10-15 19:50:15.421946112,2019-10-15 19:50:15.421924712,12604175,T,IEX,54.635000,1
2019-10-15 19:50:15.421958912,2019-10-15 19:50:15.421941577,12604176,T,IEX,54.635000,1
2019-10-15 19:50:15.473337088,2019-10-15 19:50:15.473318402,12604238,T,IEX,54.650000,100
2019-10-15 19:50:24.608335872,2019-10-15 19:50:24.608319022,12609920,T,IEX,54.630000,100
2019-10-15 19:50:34.232722944,2019-10-15 19:50:34.232700559,12615178,T,IEX,54.630000,100
2019-10-15 19:50:36.444914944,2019-10-15 19:50:36.444887282,12616392,T,IEX,54.640000,100
2019-10-15 19:50:36.446989056,2019-10-15 19:50:36.446969167,12616497,T,IEX,54.640000,100
2019-10-15 19:50:56.953360896,2019-10-15 19:50:56.953339478,12630356,T,IEX,54.630000,100
2019-10-15 19:51:04.679878912,2019-10-15 19:51:04.679860549,12635549,T,IEX,54.620000,100
2019-10-15 19:51:08.337968128,2019-10-15 19:51:08.337949531,12637566,T,IEX,54.620000,100
2019-10-15 19:51:10.41150976,2019-10-15 19:51:10.41133971,12639385,T,IEX,54.630000,103
2019-10-15 19:51:10.524847104,2019-10-15 19:51:10.524829387,12639790,T,IEX,54.630000,100
2019-10-15 19:51:10.524976896,2019-10-15 19:51:10.524960932,12639793,T,IEX,54.630000,4
2019-10-15 19:51:10.524998912,2019-10-15 19:51:10.524980158,12639794,T,IEX,54.630000,96
2019-10-15 19:51:21.287257088,2019-10-15 19:51:21.287233830,12648100,T,IEX,54.620000,1
2019-10-15 19:51:21.287493888,2019-10-15 19:51:21.287475122,12648106,T,IEX,54.620000,99
2019-10-15 19:51:50.966031104,2019-10-15 19:51:50.966013259,12664457,T,IEX,54.610000,100
2019-10-15 19:51:50.966050048,2019-10-15 19:51:50.966033324,12664459,T,IEX,54.610000,100
2019-10-15 19:51:50.966063104,2019-10-15 19:51:50.966046278,12664460,T,IEX,54.610000,100
2019-10-15 19:51:57.25351936,2019-10-15 19:51:57.25333545,12667338,T,IEX,54.600000,3
2019-10-15 19:51:58.438210048,2019-10-15 19:51:58.438187201,12668161,T,IEX,54.610000,100
2019-10-15 19:51:58.445381888,2019-10-15 19:51:58.445366157,12668329,T,IEX,54.610000,5
2019-10-15 19:52:01.26544128,2019-10-15 19:52:01.26528101,12670311,T,IEX,54.605000,100
2019-10-15 19:52:06.542776064,2019-10-15 19:52:06.542752016,12674176,T,IEX,54.600000,1
2019-10-15 19:52:06.543009024,2019-10-15 19:52:06.542988227,12674190,T,IEX,54.600000,99
2019-10-15 19:52:06.543570944,2019-10-15 19:52:06.543552025,12674210,T,IEX,54.600000,100
2019-10-15 19:52:06.544062976,2019-10-15 19:52:06.544022459,12674230,T,IEX,54.600000,50
2019-10-15 19:52:07.154750976,2019-10-15 19:52:07.154729906,12676736,T,IEX,54.590000,100
2019-10-15 19:52:07.154768896,2019-10-15 19:52:07.154747923,12676738,T,IEX,54.590000,100
2019-10-15 19:52:10.281191936,2019-10-15 19:52:10.281173662,12679693,T,IEX,54.580000,100
2019-10-15 19:52:12.459212032,2019-10-15 19:52:12.459191526,12681290,T,IEX,54.580000,100
2019-10-15 19:52:20.547885056,2019-10-15 19:52:20.547856046,12686383,T,IEX,54.580000,100
2019-10-15 19:52:20.547911936,2019-10-15 19:52:20.547868670,12686386,T,IEX,54.580000,100
2019-10-15 19:52:23.521837056,2019-10-15 19:52:23.521818611,12689608,T,IEX,54.580000,7
2019-10-15 19:52:39.37723904,2019-10-15 19:52:39.37703984,12699991,T,IEX,54.580000,100
2019-10-15 19:52:46.525675008,2019-10-15 19:52:46.525659477,12704283,T,IEX,54.585000,65
2019-10-15 19:52:46.902277120,2019-10-15 19:52:46.902259651,12704599,T,IEX,54.580000,28
2019-10-15 19:52:50.757904896,2019-10-15 19:52:50.757883814,12707381,T,IEX,54.580000,100
2019-10-15 19:52:56.607433984,2019-10-15 19:52:56.607415972,12710880,T,IEX,54.580000,100
2019-10-15 19:53:07.825889024,2019-10-15 19:53:07.825869735,12718968,T,IEX,54.570000,100
2019-10-15 19:53:08.930754048,2019-10-15 19:53:08.930734957,12720424,T,IEX,54.560000,100
2019-10-15 19:53:08.930767872,2019-10-15 19:53:08.930751194,12720425,T,IEX,54.560000,100
2019-10-15 19:53:08.930788096,2019-10-15 19:53:08.930770345,12720426,T,IEX,54.560000,100
2019-10-15 19:53:24.669872128,2019-10-15 19:53:24.669850254,12731112,T,IEX,54.560000,100
2019-10-15 19:53:35.210882048,2019-10-15 19:53:35.210862224,12737146,T,IEX,54.550000,100
2019-10-15 19:53:41.854640896,2019-10-15 19:53:41.854615991,12744726,T,IEX,54.545000,1
2019-10-15 19:53:41.854652928,2019-10-15 19:53:41.854629995,12744727,T,IEX,54.540000,99
2019-10-15 19:53:43.747584000,2019-10-15 19:53:43.747562802,12747256,T,IEX,54.540000,100
2019-10-15 19:54:11.507226880,2019-10-15 19:54:11.507205582,12768027,T,IEX,54.530000,100
2019-10-15 19:54:18.592022016,2019-10-15 19:54:18.592003800,12772911,T,IEX,54.540000,100
2019-10-15 19:54:18.592050944,2019-10-15 19:54:18.592026147,12772913,T,IEX,54.540000,100
2019-10-15 19:54:18.592066048,2019-10-15 19:54:18.592041492,12772915,T,IEX,54.540000,100
2019-10-15 19:54:30.133839104,2019-10-15 19:54:30.133818734,12784277,T,IEX,54.510000,100
2019-10-15 19:54:30.133883904,2019-10-15 19:54:30.133866689,12784279,T,IEX,54.510000,100
2019-10-15 19:54:32.903503104,2019-10-15 19:54:32.903482112,12786771,T,IEX,54.510000,7
2019-10-15 19:54:32.903557888,2019-10-15 19:54:32.903538872,12786775,T,IEX,54.510000,93
2019-10-15 19:54:45.834299904,2019-10-15 19:54:45.834283304,12796809,T,IEX,54.520000,79
2019-10-15 19:54:56.774365952,2019-10-15 19:54:56.774335687,12806200,T,IEX,54.520000,100
2019-10-15 19:55:00.65265920,2019-10-15 19:55:00.65247606,12813905,T,IEX,54.525000,8
2019-10-15 19:55:00.68605952,2019-10-15 19:55:00.68583812,12814012,T,IEX,54.525000,8
2019-10-15 19:55:00.112705024,2019-10-15 19:55:00.112679356,12815196,T,IEX,54.535000,5
2019-10-15 19:55:00.112716032,2019-10-15 19:55:00.112694084,12815197,T,IEX,54.535000,1
2019-10-15 19:55:00.373517056,2019-10-15 19:55:00.373497966,12818893,T,IEX,54.510000,100
2019-10-15 19:55:07.744621056,2019-10-15 19:55:07.744603583,12838839,T,IEX,54.510000,100
2019-10-15 19:55:09.878138112,2019-10-15 19:55:09.878119762,12844441,T,IEX,54.520000,100
2019-10-15 19:55:20.52773888,2019-10-15 19:55:20.52753427,12858755,T,IEX,54.500000,100
2019-10-15 19:55:32.193075968,2019-10-15 19:55:32.193055621,12871996,T,IEX,54.520000,100
2019-10-15 19:56:03.301789952,2019-10-15 19:56:03.301771780,12903679,T,IEX,54.510000,100
2019-10-15 19:56:03.301800960,2019-10-15 19:56:03.301784921,12903680,T,IEX,54.510000,4
2019-10-15 19:56:11.39865088,2019-10-15 19:56:11.39845350,12912494,T,IEX,54.505000,100
2019-10-15 19:56:11.748555008,2019-10-15 19:56:11.748533827,12913126,T,IEX,54.510000,25
2019-10-15 19:56:11.748805888,2019-10-15 19:56:11.748786357,12913128,T,IEX,54.510000,4
2019-10-15 19:56:11.748817920,2019-10-15 19:56:11.748799477,12913129,T,IEX,54.510000,96
2019-10-15 19:56:11.769007104,2019-10-15 19:56:11.768989029,12913147,T,IEX,54.500000,100
2019-10-15 19:56:15.882255104,2019-10-15 19:56:15.882234894,12917441,T,IEX,54.510000,100
2019-10-15 19:56:29.612697088,2019-10-15 19:56:29.612680597,12929301,T,IEX,54.510000,100
2019-10-15 19:56:32.406593024,2019-10-15 19:56:32.406575216,12931818,T,IEX,54.510000,100
2019-10-15 19:56:37.347760128,2019-10-15 19:56:37.347738529,12938369,T,IEX,54.500000,100
2019-10-15 19:56:37.347769088,2019-10-15 19:56:37.347750913,12938370,T,IEX,54.500000,100
2019-10-15 19:56:37.347782912,2019-10-15 19:56:37.347766388,12938371,T,IEX,54.500000,100
2019-10-15 19:56:39.982774016,2019-10-15 19:56:39.982755027,12940770,T,IEX,54.490000,100
2019-10-15 19:56:43.358574080,2019-10-15 19:56:43.358552784,12945193,T,IEX,54.490000,100
2019-10-15 19:56:52.562624000,2019-10-15 19:56:52.562604113,12953065,T,IEX,54.500000,100
2019-10-15 19:57:02.24846080,2019-10-15 19:57:02.24825147,12965763,T,IEX,54.490000,100
2019-10-15 19:57:02.24861952,2019-10-15 19:57:02.24845177,12965764,T,IEX,54.490000,3
2019-10-15 19:57:10.233414912,2019-10-15 19:57:10.233394688,12975461,T,IEX,54.485000,100
2019-10-15 19:57:15.975681024,2019-10-15 19:57:15.975658870,12982170,T,IEX,54.480000,2
2019-10-15 19:57:16.723663872,2019-10-15 19:57:16.723640762,12982882,T,IEX,54.480000,100
2019-10-15 19:57:20.43161088,2019-10-15 19:57:20.43140531,12985574,T,IEX,54.480000,98
2019-10-15 19:57:32.415329024,2019-10-15 19:57:32.415312588,12997629,T,IEX,54.480000,100
2019-10-15 19:57:48.438189056,2019-10-15 19:57:48.438168274,13014545,T,IEX,54.480000,100
2019-10-15 19:57:48.438733056,2019-10-15 19:57:48.438712576,13014548,T,IEX,54.480000,100
2019-10-15 19:58:00.114342912,2019-10-15 19:58:00.114324748,13026648,T,IEX,54.485000,100
2019-10-15 19:58:04.365384960,2019-10-15 19:58:04.365366277,13033697,T,IEX,54.485000,100
2019-10-15 19:58:04.365402112,2019-10-15 19:58:04.365385362,13033698,T,IEX,54.485000,100
2019-10-15 19:58:04.374981888,2019-10-15 19:58:04.374962374,13033750,T,IEX,54.485000,100
2019-10-15 19:58:05.976175104,2019-10-15 19:58:05.976153630,13035670,T,IEX,54.485000,100
2019-10-15 19:58:06.33249024,2019-10-15 19:58:06.33228616,13035782,T,IEX,54.480000,64
2019-10-15 19:58:06.510311936,2019-10-15 19:58:06.510289734,13036388,T,IEX,54.480000,10
2019-10-15 19:58:10.435340032,2019-10-15 19:58:10.435317880,13041507,T,IEX,54.490000,100
2019-10-15 19:58:10.435354880,2019-10-15 19:58:10.435336549,13041508,T,IEX,54.490000,100
2019-10-15 19:58:10.435373056,2019-10-15 19:58:10.435355328,13041509,T,IEX,54.490000,100
2019-10-15 19:58:10.435393024,2019-10-15 19:58:10.435374536,13041510,T,IEX,54.490000,100
2019-10-15 19:58:14.5624064,2019-10-15 19:58:14.5606650,13045978,T,IEX,54.495000,100
2019-10-15 19:58:15.255927040,2019-10-15 19:58:15.255910478,13048032,T,IEX,54.510000,100
2019-10-15 19:58:25.420011008,2019-10-15 19:58:25.419989793,13060919,T,IEX,54.500000,100
2019-10-15 19:58:40.99737088,2019-10-15 19:58:40.99711516,13080575,T,IEX,54.520000,10
2019-10-15 19:58:44.255998976,2019-10-15 19:58:44.255978471,13085578,T,IEX,54.520000,100
2019-10-15 19:58:44.256536064,2019-10-15 19:58:44.256514629,13085580,T,IEX,54.520000,90
2019-10-15 19:58:50.398512128,2019-10-15 19:58:50.398491626,13092913,T,IEX,54.520000,100
2019-10-15 19:58:56.809666048,2019-10-15 19:58:56.809643836,13103430,T,IEX,54.510000,100
2019-10-15 19:58:56.809890048,2019-10-15 19:58:56.809844155,13103454,T,IEX,54.510000,100
2019-10-15 19:58:56.809890048,2019-10-15 19:58:56.809844155,13103458,T,IEX,54.510000,100
2019-10-15 19:58:56.817548032,2019-10-15 19:58:56.817529948,13103733,T,IEX,54.510000,100
2019-10-15 19:58:57.205600000,2019-10-15 19:58:57.205578692,13104983,T,IEX,54.510000,100
2019-10-15 19:59:03.7191040,2019-10-15 19:59:03.7174484,13115609,T,IEX,54.510000,100
2019-10-15 19:59:04.348185088,2019-10-15 19:59:04.348163125,13118484,T,IEX,54.510000,100
2019-10-15 19:59:13.601334016,2019-10-15 19:59:13.601317342,13135515,T,IEX,54.505000,100
2019-10-15 19:59:13.602906112,2019-10-15 19:59:13.602887158,13135517,T,IEX,54.505000,100
2019-10-15 19:59:13.604720896,2019-10-15 19:59:13.604704240,13135519,T,IEX,54.505000,100
2019-10-15 19:59:13.637545984,2019-10-15 19:59:13.637527382,13135780,T,IEX,54.500000,100
2019-10-15 19:59:17.611596032,2019-10-15 19:59:17.611578390,13143125,T,IEX,54.495000,100
2019-10-15 19:59:17.613609984,2019-10-15 19:59:17.613589445,13143127,T,IEX,54.495000,100
2019-10-15 19:59:17.806761984,2019-10-15 19:59:17.806744899,13143348,T,IEX,54.495000,100
2019-10-15 19:59:18.620751104,2019-10-15 19:59:18.620732730,13144677,T,IEX,54.495000,58
2019-10-15 19:59:22.44049920,2019-10-15 19:59:22.44031730,13149751,T,IEX,54.490000,100
2019-10-15 19:59:22.44060928,2019-10-15 19:59:22.44044122,13149752,T,IEX,54.490000,100
2019-10-15 19:59:23.289306112,2019-10-15 19:59:23.289289899,13151243,T,IEX,54.480000,10
2019-10-15 19:59:24.110907904,2019-10-15 19:59:24.110889491,13152119,T,IEX,54.490000,100
2019-10-15 19:59:24.112455936,2019-10-15 19:59:24.112435647,13152122,T,IEX,54.490000,8
2019-10-15 19:59:27.8112896,2019-10-15 19:59:27.8094584,13157295,T,IEX,54.485000,100
2019-10-15 19:59:29.244145920,2019-10-15 19:59:29.244128387,13160218,T,IEX,54.490000,92
2019-10-15 19:59:30.346038016,2019-10-15 19:59:30.346019671,13166860,T,IEX,54.500000,100
2019-10-15 19:59:36.858544128,2019-10-15 19:59:36.858526821,13207984,T,IEX,54.510000,100
2019-10-15 19:59:39.402201088,2019-10-15 19:59:39.402178727,13218742,T,IEX,54.505000,3
2019-10-15 19:59:39.402214912,2019-10-15 19:59:39.402198569,13218743,T,IEX,54.500000,97
2019-10-15 19:59:40.327439872,2019-10-15 19:59:40.327423547,13225268,T,IEX,54.500000,3
2019-10-15 19:59:45.624898048,2019-10-15 19:59:45.624859584,13255894,T,IEX,54.510000,195
2019-10-15 19:59:45.876220928,2019-10-15 19:59:45.876203800,13257248,T,IEX,54.500000,2
2019-10-15 19:59:49.76214016,2019-10-15 19:59:49.76183193,13272082,T,IEX,54.510000,100
2019-10-15 19:59:51.528414976,2019-10-15 19:59:51.528397503,13291816,T,IEX,54.510000,5
2019-10-15 19:59:55.28135936,2019-10-15 19:59:55.28110332,13311829,T,IEX,54.520000,100
2019-10-15 19:59:57.28720896,2019-10-15 19:59:57.28684115,13328044,T,IEX,54.520000,100
