2019-10-10 13:21:58.117319936,2019-10-10 13:21:58.117297759,60046,T,IEX,30.660000,2600
2019-10-10 13:30:09.776200960,2019-10-10 13:30:09.776176922,110687,T,IEX,30.650000,100
2019-10-10 13:30:22.555186944,2019-10-10 13:30:22.555159771,128128,T,IEX,30.630000,100
2019-10-10 13:32:08.951462912,2019-10-10 13:32:08.951441277,273574,T,IEX,30.630000,100
2019-10-10 13:32:19.418520064,2019-10-10 13:32:19.418498944,288367,T,IEX,30.600000,100
2019-10-10 13:32:38.717319936,2019-10-10 13:32:38.717299656,314541,T,IEX,30.610000,100
2019-10-10 13:32:48.155680000,2019-10-10 13:32:48.155657695,327697,T,IEX,30.630000,100
2019-10-10 13:33:08.303723008,2019-10-10 13:33:08.303698047,353926,T,IEX,30.590000,100
2019-10-10 13:33:39.926479872,2019-10-10 13:33:39.926456586,403985,T,IEX,30.600000,100
2019-10-10 13:33:48.14508032,2019-10-10 13:33:48.14490636,413980,T,IEX,30.590000,100
2019-10-10 13:34:24.719388928,2019-10-10 13:34:24.719372144,463461,T,IEX,30.600000,100
2019-10-10 13:38:24.658546944,2019-10-10 13:38:24.658527815,755226,T,IEX,30.580000,3000
2019-10-10 13:49:57.146130944,2019-10-10 13:49:57.146112504,1493788,T,IEX,30.420000,200
2019-10-10 13:50:14.10355968,2019-10-10 13:50:14.10335902,1580812,T,IEX,30.400000,100
2019-10-10 13:50:14.10680064,2019-10-10 13:50:14.10662471,1580834,T,IEX,30.400000,500
2019-10-10 14:03:50.869201920,2019-10-10 14:03:50.869183494,2879071,T,IEX,30.240000,400
2019-10-10 14:23:28.440474112,2019-10-10 14:23:28.440456209,4200827,T,IEX,30.230000,100
2019-10-10 15:19:52.78754048,2019-10-10 15:19:52.78733079,7134633,T,IEX,30.005000,200
2019-10-10 15:19:52.266629120,2019-10-10 15:19:52.266610568,7134863,T,IEX,30.005000,100
2019-10-10 15:19:52.266683904,2019-10-10 15:19:52.266665744,7134864,T,IEX,30.005000,64
2019-10-10 15:30:43.66482944,2019-10-10 15:30:43.66456206,7558221,T,IEX,30.025000,200
2019-10-10 16:09:06.169312000,2019-10-10 16:09:06.169292137,8853247,T,IEX,30.060000,100
2019-10-10 16:14:52.814475008,2019-10-10 16:14:52.814455882,9047143,T,IEX,30.090000,100
2019-10-10 16:22:24.211233024,2019-10-10 16:22:24.211214348,9279704,T,IEX,30.140000,300
2019-10-10 16:22:24.220594944,2019-10-10 16:22:24.220570453,9280013,T,IEX,30.140000,100
2019-10-10 17:30:56.278900992,2019-10-10 17:30:56.278883025,11277987,T,IEX,30.300000,100
2019-10-10 17:31:13.362964992,2019-10-10 17:31:13.362945061,11305005,T,IEX,30.320000,100
2019-10-10 17:33:36.600368128,2019-10-10 17:33:36.600347830,11388862,T,IEX,30.295000,100
2019-10-10 18:07:04.655568896,2019-10-10 18:07:04.655549770,12330891,T,IEX,30.240000,100
2019-10-10 18:09:06.898471936,2019-10-10 18:09:06.898449140,12702542,T,IEX,30.440000,100
2019-10-10 18:09:06.914363904,2019-10-10 18:09:06.914343628,12702782,T,IEX,30.440000,100
2019-10-10 18:09:07.589556992,2019-10-10 18:09:07.589531755,12704614,T,IEX,30.435000,100
2019-10-10 18:09:07.594637056,2019-10-10 18:09:07.594618244,12704843,T,IEX,30.435000,100
2019-10-10 18:09:08.314956032,2019-10-10 18:09:08.314935865,12707202,T,IEX,30.425000,100
2019-10-10 18:11:39.498123008,2019-10-10 18:11:39.498103021,13000606,T,IEX,30.290000,200
2019-10-10 18:11:39.498774016,2019-10-10 18:11:39.498755122,13000630,T,IEX,30.290000,100
2019-10-10 18:16:54.140730880,2019-10-10 18:16:54.140712259,13311770,T,IEX,30.240000,100
2019-10-10 18:17:01.113542912,2019-10-10 18:17:01.113523377,13315284,T,IEX,30.240000,100
2019-10-10 18:43:17.227514112,2019-10-10 18:43:17.227495953,14303813,T,IEX,30.320000,100
2019-10-10 19:04:59.987333888,2019-10-10 19:04:59.987308962,15023305,T,IEX,30.260000,100
2019-10-10 19:40:16.971785984,2019-10-10 19:40:16.971766797,16156803,T,IEX,30.245000,120
2019-10-10 19:40:16.986722048,2019-10-10 19:40:16.986700737,16157281,T,IEX,30.240000,400
2019-10-10 19:43:13.595819008,2019-10-10 19:43:13.595796226,16267958,T,IEX,30.225000,100
2019-10-10 19:50:31.922339072,2019-10-10 19:50:31.922323565,16594887,T,IEX,30.175000,500
