2019-10-22 19:44:36.980385024,2019-10-22 19:44:36.980367075,12451606,T,IEX,27.240000,6
2019-10-22 19:57:17.332882944,2019-10-22 19:57:17.332864257,13140904,T,IEX,27.280000,200
2019-10-22 19:57:17.332900096,2019-10-22 19:57:17.332881231,13140906,T,IEX,27.280000,200
