2019-10-17 13:30:35.59147008,2019-10-17 13:30:35.59119971,168156,T,IEX,208.850000,100
2019-10-17 13:30:39.936055040,2019-10-17 13:30:39.936031030,175673,T,IEX,208.750000,16
2019-10-17 13:31:28.850798080,2019-10-17 13:31:28.850772839,232397,T,IEX,208.790000,100
2019-10-17 13:31:28.850853120,2019-10-17 13:31:28.850831723,232398,T,IEX,208.820000,100
2019-10-17 13:31:34.412846080,2019-10-17 13:31:34.412825066,238610,T,IEX,208.770000,100
2019-10-17 13:32:09.55956992,2019-10-17 13:32:09.55935319,276001,T,IEX,208.800000,100
2019-10-17 13:32:13.200774912,2019-10-17 13:32:13.200752808,281354,T,IEX,208.845000,56
2019-10-17 13:32:29.179196928,2019-10-17 13:32:29.179169146,300283,T,IEX,208.640000,100
2019-10-17 13:32:36.278174976,2019-10-17 13:32:36.278150406,307578,T,IEX,208.470000,100
2019-10-17 13:33:55.713346048,2019-10-17 13:33:55.713327664,412670,T,IEX,208.800000,100
2019-10-17 13:34:16.482132992,2019-10-17 13:34:16.482115559,443826,T,IEX,208.305000,100
2019-10-17 13:35:37.546767104,2019-10-17 13:35:37.546744733,545970,T,IEX,208.090000,100
2019-10-17 13:37:52.865165056,2019-10-17 13:37:52.865143702,718061,T,IEX,207.985000,100
2019-10-17 13:37:52.867119104,2019-10-17 13:37:52.867103948,718063,T,IEX,207.985000,100
2019-10-17 13:37:52.874188032,2019-10-17 13:37:52.874166205,718074,T,IEX,207.990000,100
2019-10-17 13:38:00.284675072,2019-10-17 13:38:00.284659084,724830,T,IEX,207.990000,100
2019-10-17 13:38:47.290530048,2019-10-17 13:38:47.290508237,780909,T,IEX,207.995000,100
2019-10-17 13:38:52.722308096,2019-10-17 13:38:52.722288685,785425,T,IEX,208.010000,100
2019-10-17 13:39:31.901569024,2019-10-17 13:39:31.901551084,827552,T,IEX,207.620000,100
2019-10-17 13:39:36.939627008,2019-10-17 13:39:36.939605902,832190,T,IEX,207.655000,100
2019-10-17 13:39:36.939759104,2019-10-17 13:39:36.939737930,832191,T,IEX,207.700000,100
2019-10-17 13:39:36.940817920,2019-10-17 13:39:36.940797213,832193,T,IEX,207.710000,100
2019-10-17 13:39:36.943546880,2019-10-17 13:39:36.943526584,832196,T,IEX,207.710000,100
2019-10-17 13:39:37.219909888,2019-10-17 13:39:37.219888969,832361,T,IEX,207.700000,200
2019-10-17 13:39:51.940823040,2019-10-17 13:39:51.940800531,844455,T,IEX,207.790000,100
2019-10-17 13:39:51.941307904,2019-10-17 13:39:51.941292332,844456,T,IEX,207.730000,4
2019-10-17 13:39:51.942705920,2019-10-17 13:39:51.942688580,844459,T,IEX,207.810000,200
2019-10-17 13:41:19.8761088,2019-10-17 13:41:19.8743106,928033,T,IEX,207.915000,1
2019-10-17 13:41:36.302112000,2019-10-17 13:41:36.302091996,946838,T,IEX,207.960000,100
2019-10-17 13:41:36.326277120,2019-10-17 13:41:36.326260301,946849,T,IEX,207.980000,3
2019-10-17 13:41:36.326305024,2019-10-17 13:41:36.326288532,946850,T,IEX,207.980000,697
2019-10-17 13:41:49.621339904,2019-10-17 13:41:49.621322296,957965,T,IEX,208.000000,6
2019-10-17 13:41:50.160975104,2019-10-17 13:41:50.160957690,958450,T,IEX,208.010000,3
2019-10-17 13:42:09.292487936,2019-10-17 13:42:09.292472186,977080,T,IEX,208.010000,100
2019-10-17 13:42:15.774594048,2019-10-17 13:42:15.774575039,983004,T,IEX,208.135000,1
2019-10-17 13:42:24.990205952,2019-10-17 13:42:24.990188722,990939,T,IEX,207.890000,100
2019-10-17 13:43:24.825966080,2019-10-17 13:43:24.825944631,1047743,T,IEX,207.880000,100
2019-10-17 13:44:15.136079104,2019-10-17 13:44:15.136057783,1088843,T,IEX,207.670000,5
2019-10-17 13:44:39.622234112,2019-10-17 13:44:39.622215053,1105315,T,IEX,207.620000,5
2019-10-17 13:44:39.622522112,2019-10-17 13:44:39.622506386,1105325,T,IEX,207.600000,100
2019-10-17 13:44:51.988331008,2019-10-17 13:44:51.988312519,1118328,T,IEX,207.805000,100
2019-10-17 13:44:54.295835904,2019-10-17 13:44:54.295820090,1120471,T,IEX,207.770000,100
2019-10-17 13:45:09.899478016,2019-10-17 13:45:09.899461615,1142155,T,IEX,207.785000,4
2019-10-17 13:45:42.811134976,2019-10-17 13:45:42.811115181,1174739,T,IEX,207.740000,1
2019-10-17 13:45:42.839051008,2019-10-17 13:45:42.839029082,1174752,T,IEX,207.730000,4
2019-10-17 13:45:53.84690944,2019-10-17 13:45:53.84674079,1184978,T,IEX,207.690000,100
2019-10-17 13:45:53.84721920,2019-10-17 13:45:53.84702820,1184980,T,IEX,207.700000,100
2019-10-17 13:46:05.93277952,2019-10-17 13:46:05.93258152,1197577,T,IEX,207.705000,100
2019-10-17 13:47:06.275974912,2019-10-17 13:47:06.275957273,1257169,T,IEX,207.930000,100
2019-10-17 13:47:11.871741952,2019-10-17 13:47:11.871721930,1262375,T,IEX,207.920000,100
2019-10-17 13:47:33.26035968,2019-10-17 13:47:33.26018575,1285468,T,IEX,207.915000,4
2019-10-17 13:47:35.746036992,2019-10-17 13:47:35.746018918,1288082,T,IEX,207.925000,1
2019-10-17 13:48:24.756990976,2019-10-17 13:48:24.756972938,1336223,T,IEX,208.035000,100
2019-10-17 13:48:24.759823872,2019-10-17 13:48:24.759805207,1336234,T,IEX,208.035000,100
2019-10-17 13:48:28.726466048,2019-10-17 13:48:28.726444826,1341107,T,IEX,208.000000,4
2019-10-17 13:48:32.436528896,2019-10-17 13:48:32.436511041,1344158,T,IEX,208.015000,3
2019-10-17 13:48:54.762173952,2019-10-17 13:48:54.762157903,1366148,T,IEX,208.160000,3
2019-10-17 13:49:07.738746112,2019-10-17 13:49:07.738727071,1381543,T,IEX,208.160000,200
2019-10-17 13:49:09.339961088,2019-10-17 13:49:09.339940163,1383683,T,IEX,208.120000,500
2019-10-17 13:49:43.152624128,2019-10-17 13:49:43.152602523,1410976,T,IEX,208.080000,100
2019-10-17 13:49:46.238639104,2019-10-17 13:49:46.238621970,1413730,T,IEX,208.045000,100
2019-10-17 13:50:00.227150080,2019-10-17 13:50:00.227131435,1424170,T,IEX,208.100000,100
2019-10-17 13:50:06.31970048,2019-10-17 13:50:06.31951302,1432216,T,IEX,208.145000,100
2019-10-17 13:50:06.31988992,2019-10-17 13:50:06.31971128,1432217,T,IEX,208.145000,100
2019-10-17 13:50:06.37308928,2019-10-17 13:50:06.37288087,1432225,T,IEX,208.190000,100
2019-10-17 13:50:26.772540928,2019-10-17 13:50:26.772519364,1456088,T,IEX,208.000000,100
2019-10-17 13:50:31.235737088,2019-10-17 13:50:31.235714927,1460361,T,IEX,207.965000,100
2019-10-17 13:50:37.233462016,2019-10-17 13:50:37.233446707,1466469,T,IEX,208.055000,100
2019-10-17 13:50:42.181780992,2019-10-17 13:50:42.181761514,1471022,T,IEX,208.120000,37
2019-10-17 13:50:42.185175040,2019-10-17 13:50:42.185153782,1471024,T,IEX,208.120000,50
2019-10-17 13:50:44.764438016,2019-10-17 13:50:44.764419507,1473388,T,IEX,208.120000,64
2019-10-17 13:50:54.114416896,2019-10-17 13:50:54.114395475,1480987,T,IEX,208.225000,100
2019-10-17 13:50:54.114435072,2019-10-17 13:50:54.114417839,1480988,T,IEX,208.225000,100
2019-10-17 13:50:54.114452992,2019-10-17 13:50:54.114436187,1480989,T,IEX,208.225000,100
2019-10-17 13:51:15.237943040,2019-10-17 13:51:15.237925001,1503028,T,IEX,208.095000,100
2019-10-17 13:52:03.314769920,2019-10-17 13:52:03.314749742,1549155,T,IEX,208.130000,36
2019-10-17 13:52:03.315531008,2019-10-17 13:52:03.315515940,1549156,T,IEX,208.130000,100
2019-10-17 13:52:20.442151936,2019-10-17 13:52:20.442131787,1563113,T,IEX,208.190000,100
2019-10-17 13:52:20.443397120,2019-10-17 13:52:20.443377434,1563114,T,IEX,208.190000,100
2019-10-17 13:52:49.836439040,2019-10-17 13:52:49.836417970,1588698,T,IEX,208.220000,100
2019-10-17 13:52:49.836453888,2019-10-17 13:52:49.836437777,1588699,T,IEX,208.260000,200
2019-10-17 13:53:25.555911936,2019-10-17 13:53:25.555894500,1620790,T,IEX,208.045000,100
2019-10-17 13:54:06.823352064,2019-10-17 13:54:06.823336290,1655325,T,IEX,207.945000,100
2019-10-17 13:54:45.46286080,2019-10-17 13:54:45.46265536,1687937,T,IEX,207.750000,100
2019-10-17 13:55:09.52924928,2019-10-17 13:55:09.52907574,1709131,T,IEX,207.740000,100
2019-10-17 13:55:28.253811968,2019-10-17 13:55:28.253793709,1724614,T,IEX,207.770000,100
2019-10-17 13:55:39.963632896,2019-10-17 13:55:39.963616131,1734341,T,IEX,207.800000,100
2019-10-17 13:56:08.454784000,2019-10-17 13:56:08.454766226,1763228,T,IEX,207.760000,100
2019-10-17 13:56:33.848951040,2019-10-17 13:56:33.848933391,1782825,T,IEX,207.660000,100
2019-10-17 13:56:42.858416128,2019-10-17 13:56:42.858399504,1790348,T,IEX,207.695000,100
2019-10-17 13:57:16.24844032,2019-10-17 13:57:16.24823896,1817124,T,IEX,207.715000,100
2019-10-17 13:57:33.614479872,2019-10-17 13:57:33.614457946,1829242,T,IEX,207.730000,37
2019-10-17 13:57:51.323980032,2019-10-17 13:57:51.323958711,1840069,T,IEX,207.730000,100
2019-10-17 13:58:09.322865920,2019-10-17 13:58:09.322847943,1854428,T,IEX,207.770000,100
2019-10-17 13:58:38.497063936,2019-10-17 13:58:38.497044919,1883090,T,IEX,207.805000,100
2019-10-17 13:58:38.497086976,2019-10-17 13:58:38.497069715,1883091,T,IEX,207.805000,100
2019-10-17 13:59:15.644905984,2019-10-17 13:59:15.644885569,1916782,T,IEX,207.745000,100
2019-10-17 13:59:27.483763968,2019-10-17 13:59:27.483744385,1927595,T,IEX,207.695000,100
2019-10-17 13:59:27.543395072,2019-10-17 13:59:27.543377774,1927640,T,IEX,207.730000,100
2019-10-17 13:59:27.888199936,2019-10-17 13:59:27.888179060,1927842,T,IEX,207.690000,84
2019-10-17 14:00:47.33231872,2019-10-17 14:00:47.33216377,2002377,T,IEX,207.610000,100
2019-10-17 14:01:01.409617920,2019-10-17 14:01:01.409602038,2015626,T,IEX,207.620000,100
2019-10-17 14:01:22.118612992,2019-10-17 14:01:22.118591141,2036430,T,IEX,207.635000,100
2019-10-17 14:01:22.118631936,2019-10-17 14:01:22.118602010,2036432,T,IEX,207.635000,100
2019-10-17 14:02:24.900677888,2019-10-17 14:02:24.900660409,2096859,T,IEX,207.530000,100
2019-10-17 14:03:46.515546880,2019-10-17 14:03:46.515528056,2169418,T,IEX,207.430000,100
2019-10-17 14:03:46.515557120,2019-10-17 14:03:46.515540574,2169419,T,IEX,207.430000,100
2019-10-17 14:04:00.22434048,2019-10-17 14:04:00.22418929,2178168,T,IEX,207.410000,100
2019-10-17 14:04:00.26038016,2019-10-17 14:04:00.26014983,2178172,T,IEX,207.410000,100
2019-10-17 14:04:01.114749952,2019-10-17 14:04:01.114732983,2178905,T,IEX,207.395000,100
2019-10-17 14:04:02.69961984,2019-10-17 14:04:02.69943813,2179446,T,IEX,207.395000,100
2019-10-17 14:04:11.479547904,2019-10-17 14:04:11.479527054,2187912,T,IEX,207.370000,118
2019-10-17 14:04:18.992461056,2019-10-17 14:04:18.992443763,2193261,T,IEX,207.320000,100
2019-10-17 14:04:19.90112,2019-10-17 14:04:19.73566,2193276,T,IEX,207.350000,262
2019-10-17 14:04:19.187904,2019-10-17 14:04:19.171795,2193277,T,IEX,207.350000,100
2019-10-17 14:04:19.89504000,2019-10-17 14:04:19.89488927,2193366,T,IEX,207.400000,100
2019-10-17 14:04:19.157133056,2019-10-17 14:04:19.157110684,2193426,T,IEX,207.400000,100
2019-10-17 14:04:19.158372096,2019-10-17 14:04:19.158350828,2193428,T,IEX,207.400000,100
2019-10-17 14:04:19.937281024,2019-10-17 14:04:19.937260557,2193934,T,IEX,207.400000,100
2019-10-17 14:04:19.956879104,2019-10-17 14:04:19.956859299,2193941,T,IEX,207.400000,100
2019-10-17 14:04:29.485861888,2019-10-17 14:04:29.485843252,2201363,T,IEX,207.370000,100
2019-10-17 14:04:40.945014016,2019-10-17 14:04:40.944992216,2209983,T,IEX,207.380000,100
2019-10-17 14:04:42.892722944,2019-10-17 14:04:42.892702372,2212459,T,IEX,207.375000,100
2019-10-17 14:04:57.80819968,2019-10-17 14:04:57.80798451,2223161,T,IEX,207.385000,100
2019-10-17 14:05:02.429555968,2019-10-17 14:05:02.429533630,2227632,T,IEX,207.385000,100
2019-10-17 14:05:04.840908032,2019-10-17 14:05:04.840886394,2229484,T,IEX,207.410000,127
2019-10-17 14:05:05.842329088,2019-10-17 14:05:05.842306933,2230499,T,IEX,207.395000,100
2019-10-17 14:05:07.139777024,2019-10-17 14:05:07.139754200,2231535,T,IEX,207.405000,100
2019-10-17 14:05:07.892339968,2019-10-17 14:05:07.892321530,2232668,T,IEX,207.425000,100
2019-10-17 14:05:09.335448064,2019-10-17 14:05:09.335431622,2233956,T,IEX,207.430000,100
2019-10-17 14:05:14.165349120,2019-10-17 14:05:14.165332836,2236793,T,IEX,207.400000,100
2019-10-17 14:05:14.403442944,2019-10-17 14:05:14.403425242,2236895,T,IEX,207.400000,100
2019-10-17 14:05:19.180823040,2019-10-17 14:05:19.180803235,2240259,T,IEX,207.400000,100
2019-10-17 14:05:20.178653952,2019-10-17 14:05:20.178636949,2241610,T,IEX,207.460000,131
2019-10-17 14:05:20.278263040,2019-10-17 14:05:20.278246506,2241757,T,IEX,207.460000,100
2019-10-17 14:05:20.283593984,2019-10-17 14:05:20.283576866,2241770,T,IEX,207.460000,164
2019-10-17 14:05:21.107518976,2019-10-17 14:05:21.107502703,2242723,T,IEX,207.460000,100
2019-10-17 14:05:37.117067008,2019-10-17 14:05:37.117047478,2257797,T,IEX,207.450000,100
2019-10-17 14:05:42.334761984,2019-10-17 14:05:42.334741475,2262932,T,IEX,207.325000,100
2019-10-17 14:05:45.335400960,2019-10-17 14:05:45.335383885,2267851,T,IEX,207.265000,100
2019-10-17 14:05:53.85061120,2019-10-17 14:05:53.85042526,2274965,T,IEX,207.235000,100
2019-10-17 14:06:04.793323008,2019-10-17 14:06:04.793300931,2285530,T,IEX,207.245000,100
2019-10-17 14:06:09.29861120,2019-10-17 14:06:09.29841876,2289795,T,IEX,207.255000,100
2019-10-17 14:06:15.30743040,2019-10-17 14:06:15.30725636,2295215,T,IEX,207.250000,100
2019-10-17 14:06:22.119483904,2019-10-17 14:06:22.119463933,2300112,T,IEX,207.245000,200
2019-10-17 14:06:24.841722880,2019-10-17 14:06:24.841698977,2302462,T,IEX,207.270000,200
2019-10-17 14:06:25.76475904,2019-10-17 14:06:25.76452311,2302591,T,IEX,207.270000,100
2019-10-17 14:06:49.891465984,2019-10-17 14:06:49.891450218,2321159,T,IEX,207.295000,100
2019-10-17 14:06:49.891486976,2019-10-17 14:06:49.891470394,2321160,T,IEX,207.295000,100
2019-10-17 14:06:49.904825088,2019-10-17 14:06:49.904804420,2321171,T,IEX,207.295000,100
2019-10-17 14:07:37.912686080,2019-10-17 14:07:37.912667378,2360052,T,IEX,207.000000,100
2019-10-17 14:07:47.360421888,2019-10-17 14:07:47.360405759,2366237,T,IEX,206.975000,100
2019-10-17 14:07:52.979781120,2019-10-17 14:07:52.979759919,2370518,T,IEX,206.770000,100
2019-10-17 14:08:00.632047104,2019-10-17 14:08:00.632026780,2376331,T,IEX,206.730000,100
2019-10-17 14:10:41.920135936,2019-10-17 14:10:41.920117490,2507865,T,IEX,206.900000,100
2019-10-17 14:10:42.347204096,2019-10-17 14:10:42.347188091,2508322,T,IEX,206.860000,100
2019-10-17 14:11:40.246578944,2019-10-17 14:11:40.246561107,2548126,T,IEX,206.780000,100
2019-10-17 14:12:42.198984960,2019-10-17 14:12:42.198964606,2595295,T,IEX,206.655000,100
2019-10-17 14:13:33.223857920,2019-10-17 14:13:33.223843046,2633654,T,IEX,206.690000,100
2019-10-17 14:13:39.385765120,2019-10-17 14:13:39.385742887,2636873,T,IEX,206.690000,100
2019-10-17 14:13:48.353715968,2019-10-17 14:13:48.353695567,2643057,T,IEX,206.710000,100
2019-10-17 14:14:02.399068928,2019-10-17 14:14:02.399047843,2653078,T,IEX,206.705000,100
2019-10-17 14:14:02.399084032,2019-10-17 14:14:02.399067538,2653079,T,IEX,206.705000,3
2019-10-17 14:14:03.650586880,2019-10-17 14:14:03.650567714,2654101,T,IEX,206.695000,3
2019-10-17 14:14:05.835204096,2019-10-17 14:14:05.835185492,2655312,T,IEX,206.695000,6
2019-10-17 14:14:05.836498944,2019-10-17 14:14:05.836476622,2655313,T,IEX,206.710000,100
2019-10-17 14:14:05.887087104,2019-10-17 14:14:05.887065569,2655331,T,IEX,206.695000,100
2019-10-17 14:14:05.888041984,2019-10-17 14:14:05.888023940,2655332,T,IEX,206.695000,6
2019-10-17 14:14:08.38861056,2019-10-17 14:14:08.38843850,2656229,T,IEX,206.690000,100
2019-10-17 14:14:08.40090112,2019-10-17 14:14:08.40070505,2656231,T,IEX,206.700000,100
2019-10-17 14:14:08.52978944,2019-10-17 14:14:08.52959042,2656233,T,IEX,206.710000,63
2019-10-17 14:14:09.710987008,2019-10-17 14:14:09.710967351,2657125,T,IEX,206.675000,1
2019-10-17 14:14:09.711003904,2019-10-17 14:14:09.710987497,2657126,T,IEX,206.675000,100
2019-10-17 14:14:09.716300032,2019-10-17 14:14:09.716279462,2657127,T,IEX,206.690000,100
2019-10-17 14:14:09.720276992,2019-10-17 14:14:09.720258215,2657130,T,IEX,206.690000,5
2019-10-17 14:14:09.727982080,2019-10-17 14:14:09.727960648,2657135,T,IEX,206.710000,37
2019-10-17 14:14:09.727997952,2019-10-17 14:14:09.727980243,2657137,T,IEX,206.710000,57
2019-10-17 14:14:11.1316096,2019-10-17 14:14:11.1301000,2657843,T,IEX,206.605000,2
2019-10-17 14:14:11.11187968,2019-10-17 14:14:11.11166706,2657866,T,IEX,206.680000,5
2019-10-17 14:14:11.20094976,2019-10-17 14:14:11.20077951,2657877,T,IEX,206.690000,74
2019-10-17 14:14:11.20984064,2019-10-17 14:14:11.20967138,2657882,T,IEX,206.650000,1
2019-10-17 14:14:13.618324992,2019-10-17 14:14:13.618306576,2659162,T,IEX,206.650000,2
2019-10-17 14:14:14.645207040,2019-10-17 14:14:14.645186196,2659629,T,IEX,206.610000,100
2019-10-17 14:14:14.646155008,2019-10-17 14:14:14.646136961,2659631,T,IEX,206.610000,100
2019-10-17 14:14:14.983351040,2019-10-17 14:14:14.983330694,2659866,T,IEX,206.450000,100
2019-10-17 14:14:15.845356032,2019-10-17 14:14:15.845339098,2661422,T,IEX,206.575000,100
2019-10-17 14:14:18.224050944,2019-10-17 14:14:18.224032603,2662830,T,IEX,206.595000,100
2019-10-17 14:14:29.764048896,2019-10-17 14:14:29.764027535,2674710,T,IEX,206.490000,18
2019-10-17 14:14:32.760378112,2019-10-17 14:14:32.760359452,2678073,T,IEX,206.640000,3
2019-10-17 14:14:37.648524032,2019-10-17 14:14:37.648507642,2683940,T,IEX,206.730000,100
2019-10-17 14:14:37.648544000,2019-10-17 14:14:37.648526381,2683941,T,IEX,206.740000,1
2019-10-17 14:14:37.744972032,2019-10-17 14:14:37.744955187,2684044,T,IEX,206.740000,100
2019-10-17 14:14:37.744986880,2019-10-17 14:14:37.744970086,2684045,T,IEX,206.740000,100
2019-10-17 14:14:37.745000960,2019-10-17 14:14:37.744984316,2684046,T,IEX,206.740000,3
2019-10-17 14:15:00.440374016,2019-10-17 14:15:00.440356364,2703346,T,IEX,206.610000,100
2019-10-17 14:15:00.709316096,2019-10-17 14:15:00.709295849,2703518,T,IEX,206.610000,100
2019-10-17 14:15:01.712027904,2019-10-17 14:15:01.712007961,2705105,T,IEX,206.600000,100
2019-10-17 14:15:03.356901888,2019-10-17 14:15:03.356881428,2706618,T,IEX,206.580000,100
2019-10-17 14:15:16.391298048,2019-10-17 14:15:16.391278990,2716611,T,IEX,206.655000,100
2019-10-17 14:15:18.133115904,2019-10-17 14:15:18.133098626,2717927,T,IEX,206.850000,100
2019-10-17 14:15:18.136346880,2019-10-17 14:15:18.136327724,2717928,T,IEX,206.870000,100
2019-10-17 14:15:19.407804928,2019-10-17 14:15:19.407785084,2718631,T,IEX,206.950000,100
2019-10-17 14:15:19.408787968,2019-10-17 14:15:19.408770340,2718632,T,IEX,206.950000,100
2019-10-17 14:15:19.408801024,2019-10-17 14:15:19.408783630,2718633,T,IEX,206.950000,100
2019-10-17 14:15:19.411021056,2019-10-17 14:15:19.411001268,2718634,T,IEX,206.980000,100
2019-10-17 14:15:19.412272896,2019-10-17 14:15:19.412252590,2718635,T,IEX,206.980000,100
2019-10-17 14:15:19.635429120,2019-10-17 14:15:19.635413827,2718707,T,IEX,207.000000,100
2019-10-17 14:15:20.663396096,2019-10-17 14:15:20.663376924,2719620,T,IEX,207.040000,100
2019-10-17 14:15:23.989588992,2019-10-17 14:15:23.989568466,2721304,T,IEX,207.050000,100
2019-10-17 14:15:24.817330944,2019-10-17 14:15:24.817312939,2722107,T,IEX,206.940000,100
2019-10-17 14:15:24.837936128,2019-10-17 14:15:24.837919694,2722127,T,IEX,206.870000,25
2019-10-17 14:15:24.839243008,2019-10-17 14:15:24.839227537,2722129,T,IEX,206.870000,75
2019-10-17 14:15:30.794115072,2019-10-17 14:15:30.794096690,2727013,T,IEX,206.850000,100
2019-10-17 14:15:30.795787008,2019-10-17 14:15:30.795766955,2727015,T,IEX,206.830000,100
2019-10-17 14:16:44.715566080,2019-10-17 14:16:44.715547938,2786656,T,IEX,206.870000,100
2019-10-17 14:16:44.715584000,2019-10-17 14:16:44.715562300,2786658,T,IEX,206.870000,100
2019-10-17 14:16:44.715595008,2019-10-17 14:16:44.715577774,2786659,T,IEX,206.900000,100
2019-10-17 14:16:44.775823104,2019-10-17 14:16:44.775805857,2786680,T,IEX,206.920000,100
2019-10-17 14:16:44.775834880,2019-10-17 14:16:44.775818478,2786681,T,IEX,206.920000,100
2019-10-17 14:16:44.775846912,2019-10-17 14:16:44.775827821,2786682,T,IEX,206.920000,100
2019-10-17 14:16:44.775857920,2019-10-17 14:16:44.775840695,2786683,T,IEX,206.920000,100
2019-10-17 14:17:27.444596992,2019-10-17 14:17:27.444577524,2823757,T,IEX,207.070000,100
2019-10-17 14:17:27.444613888,2019-10-17 14:17:27.444597410,2823758,T,IEX,207.070000,100
2019-10-17 14:17:50.221192960,2019-10-17 14:17:50.221171613,2842468,T,IEX,207.040000,100
2019-10-17 14:19:57.373560064,2019-10-17 14:19:57.373541477,2931534,T,IEX,206.850000,100
2019-10-17 14:19:57.373584896,2019-10-17 14:19:57.373560055,2931536,T,IEX,206.850000,100
2019-10-17 14:22:26.87543040,2019-10-17 14:22:26.87521432,3051445,T,IEX,206.900000,100
2019-10-17 14:22:26.88824064,2019-10-17 14:22:26.88803175,3051446,T,IEX,206.900000,100
2019-10-17 14:22:41.193038080,2019-10-17 14:22:41.193021450,3059751,T,IEX,206.905000,100
2019-10-17 14:23:54.376816128,2019-10-17 14:23:54.376798558,3108985,T,IEX,207.020000,100
2019-10-17 14:24:54.350304000,2019-10-17 14:24:54.350284313,3156178,T,IEX,207.065000,100
2019-10-17 14:26:26.607870976,2019-10-17 14:26:26.607852689,3230978,T,IEX,207.095000,100
2019-10-17 14:26:49.115808000,2019-10-17 14:26:49.115786703,3245451,T,IEX,207.140000,100
2019-10-17 14:27:12.386824960,2019-10-17 14:27:12.386807958,3261013,T,IEX,207.010000,100
2019-10-17 14:27:27.593920,2019-10-17 14:27:27.570761,3273992,T,IEX,206.980000,100
2019-10-17 14:27:27.614912,2019-10-17 14:27:27.596048,3273993,T,IEX,206.980000,100
2019-10-17 14:27:30.851011072,2019-10-17 14:27:30.850988736,3278423,T,IEX,206.970000,100
2019-10-17 14:29:03.488154112,2019-10-17 14:29:03.488134677,3368966,T,IEX,206.795000,100
2019-10-17 14:30:16.161303040,2019-10-17 14:30:16.161283670,3425024,T,IEX,206.830000,100
2019-10-17 14:31:19.23059968,2019-10-17 14:31:19.23043998,3480771,T,IEX,206.895000,100
2019-10-17 14:32:15.691847936,2019-10-17 14:32:15.691826730,3522051,T,IEX,206.680000,100
2019-10-17 14:33:18.394633984,2019-10-17 14:33:18.394618237,3569529,T,IEX,206.380000,48
2019-10-17 14:34:16.230605056,2019-10-17 14:34:16.230585833,3612115,T,IEX,206.410000,100
2019-10-17 14:34:33.923184128,2019-10-17 14:34:33.923162800,3624707,T,IEX,206.485000,100
2019-10-17 14:34:33.923205120,2019-10-17 14:34:33.923188927,3624708,T,IEX,206.485000,100
2019-10-17 14:34:33.983266048,2019-10-17 14:34:33.983250070,3624808,T,IEX,206.490000,1
2019-10-17 14:34:33.983281920,2019-10-17 14:34:33.983263909,3624809,T,IEX,206.510000,99
2019-10-17 14:35:16.954331904,2019-10-17 14:35:16.954310814,3671626,T,IEX,206.395000,500
2019-10-17 14:35:26.133295104,2019-10-17 14:35:26.133278784,3683809,T,IEX,206.315000,200
2019-10-17 14:35:49.996868096,2019-10-17 14:35:49.996848328,3711886,T,IEX,206.290000,100
2019-10-17 14:35:49.996884992,2019-10-17 14:35:49.996866231,3711887,T,IEX,206.290000,100
2019-10-17 14:37:15.399639040,2019-10-17 14:37:15.399617747,3787770,T,IEX,206.320000,100
2019-10-17 14:38:47.286478080,2019-10-17 14:38:47.286458593,3867660,T,IEX,206.170000,100
2019-10-17 14:38:53.464539904,2019-10-17 14:38:53.464520080,3872620,T,IEX,206.170000,100
2019-10-17 14:39:12.121937920,2019-10-17 14:39:12.121918251,3886706,T,IEX,206.180000,100
2019-10-17 14:40:01.603937024,2019-10-17 14:40:01.603916472,3917064,T,IEX,206.210000,100
2019-10-17 14:41:34.789211904,2019-10-17 14:41:34.789195330,3978393,T,IEX,206.130000,154
2019-10-17 14:42:33.48568064,2019-10-17 14:42:33.48550951,4012498,T,IEX,206.220000,100
2019-10-17 14:42:39.877143040,2019-10-17 14:42:39.877125115,4016089,T,IEX,206.360000,100
2019-10-17 14:42:39.877158912,2019-10-17 14:42:39.877141912,4016090,T,IEX,206.360000,100
2019-10-17 14:43:09.402521088,2019-10-17 14:43:09.402498784,4035316,T,IEX,206.270000,100
2019-10-17 14:44:49.905498880,2019-10-17 14:44:49.905481226,4099445,T,IEX,206.075000,100
2019-10-17 14:44:49.905521920,2019-10-17 14:44:49.905502468,4099446,T,IEX,206.075000,100
2019-10-17 14:45:13.793662976,2019-10-17 14:45:13.793646369,4117290,T,IEX,206.165000,1
2019-10-17 14:45:42.792616960,2019-10-17 14:45:42.792600829,4135711,T,IEX,206.065000,100
2019-10-17 14:46:12.886416896,2019-10-17 14:46:12.886400991,4162332,T,IEX,205.990000,100
2019-10-17 14:46:20.382324992,2019-10-17 14:46:20.382306730,4171903,T,IEX,205.800000,100
2019-10-17 14:47:10.12701952,2019-10-17 14:47:10.12684065,4215973,T,IEX,205.800000,100
2019-10-17 14:47:42.410928896,2019-10-17 14:47:42.410910540,4237499,T,IEX,205.650000,48
2019-10-17 14:49:23.455738880,2019-10-17 14:49:23.455719306,4312511,T,IEX,205.595000,2
2019-10-17 14:49:33.437208064,2019-10-17 14:49:33.437190667,4339428,T,IEX,205.540000,100
2019-10-17 14:50:12.417222912,2019-10-17 14:50:12.417204910,4385389,T,IEX,205.480000,15
2019-10-17 14:50:12.417234944,2019-10-17 14:50:12.417218709,4385390,T,IEX,205.480000,85
2019-10-17 14:50:54.419447040,2019-10-17 14:50:54.419428920,4420022,T,IEX,205.540000,100
2019-10-17 14:51:39.418205952,2019-10-17 14:51:39.418187148,4451461,T,IEX,205.480000,100
2019-10-17 14:52:24.420942080,2019-10-17 14:52:24.420923691,4482865,T,IEX,205.370000,100
2019-10-17 14:52:27.420933888,2019-10-17 14:52:27.420912832,4485120,T,IEX,205.370000,100
2019-10-17 14:53:08.847563008,2019-10-17 14:53:08.847544930,4524715,T,IEX,205.365000,100
2019-10-17 14:53:08.850030080,2019-10-17 14:53:08.850011258,4524729,T,IEX,205.390000,100
2019-10-17 14:53:08.853840896,2019-10-17 14:53:08.853818431,4524738,T,IEX,205.410000,1
2019-10-17 14:54:01.630188032,2019-10-17 14:54:01.630169933,4558757,T,IEX,205.400000,100
2019-10-17 14:54:22.452844032,2019-10-17 14:54:22.452822824,4576117,T,IEX,205.520000,100
2019-10-17 14:54:26.631091968,2019-10-17 14:54:26.631071658,4579245,T,IEX,205.480000,200
2019-10-17 14:54:26.647764992,2019-10-17 14:54:26.647743630,4579268,T,IEX,205.480000,200
2019-10-17 14:54:26.663943936,2019-10-17 14:54:26.663923383,4579306,T,IEX,205.480000,100
2019-10-17 14:54:26.666288128,2019-10-17 14:54:26.666269273,4579309,T,IEX,205.480000,100
2019-10-17 14:54:27.60163072,2019-10-17 14:54:27.60142452,4579552,T,IEX,205.480000,300
2019-10-17 14:54:27.60178944,2019-10-17 14:54:27.60161886,4579553,T,IEX,205.480000,200
2019-10-17 14:55:00.889508096,2019-10-17 14:55:00.889491670,4600503,T,IEX,205.570000,100
2019-10-17 14:55:00.889529088,2019-10-17 14:55:00.889511996,4600504,T,IEX,205.570000,100
2019-10-17 14:55:01.56044032,2019-10-17 14:55:01.56023987,4600720,T,IEX,205.550000,100
2019-10-17 14:55:44.145254912,2019-10-17 14:55:44.145234100,4631913,T,IEX,205.630000,100
2019-10-17 14:58:02.182151936,2019-10-17 14:58:02.182122498,4728517,T,IEX,205.770000,100
2019-10-17 14:59:10.493389056,2019-10-17 14:59:10.493367446,4773694,T,IEX,205.810000,100
2019-10-17 14:59:40.9362944,2019-10-17 14:59:40.9344875,4797344,T,IEX,205.800000,100
2019-10-17 14:59:40.9384960,2019-10-17 14:59:40.9367937,4797346,T,IEX,205.800000,100
2019-10-17 14:59:50.809328128,2019-10-17 14:59:50.809312369,4807919,T,IEX,205.800000,100
2019-10-17 14:59:51.435911936,2019-10-17 14:59:51.435890424,4808706,T,IEX,205.790000,100
2019-10-17 15:00:01.293306880,2019-10-17 15:00:01.293288259,4817524,T,IEX,205.750000,100
2019-10-17 15:00:14.916943104,2019-10-17 15:00:14.916924321,4864411,T,IEX,205.220000,100
2019-10-17 15:00:14.929074944,2019-10-17 15:00:14.929056327,4864611,T,IEX,205.250000,100
2019-10-17 15:00:19.550498048,2019-10-17 15:00:19.550479523,4882200,T,IEX,205.380000,100
2019-10-17 15:00:25.301816064,2019-10-17 15:00:25.301784116,4895833,T,IEX,205.385000,100
2019-10-17 15:01:18.447186944,2019-10-17 15:01:18.447167887,4972542,T,IEX,205.460000,100
2019-10-17 15:01:20.250170112,2019-10-17 15:01:20.250150228,4974653,T,IEX,205.440000,100
2019-10-17 15:06:24.842562048,2019-10-17 15:06:24.842540786,5271195,T,IEX,205.510000,100
2019-10-17 15:06:54.458334976,2019-10-17 15:06:54.458315161,5292380,T,IEX,205.430000,100
2019-10-17 15:08:53.968224000,2019-10-17 15:08:53.968203517,5379988,T,IEX,205.480000,100
2019-10-17 15:08:54.650274048,2019-10-17 15:08:54.650251783,5380272,T,IEX,205.480000,100
2019-10-17 15:09:16.828598016,2019-10-17 15:09:16.828578860,5400889,T,IEX,205.405000,100
2019-10-17 15:09:17.832244992,2019-10-17 15:09:17.832226339,5402115,T,IEX,205.445000,100
2019-10-17 15:09:35.412012032,2019-10-17 15:09:35.411993691,5416167,T,IEX,205.450000,100
2019-10-17 15:10:04.264525056,2019-10-17 15:10:04.264508893,5436303,T,IEX,205.450000,100
2019-10-17 15:10:25.875642880,2019-10-17 15:10:25.875622412,5449512,T,IEX,205.500000,1
2019-10-17 15:10:25.875663104,2019-10-17 15:10:25.875643428,5449513,T,IEX,205.500000,100
2019-10-17 15:10:25.875675904,2019-10-17 15:10:25.875658599,5449514,T,IEX,205.500000,100
2019-10-17 15:11:14.720826880,2019-10-17 15:11:14.720808692,5477461,T,IEX,205.530000,100
2019-10-17 15:11:46.572316928,2019-10-17 15:11:46.572295403,5501442,T,IEX,205.555000,100
2019-10-17 15:12:21.995578880,2019-10-17 15:12:21.995561357,5524801,T,IEX,205.680000,1
2019-10-17 15:12:48.225221888,2019-10-17 15:12:48.225202229,5545579,T,IEX,205.765000,1
2019-10-17 15:12:59.945497088,2019-10-17 15:12:59.945475726,5552047,T,IEX,205.775000,1
2019-10-17 15:13:24.478999040,2019-10-17 15:13:24.478981850,5567764,T,IEX,205.720000,100
2019-10-17 15:14:14.898567936,2019-10-17 15:14:14.898546791,5604046,T,IEX,205.660000,1
2019-10-17 15:14:14.898584064,2019-10-17 15:14:14.898567364,5604047,T,IEX,205.660000,100
2019-10-17 15:14:16.194010112,2019-10-17 15:14:16.193991814,5605245,T,IEX,205.670000,200
2019-10-17 15:17:00.9496064,2019-10-17 15:17:00.9480184,5698658,T,IEX,205.625000,3
2019-10-17 15:17:07.552954880,2019-10-17 15:17:07.552937570,5701778,T,IEX,205.630000,100
2019-10-17 15:17:40.631705088,2019-10-17 15:17:40.631677725,5720749,T,IEX,205.580000,5
2019-10-17 15:17:40.631717120,2019-10-17 15:17:40.631697848,5720750,T,IEX,205.580000,100
2019-10-17 15:18:36.873515008,2019-10-17 15:18:36.873498672,5755866,T,IEX,205.470000,2
2019-10-17 15:18:36.873534976,2019-10-17 15:18:36.873517793,5755867,T,IEX,205.470000,100
2019-10-17 15:20:01.279792896,2019-10-17 15:20:01.279773783,5810505,T,IEX,205.750000,3
2019-10-17 15:21:19.477367040,2019-10-17 15:21:19.477350913,5862974,T,IEX,205.585000,4
2019-10-17 15:21:19.499607040,2019-10-17 15:21:19.499591341,5862991,T,IEX,205.585000,4
2019-10-17 15:21:25.329464064,2019-10-17 15:21:25.329446099,5866907,T,IEX,205.595000,200
2019-10-17 15:22:20.316480000,2019-10-17 15:22:20.316459907,5898851,T,IEX,205.505000,1
2019-10-17 15:22:42.167097088,2019-10-17 15:22:42.167075893,5908608,T,IEX,205.660000,1
2019-10-17 15:23:07.540429056,2019-10-17 15:23:07.540412620,5928826,T,IEX,205.660000,1
2019-10-17 15:23:08.515154944,2019-10-17 15:23:08.515137785,5930064,T,IEX,205.640000,100
2019-10-17 15:23:25.445639936,2019-10-17 15:23:25.445624143,5940553,T,IEX,205.740000,1
2019-10-17 15:23:25.445660928,2019-10-17 15:23:25.445644065,5940554,T,IEX,205.740000,100
2019-10-17 15:23:44.845905920,2019-10-17 15:23:44.845886401,5953182,T,IEX,205.740000,2
2019-10-17 15:23:44.845923072,2019-10-17 15:23:44.845905524,5953183,T,IEX,205.740000,9
2019-10-17 15:24:18.511019008,2019-10-17 15:24:18.510997212,5973273,T,IEX,205.670000,100
2019-10-17 15:24:30.510118912,2019-10-17 15:24:30.510099995,5980511,T,IEX,205.680000,100
2019-10-17 15:26:24.555941888,2019-10-17 15:26:24.555922154,6048653,T,IEX,205.530000,1
2019-10-17 15:26:29.204230912,2019-10-17 15:26:29.204206817,6051307,T,IEX,205.520000,8
2019-10-17 15:27:28.962689024,2019-10-17 15:27:28.962668277,6090606,T,IEX,205.435000,100
2019-10-17 15:27:49.633826048,2019-10-17 15:27:49.633807264,6101886,T,IEX,205.440000,200
2019-10-17 15:27:53.968171008,2019-10-17 15:27:53.968151798,6103825,T,IEX,205.465000,100
2019-10-17 15:29:55.987962112,2019-10-17 15:29:55.987943329,6170184,T,IEX,205.430000,100
2019-10-17 15:29:55.987985920,2019-10-17 15:29:55.987969926,6170185,T,IEX,205.430000,9
2019-10-17 15:29:55.988087040,2019-10-17 15:29:55.988069557,6170186,T,IEX,205.460000,100
2019-10-17 15:30:09.779279872,2019-10-17 15:30:09.779261706,6183666,T,IEX,205.475000,100
2019-10-17 15:30:32.484446976,2019-10-17 15:30:32.484428280,6198454,T,IEX,205.470000,100
2019-10-17 15:31:10.350700032,2019-10-17 15:31:10.350682466,6223807,T,IEX,205.355000,9
2019-10-17 15:31:10.350720000,2019-10-17 15:31:10.350702781,6223808,T,IEX,205.355000,100
2019-10-17 15:31:42.487419904,2019-10-17 15:31:42.487400258,6244307,T,IEX,205.355000,100
2019-10-17 15:31:51.888073984,2019-10-17 15:31:51.888054482,6251242,T,IEX,205.385000,100
2019-10-17 15:32:03.895929088,2019-10-17 15:32:03.895905844,6260537,T,IEX,205.400000,50
2019-10-17 15:32:21.96418048,2019-10-17 15:32:21.96393711,6277900,T,IEX,205.355000,100
2019-10-17 15:32:21.96427008,2019-10-17 15:32:21.96408264,6277901,T,IEX,205.355000,100
2019-10-17 15:33:00.523171072,2019-10-17 15:33:00.523152478,6306718,T,IEX,205.350000,100
2019-10-17 15:34:51.94862080,2019-10-17 15:34:51.94842756,6376678,T,IEX,205.420000,100
2019-10-17 15:35:08.442859008,2019-10-17 15:35:08.442840223,6398703,T,IEX,205.490000,40
2019-10-17 15:35:57.524099072,2019-10-17 15:35:57.524077259,6438275,T,IEX,205.610000,100
2019-10-17 15:37:17.826051072,2019-10-17 15:37:17.826027468,6484950,T,IEX,205.445000,100
2019-10-17 15:37:27.671258880,2019-10-17 15:37:27.671241239,6491591,T,IEX,205.520000,100
2019-10-17 15:37:32.152762880,2019-10-17 15:37:32.152735923,6495032,T,IEX,205.520000,100
2019-10-17 15:39:14.519345920,2019-10-17 15:39:14.519326150,6550969,T,IEX,205.545000,100
2019-10-17 15:39:30.944878080,2019-10-17 15:39:30.944857457,6557765,T,IEX,205.625000,200
2019-10-17 15:39:48.377896960,2019-10-17 15:39:48.377879436,6566268,T,IEX,205.655000,100
2019-10-17 15:39:49.164774912,2019-10-17 15:39:49.164750583,6566685,T,IEX,205.660000,200
2019-10-17 15:40:40.944738048,2019-10-17 15:40:40.944717411,6599893,T,IEX,205.670000,100
2019-10-17 15:40:41.951208960,2019-10-17 15:40:41.951188614,6600202,T,IEX,205.645000,100
2019-10-17 15:41:31.384562944,2019-10-17 15:41:31.384541932,6629808,T,IEX,205.760000,100
2019-10-17 15:42:23.863219968,2019-10-17 15:42:23.863203443,6657663,T,IEX,205.660000,100
2019-10-17 15:42:57.785086976,2019-10-17 15:42:57.785067301,6686674,T,IEX,205.620000,100
2019-10-17 15:43:16.295869952,2019-10-17 15:43:16.295849020,6709931,T,IEX,205.605000,100
2019-10-17 15:44:23.684604928,2019-10-17 15:44:23.684583700,6760605,T,IEX,205.550000,100
2019-10-17 15:44:32.58480128,2019-10-17 15:44:32.58450409,6768128,T,IEX,205.620000,100
2019-10-17 15:44:48.279536896,2019-10-17 15:44:48.279518758,6776787,T,IEX,205.600000,100
2019-10-17 15:46:10.55821056,2019-10-17 15:46:10.55803286,6827743,T,IEX,205.405000,100
2019-10-17 15:46:35.536733952,2019-10-17 15:46:35.536710112,6845176,T,IEX,205.415000,100
2019-10-17 15:46:35.542182912,2019-10-17 15:46:35.542162678,6845183,T,IEX,205.440000,100
2019-10-17 15:52:05.936236032,2019-10-17 15:52:05.936216522,7017054,T,IEX,205.145000,200
2019-10-17 15:52:34.876499968,2019-10-17 15:52:34.876479042,7055028,T,IEX,204.970000,100
2019-10-17 15:52:44.460794112,2019-10-17 15:52:44.460776201,7066951,T,IEX,204.980000,200
2019-10-17 15:52:44.919883008,2019-10-17 15:52:44.919863283,7067276,T,IEX,205.040000,100
2019-10-17 15:53:08.846465024,2019-10-17 15:53:08.846445435,7098125,T,IEX,204.880000,43
2019-10-17 15:54:27.553106944,2019-10-17 15:54:27.553088250,7151598,T,IEX,204.770000,100
2019-10-17 15:54:52.268006912,2019-10-17 15:54:52.267986416,7164552,T,IEX,204.780000,1
2019-10-17 15:54:52.297913088,2019-10-17 15:54:52.297891763,7164556,T,IEX,204.760000,2
2019-10-17 15:54:52.311791104,2019-10-17 15:54:52.311770912,7164588,T,IEX,204.780000,2
2019-10-17 15:54:59.294593024,2019-10-17 15:54:59.294572716,7168784,T,IEX,204.810000,35
2019-10-17 15:54:59.473281024,2019-10-17 15:54:59.473264842,7168919,T,IEX,204.810000,136
2019-10-17 15:54:59.473838080,2019-10-17 15:54:59.473819410,7168922,T,IEX,204.810000,100
2019-10-17 15:55:13.922729984,2019-10-17 15:55:13.922707826,7178724,T,IEX,204.850000,100
2019-10-17 15:55:13.922744064,2019-10-17 15:55:13.922726894,7178725,T,IEX,204.850000,300
2019-10-17 15:56:02.639792128,2019-10-17 15:56:02.639768127,7202244,T,IEX,204.870000,25
2019-10-17 15:56:05.214765056,2019-10-17 15:56:05.214742393,7203231,T,IEX,204.850000,100
2019-10-17 15:56:05.214778112,2019-10-17 15:56:05.214761236,7203232,T,IEX,204.850000,100
2019-10-17 15:56:05.214787072,2019-10-17 15:56:05.214770986,7203233,T,IEX,204.850000,100
2019-10-17 15:56:05.214802944,2019-10-17 15:56:05.214786448,7203234,T,IEX,204.850000,100
2019-10-17 15:57:24.562063872,2019-10-17 15:57:24.562044686,7246168,T,IEX,204.830000,100
2019-10-17 15:57:24.562081024,2019-10-17 15:57:24.562063883,7246169,T,IEX,204.810000,100
2019-10-17 15:57:36.649911040,2019-10-17 15:57:36.649892933,7251426,T,IEX,204.980000,38
2019-10-17 15:57:47.96819968,2019-10-17 15:57:47.96798606,7255478,T,IEX,204.960000,100
2019-10-17 15:59:56.672088064,2019-10-17 15:59:56.672069782,7322801,T,IEX,204.875000,100
2019-10-17 15:59:57.564564992,2019-10-17 15:59:57.564547208,7323263,T,IEX,204.840000,100
2019-10-17 16:00:33.191474944,2019-10-17 16:00:33.191454332,7345989,T,IEX,204.820000,100
2019-10-17 16:01:51.369432064,2019-10-17 16:01:51.369411816,7389971,T,IEX,204.700000,12
2019-10-17 16:03:44.15535104,2019-10-17 16:03:44.15516255,7474866,T,IEX,204.505000,77
2019-10-17 16:04:35.172955904,2019-10-17 16:04:35.172938052,7504338,T,IEX,204.510000,200
2019-10-17 16:04:40.999376896,2019-10-17 16:04:40.999358715,7507188,T,IEX,204.420000,100
2019-10-17 16:04:45.19054080,2019-10-17 16:04:45.19035944,7508485,T,IEX,204.420000,100
2019-10-17 16:05:11.788864000,2019-10-17 16:05:11.788844533,7526505,T,IEX,204.500000,100
2019-10-17 16:05:45.742533120,2019-10-17 16:05:45.742512159,7545587,T,IEX,204.640000,1
2019-10-17 16:06:47.439417088,2019-10-17 16:06:47.439396931,7577442,T,IEX,204.780000,100
2019-10-17 16:10:37.76968960,2019-10-17 16:10:37.76862813,7687342,T,IEX,204.610000,100
2019-10-17 16:11:36.292720896,2019-10-17 16:11:36.292698087,7716208,T,IEX,204.615000,100
2019-10-17 16:11:36.292733952,2019-10-17 16:11:36.292716520,7716209,T,IEX,204.615000,900
2019-10-17 16:11:36.329338880,2019-10-17 16:11:36.329313523,7716215,T,IEX,204.615000,500
2019-10-17 16:11:36.586117888,2019-10-17 16:11:36.586100954,7716264,T,IEX,204.615000,100
2019-10-17 16:11:37.295098112,2019-10-17 16:11:37.295074851,7716409,T,IEX,204.615000,100
2019-10-17 16:12:02.658339072,2019-10-17 16:12:02.658316930,7725805,T,IEX,204.650000,140
2019-10-17 16:12:12.585723904,2019-10-17 16:12:12.585701905,7731259,T,IEX,204.650000,100
2019-10-17 16:13:04.513748992,2019-10-17 16:13:04.513729263,7749472,T,IEX,204.560000,100
2019-10-17 16:13:04.625338112,2019-10-17 16:13:04.625317269,7749518,T,IEX,204.585000,100
2019-10-17 16:13:43.573165056,2019-10-17 16:13:43.573145002,7768342,T,IEX,204.545000,100
2019-10-17 16:13:47.242305024,2019-10-17 16:13:47.242287438,7770501,T,IEX,204.570000,82
2019-10-17 16:13:51.699095040,2019-10-17 16:13:51.699074116,7772181,T,IEX,204.615000,100
2019-10-17 16:14:04.599756032,2019-10-17 16:14:04.599736007,7779063,T,IEX,204.645000,100
2019-10-17 16:14:08.57316096,2019-10-17 16:14:08.57296708,7780512,T,IEX,204.645000,100
2019-10-17 16:14:16.339461888,2019-10-17 16:14:16.339440245,7783132,T,IEX,204.685000,100
2019-10-17 16:14:32.268186112,2019-10-17 16:14:32.268168045,7791691,T,IEX,204.715000,100
2019-10-17 16:17:54.600303104,2019-10-17 16:17:54.600283253,7896566,T,IEX,204.610000,100
2019-10-17 16:19:28.837906944,2019-10-17 16:19:28.837888001,7938577,T,IEX,204.590000,100
2019-10-17 16:19:56.222578944,2019-10-17 16:19:56.222560559,7947772,T,IEX,204.555000,100
2019-10-17 16:21:37.942313984,2019-10-17 16:21:37.942297149,7989274,T,IEX,204.580000,200
2019-10-17 16:22:00.562158080,2019-10-17 16:22:00.562140469,7999868,T,IEX,204.560000,100
2019-10-17 16:22:01.764901888,2019-10-17 16:22:01.764883604,8000521,T,IEX,204.620000,100
2019-10-17 16:22:03.520144896,2019-10-17 16:22:03.520122934,8001081,T,IEX,204.605000,100
2019-10-17 16:23:03.628754944,2019-10-17 16:23:03.628736740,8023623,T,IEX,204.630000,100
2019-10-17 16:23:07.746087936,2019-10-17 16:23:07.746065852,8024972,T,IEX,204.615000,100
2019-10-17 16:23:10.553212928,2019-10-17 16:23:10.553194834,8025772,T,IEX,204.620000,100
2019-10-17 16:24:12.897908992,2019-10-17 16:24:12.897890226,8057245,T,IEX,204.690000,100
2019-10-17 16:25:31.746042880,2019-10-17 16:25:31.746021627,8097324,T,IEX,204.770000,100
2019-10-17 16:25:46.560678912,2019-10-17 16:25:46.560662531,8105765,T,IEX,204.795000,100
2019-10-17 16:28:13.577441024,2019-10-17 16:28:13.577418652,8178194,T,IEX,205.050000,100
2019-10-17 16:28:40.940570112,2019-10-17 16:28:40.940551020,8189148,T,IEX,205.025000,100
2019-10-17 16:28:43.86496000,2019-10-17 16:28:43.86477685,8190509,T,IEX,205.015000,100
2019-10-17 16:28:47.201737984,2019-10-17 16:28:47.201718109,8192122,T,IEX,205.005000,100
2019-10-17 16:29:43.418652928,2019-10-17 16:29:43.418633124,8216733,T,IEX,205.030000,100
2019-10-17 16:30:15.389465088,2019-10-17 16:30:15.389448639,8230682,T,IEX,205.095000,100
2019-10-17 16:30:23.761853952,2019-10-17 16:30:23.761835827,8235368,T,IEX,204.955000,100
2019-10-17 16:31:10.755740928,2019-10-17 16:31:10.755716812,8253296,T,IEX,205.060000,100
2019-10-17 16:32:58.845060096,2019-10-17 16:32:58.845040801,8294644,T,IEX,205.270000,100
2019-10-17 16:33:00.569779968,2019-10-17 16:33:00.569761410,8295760,T,IEX,205.305000,100
2019-10-17 16:33:11.366778112,2019-10-17 16:33:11.366758038,8301099,T,IEX,205.245000,100
2019-10-17 16:33:11.421615104,2019-10-17 16:33:11.421593805,8301105,T,IEX,205.280000,100
2019-10-17 16:33:26.583958016,2019-10-17 16:33:26.583937470,8306964,T,IEX,205.300000,100
2019-10-17 16:33:54.884905984,2019-10-17 16:33:54.884885715,8321381,T,IEX,205.340000,100
2019-10-17 16:34:20.133415936,2019-10-17 16:34:20.133395754,8332512,T,IEX,205.360000,100
2019-10-17 16:35:00.858831872,2019-10-17 16:35:00.858813305,8351007,T,IEX,205.355000,100
2019-10-17 16:35:02.559931904,2019-10-17 16:35:02.559911692,8352142,T,IEX,205.400000,100
2019-10-17 16:35:26.353030912,2019-10-17 16:35:26.353011973,8362059,T,IEX,205.360000,100
2019-10-17 16:35:46.730416896,2019-10-17 16:35:46.730401133,8371184,T,IEX,205.360000,100
2019-10-17 16:36:00.515207936,2019-10-17 16:36:00.515185074,8376449,T,IEX,205.405000,100
2019-10-17 16:36:00.623150080,2019-10-17 16:36:00.623128261,8376488,T,IEX,205.370000,100
2019-10-17 16:36:00.858024960,2019-10-17 16:36:00.858005300,8376547,T,IEX,205.405000,100
2019-10-17 16:37:48.408094976,2019-10-17 16:37:48.408074479,8414693,T,IEX,205.390000,100
2019-10-17 16:38:08.32909056,2019-10-17 16:38:08.32889374,8422244,T,IEX,205.370000,100
2019-10-17 16:38:42.619584000,2019-10-17 16:38:42.619564410,8435705,T,IEX,205.380000,100
2019-10-17 16:38:43.63329024,2019-10-17 16:38:43.63308530,8435898,T,IEX,205.440000,100
2019-10-17 16:38:43.64860928,2019-10-17 16:38:43.64843268,8435900,T,IEX,205.440000,100
2019-10-17 16:38:59.998394112,2019-10-17 16:38:59.998374565,8441016,T,IEX,205.530000,100
2019-10-17 16:39:01.945844992,2019-10-17 16:39:01.945825147,8441825,T,IEX,205.530000,100
2019-10-17 16:39:14.941202944,2019-10-17 16:39:14.941184905,8445659,T,IEX,205.550000,200
2019-10-17 16:39:18.892860928,2019-10-17 16:39:18.892841300,8447012,T,IEX,205.565000,100
2019-10-17 16:39:30.367609088,2019-10-17 16:39:30.367586097,8451188,T,IEX,205.635000,100
2019-10-17 16:40:05.869093888,2019-10-17 16:40:05.869072921,8462723,T,IEX,205.575000,100
2019-10-17 16:40:22.964889088,2019-10-17 16:40:22.964870685,8469833,T,IEX,205.560000,100
2019-10-17 16:40:38.604276992,2019-10-17 16:40:38.604259315,8475204,T,IEX,205.510000,100
2019-10-17 16:40:48.628465920,2019-10-17 16:40:48.628449832,8478486,T,IEX,205.470000,100
2019-10-17 16:41:00.862917120,2019-10-17 16:41:00.862899792,8482344,T,IEX,205.550000,100
2019-10-17 16:41:10.943674112,2019-10-17 16:41:10.943654559,8484987,T,IEX,205.590000,100
2019-10-17 16:42:11.134368000,2019-10-17 16:42:11.134346034,8508747,T,IEX,205.745000,100
2019-10-17 16:42:16.735898880,2019-10-17 16:42:16.735881292,8512068,T,IEX,205.710000,100
2019-10-17 16:43:31.736293120,2019-10-17 16:43:31.736272975,8539460,T,IEX,205.750000,100
2019-10-17 16:44:02.827120896,2019-10-17 16:44:02.827058913,8550442,T,IEX,205.780000,100
2019-10-17 16:44:06.634670080,2019-10-17 16:44:06.634648632,8551879,T,IEX,205.780000,100
2019-10-17 16:44:13.10023936,2019-10-17 16:44:13.10002260,8554741,T,IEX,205.875000,100
2019-10-17 16:44:14.118183936,2019-10-17 16:44:14.118166967,8555078,T,IEX,205.840000,100
2019-10-17 16:44:14.121366016,2019-10-17 16:44:14.121345810,8555079,T,IEX,205.840000,100
2019-10-17 16:44:14.877142016,2019-10-17 16:44:14.877124369,8555310,T,IEX,205.840000,100
2019-10-17 16:44:20.984258048,2019-10-17 16:44:20.984241825,8557030,T,IEX,205.825000,100
2019-10-17 16:44:21.987011072,2019-10-17 16:44:21.986989653,8557476,T,IEX,205.820000,100
2019-10-17 16:44:28.579232000,2019-10-17 16:44:28.579209021,8559367,T,IEX,205.865000,100
2019-10-17 16:44:59.373696000,2019-10-17 16:44:59.373674518,8566674,T,IEX,205.840000,100
2019-10-17 16:44:59.375055872,2019-10-17 16:44:59.375037027,8566675,T,IEX,205.840000,100
2019-10-17 16:45:04.160977920,2019-10-17 16:45:04.160957951,8569759,T,IEX,205.860000,100
2019-10-17 16:45:14.462752000,2019-10-17 16:45:14.462731382,8574072,T,IEX,205.860000,100
2019-10-17 16:45:51.334437120,2019-10-17 16:45:51.334417281,8586437,T,IEX,205.920000,100
2019-10-17 16:46:06.918662912,2019-10-17 16:46:06.918645554,8592018,T,IEX,205.930000,100
2019-10-17 16:46:11.185920000,2019-10-17 16:46:11.185897995,8593435,T,IEX,205.980000,100
2019-10-17 16:46:12.830744064,2019-10-17 16:46:12.830722807,8594004,T,IEX,205.995000,100
2019-10-17 16:46:18.616061952,2019-10-17 16:46:18.616040149,8595966,T,IEX,205.990000,100
2019-10-17 16:46:24.227026944,2019-10-17 16:46:24.227005729,8597174,T,IEX,205.980000,100
2019-10-17 16:46:26.533803008,2019-10-17 16:46:26.533784895,8597671,T,IEX,206.015000,100
2019-10-17 16:46:41.741836032,2019-10-17 16:46:41.741818259,8603167,T,IEX,205.935000,100
2019-10-17 16:46:49.695759872,2019-10-17 16:46:49.695737229,8606971,T,IEX,205.895000,100
2019-10-17 16:47:10.260369920,2019-10-17 16:47:10.260353867,8613853,T,IEX,205.855000,100
2019-10-17 16:47:17.606725120,2019-10-17 16:47:17.606703248,8616693,T,IEX,205.850000,100
2019-10-17 16:47:22.312050944,2019-10-17 16:47:22.312031110,8619327,T,IEX,205.875000,100
2019-10-17 16:47:36.986014976,2019-10-17 16:47:36.985994458,8624711,T,IEX,205.960000,12
2019-10-17 16:47:50.167308032,2019-10-17 16:47:50.167286879,8629019,T,IEX,206.020000,100
2019-10-17 16:47:50.458557952,2019-10-17 16:47:50.458538166,8629066,T,IEX,206.020000,100
2019-10-17 16:47:51.755236096,2019-10-17 16:47:51.755217149,8629472,T,IEX,206.010000,100
2019-10-17 16:47:51.944186880,2019-10-17 16:47:51.944169799,8629528,T,IEX,206.020000,100
2019-10-17 16:48:00.645772032,2019-10-17 16:48:00.645751970,8631683,T,IEX,206.010000,100
2019-10-17 16:48:08.461882112,2019-10-17 16:48:08.461862768,8633594,T,IEX,206.030000,100
2019-10-17 16:48:09.514615040,2019-10-17 16:48:09.514598194,8633809,T,IEX,206.055000,100
2019-10-17 16:48:12.893592064,2019-10-17 16:48:12.893571057,8634985,T,IEX,206.065000,100
2019-10-17 16:48:20.806938880,2019-10-17 16:48:20.806920233,8637489,T,IEX,206.055000,100
2019-10-17 16:48:25.326514944,2019-10-17 16:48:25.326492902,8638642,T,IEX,206.080000,41
2019-10-17 16:48:39.641568000,2019-10-17 16:48:39.641550972,8645237,T,IEX,206.050000,100
2019-10-17 16:48:43.282205952,2019-10-17 16:48:43.282187650,8647088,T,IEX,206.105000,100
2019-10-17 16:48:51.314392064,2019-10-17 16:48:51.314375340,8650172,T,IEX,206.070000,100
2019-10-17 16:49:18.192134912,2019-10-17 16:49:18.192115915,8658151,T,IEX,205.990000,100
2019-10-17 16:49:18.642585088,2019-10-17 16:49:18.642562872,8658341,T,IEX,206.000000,100
2019-10-17 16:50:53.934918912,2019-10-17 16:50:53.934898870,8689175,T,IEX,206.075000,100
2019-10-17 16:51:17.234331904,2019-10-17 16:51:17.234311082,8698924,T,IEX,206.055000,100
2019-10-17 16:51:43.944293888,2019-10-17 16:51:43.944275317,8707804,T,IEX,206.180000,100
2019-10-17 16:52:04.274262016,2019-10-17 16:52:04.274238427,8714817,T,IEX,206.150000,100
2019-10-17 16:52:04.274276096,2019-10-17 16:52:04.274257705,8714818,T,IEX,206.150000,100
2019-10-17 16:52:06.311491072,2019-10-17 16:52:06.311472327,8715403,T,IEX,206.150000,100
2019-10-17 16:52:17.400507904,2019-10-17 16:52:17.400484719,8718973,T,IEX,206.130000,29
2019-10-17 16:52:21.355885056,2019-10-17 16:52:21.355864645,8720407,T,IEX,206.150000,100
2019-10-17 16:52:30.380357120,2019-10-17 16:52:30.380339159,8723514,T,IEX,206.150000,100
2019-10-17 16:52:52.21318912,2019-10-17 16:52:52.21296939,8729614,T,IEX,206.120000,100
2019-10-17 16:53:09.254334976,2019-10-17 16:53:09.254310597,8736779,T,IEX,206.095000,100
2019-10-17 16:53:17.693584896,2019-10-17 16:53:17.693565906,8739791,T,IEX,206.030000,100
2019-10-17 16:53:32.64706048,2019-10-17 16:53:32.64684935,8744439,T,IEX,205.975000,100
2019-10-17 16:53:59.765836032,2019-10-17 16:53:59.765817784,8751458,T,IEX,206.100000,30
2019-10-17 16:54:36.106452992,2019-10-17 16:54:36.106429408,8762596,T,IEX,206.090000,100
2019-10-17 16:54:51.375870976,2019-10-17 16:54:51.375848460,8767116,T,IEX,206.035000,100
2019-10-17 16:55:52.899406080,2019-10-17 16:55:52.899387365,8790803,T,IEX,206.040000,100
2019-10-17 16:56:22.612819968,2019-10-17 16:56:22.612801868,8798594,T,IEX,206.095000,100
2019-10-17 16:56:23.176594944,2019-10-17 16:56:23.176577791,8799695,T,IEX,206.110000,100
2019-10-17 16:56:46.951126016,2019-10-17 16:56:46.951107481,8809138,T,IEX,206.145000,100
2019-10-17 16:57:03.216121088,2019-10-17 16:57:03.216101768,8812713,T,IEX,206.155000,100
2019-10-17 16:57:16.97072128,2019-10-17 16:57:16.97055709,8816157,T,IEX,206.140000,100
2019-10-17 16:58:55.768173056,2019-10-17 16:58:55.768152841,8844231,T,IEX,206.100000,100
2019-10-17 17:00:06.740372992,2019-10-17 17:00:06.740352325,8871163,T,IEX,206.090000,100
2019-10-17 17:00:33.108327936,2019-10-17 17:00:33.108309141,8881403,T,IEX,206.070000,100
2019-10-17 17:00:47.657015040,2019-10-17 17:00:47.656993277,8884930,T,IEX,206.030000,100
2019-10-17 17:02:24.292901120,2019-10-17 17:02:24.292884300,8916250,T,IEX,206.030000,100
2019-10-17 17:02:41.52926976,2019-10-17 17:02:41.52908575,8921346,T,IEX,206.015000,100
2019-10-17 17:02:50.424816128,2019-10-17 17:02:50.424798239,8924002,T,IEX,206.045000,100
2019-10-17 17:03:02.871088128,2019-10-17 17:03:02.871067411,8928183,T,IEX,206.005000,100
2019-10-17 17:05:14.955020032,2019-10-17 17:05:14.954999741,8967947,T,IEX,206.050000,100
2019-10-17 17:05:20.955405056,2019-10-17 17:05:20.955388448,8970465,T,IEX,206.050000,100
2019-10-17 17:06:27.22836992,2019-10-17 17:06:27.22814439,8992873,T,IEX,206.010000,400
2019-10-17 17:06:30.49527040,2019-10-17 17:06:30.49506875,8993882,T,IEX,206.010000,100
2019-10-17 17:06:33.664222976,2019-10-17 17:06:33.664202738,8995280,T,IEX,205.980000,100
2019-10-17 17:07:14.908537088,2019-10-17 17:07:14.908517972,9013637,T,IEX,205.995000,100
2019-10-17 17:08:18.665976064,2019-10-17 17:08:18.665956759,9038082,T,IEX,206.045000,100
2019-10-17 17:09:26.770661888,2019-10-17 17:09:26.770641156,9059092,T,IEX,206.025000,100
2019-10-17 17:09:57.337163008,2019-10-17 17:09:57.337140364,9066479,T,IEX,206.050000,100
2019-10-17 17:10:05.967239936,2019-10-17 17:10:05.967218522,9070519,T,IEX,206.055000,117
2019-10-17 17:10:05.992344064,2019-10-17 17:10:05.992323130,9070530,T,IEX,206.055000,100
2019-10-17 17:11:41.766482944,2019-10-17 17:11:41.766464289,9102749,T,IEX,206.100000,100
2019-10-17 17:12:07.888326912,2019-10-17 17:12:07.888306507,9112269,T,IEX,206.060000,100
2019-10-17 17:12:15.533346048,2019-10-17 17:12:15.533325474,9114837,T,IEX,206.030000,100
2019-10-17 17:12:16.17366016,2019-10-17 17:12:16.17345505,9114931,T,IEX,206.010000,100
2019-10-17 17:12:55.828858112,2019-10-17 17:12:55.828835195,9128631,T,IEX,206.005000,100
2019-10-17 17:13:11.773961984,2019-10-17 17:13:11.773942784,9133408,T,IEX,206.030000,100
2019-10-17 17:14:49.251388928,2019-10-17 17:14:49.251366276,9164191,T,IEX,206.010000,100
2019-10-17 17:14:50.253334016,2019-10-17 17:14:50.253319086,9164900,T,IEX,205.995000,100
2019-10-17 17:15:16.215814912,2019-10-17 17:15:16.215795433,9174970,T,IEX,206.020000,100
2019-10-17 17:16:01.873670912,2019-10-17 17:16:01.873651664,9191155,T,IEX,205.975000,100
2019-10-17 17:16:23.609816064,2019-10-17 17:16:23.609797919,9199650,T,IEX,205.950000,100
2019-10-17 17:16:24.611606016,2019-10-17 17:16:24.611586632,9200523,T,IEX,205.975000,100
2019-10-17 17:17:51.568275968,2019-10-17 17:17:51.568258209,9243951,T,IEX,206.025000,100
2019-10-17 17:18:04.726651904,2019-10-17 17:18:04.726632589,9250989,T,IEX,206.045000,100
2019-10-17 17:18:18.687360000,2019-10-17 17:18:18.687342519,9256119,T,IEX,206.110000,50
2019-10-17 17:18:42.726810880,2019-10-17 17:18:42.726790590,9273255,T,IEX,206.155000,100
2019-10-17 17:18:50.277176064,2019-10-17 17:18:50.277152533,9277177,T,IEX,206.160000,100
2019-10-17 17:19:14.562096128,2019-10-17 17:19:14.562075151,9289032,T,IEX,206.110000,100
2019-10-17 17:19:54.689469952,2019-10-17 17:19:54.689449590,9304190,T,IEX,206.115000,100
2019-10-17 17:20:27.209125888,2019-10-17 17:20:27.209109226,9317732,T,IEX,206.115000,100
2019-10-17 17:20:57.856687104,2019-10-17 17:20:57.856668418,9328867,T,IEX,206.075000,100
2019-10-17 17:21:09.472071936,2019-10-17 17:21:09.472050841,9332154,T,IEX,206.040000,100
2019-10-17 17:21:23.39919104,2019-10-17 17:21:23.39899504,9336187,T,IEX,206.050000,100
2019-10-17 17:21:44.706961920,2019-10-17 17:21:44.706943203,9342563,T,IEX,206.055000,100
2019-10-17 17:21:49.740578048,2019-10-17 17:21:49.740560231,9343981,T,IEX,206.040000,100
2019-10-17 17:23:36.25160960,2019-10-17 17:23:36.25139154,9373148,T,IEX,205.960000,100
2019-10-17 17:23:36.541325056,2019-10-17 17:23:36.541304660,9373239,T,IEX,205.960000,25
2019-10-17 17:23:36.694391040,2019-10-17 17:23:36.694370612,9373272,T,IEX,205.970000,100
2019-10-17 17:23:36.695770880,2019-10-17 17:23:36.695752484,9373274,T,IEX,205.970000,100
2019-10-17 17:24:15.802391040,2019-10-17 17:24:15.802375130,9389150,T,IEX,205.925000,100
2019-10-17 17:25:46.800815104,2019-10-17 17:25:46.800791529,9418979,T,IEX,205.890000,100
2019-10-17 17:25:55.156336128,2019-10-17 17:25:55.156317992,9422122,T,IEX,205.935000,100
2019-10-17 17:25:57.962081024,2019-10-17 17:25:57.962064224,9423147,T,IEX,205.930000,100
2019-10-17 17:26:00.926115072,2019-10-17 17:26:00.926091704,9424195,T,IEX,205.930000,100
2019-10-17 17:26:02.935766016,2019-10-17 17:26:02.935748477,9424881,T,IEX,205.965000,100
2019-10-17 17:26:23.841976064,2019-10-17 17:26:23.841957460,9430907,T,IEX,205.945000,100
2019-10-17 17:26:37.379891968,2019-10-17 17:26:37.379871666,9433972,T,IEX,205.950000,100
2019-10-17 17:26:42.707955968,2019-10-17 17:26:42.707937460,9435751,T,IEX,205.965000,100
2019-10-17 17:26:59.680794112,2019-10-17 17:26:59.680776775,9439654,T,IEX,205.935000,100
2019-10-17 17:27:00.706125056,2019-10-17 17:27:00.706103553,9441024,T,IEX,205.930000,100
2019-10-17 17:27:02.222492928,2019-10-17 17:27:02.222475004,9441896,T,IEX,205.970000,50
2019-10-17 17:27:02.222511104,2019-10-17 17:27:02.222494270,9441897,T,IEX,205.980000,100
2019-10-17 17:27:10.116940032,2019-10-17 17:27:10.116920328,9445006,T,IEX,205.955000,100
2019-10-17 17:27:16.824592896,2019-10-17 17:27:16.824573775,9447270,T,IEX,205.960000,100
2019-10-17 17:27:16.827028992,2019-10-17 17:27:16.827011109,9447272,T,IEX,205.935000,100
2019-10-17 17:27:31.970697984,2019-10-17 17:27:31.970678329,9451134,T,IEX,205.895000,100
2019-10-17 17:27:43.625466880,2019-10-17 17:27:43.625451518,9454066,T,IEX,205.865000,100
2019-10-17 17:27:50.436751872,2019-10-17 17:27:50.436732898,9455510,T,IEX,205.905000,100
2019-10-17 17:27:57.369300992,2019-10-17 17:27:57.369281645,9457398,T,IEX,205.945000,100
2019-10-17 17:28:03.6447104,2019-10-17 17:28:03.6426742,9458993,T,IEX,205.945000,100
2019-10-17 17:28:38.45500928,2019-10-17 17:28:38.45481283,9467283,T,IEX,205.840000,100
2019-10-17 17:29:01.775951104,2019-10-17 17:29:01.775932778,9475480,T,IEX,205.830000,100
2019-10-17 17:29:26.984103936,2019-10-17 17:29:26.984086415,9484329,T,IEX,205.850000,100
2019-10-17 17:29:39.120836096,2019-10-17 17:29:39.120815827,9487641,T,IEX,205.875000,100
2019-10-17 17:30:08.105959936,2019-10-17 17:30:08.105940424,9500587,T,IEX,206.020000,100
2019-10-17 17:30:34.596939008,2019-10-17 17:30:34.596918056,9511399,T,IEX,206.130000,100
2019-10-17 17:30:34.846196992,2019-10-17 17:30:34.846176810,9511504,T,IEX,206.125000,100
2019-10-17 17:31:12.257009920,2019-10-17 17:31:12.256989314,9524826,T,IEX,206.215000,100
2019-10-17 17:31:58.701184000,2019-10-17 17:31:58.701167672,9539510,T,IEX,206.335000,100
2019-10-17 17:32:15.763696128,2019-10-17 17:32:15.763674475,9544905,T,IEX,206.320000,300
2019-10-17 17:32:15.823464960,2019-10-17 17:32:15.823445620,9544933,T,IEX,206.170000,100
2019-10-17 17:32:15.882313984,2019-10-17 17:32:15.882297059,9544961,T,IEX,206.170000,100
2019-10-17 17:32:21.619314944,2019-10-17 17:32:21.619296530,9546729,T,IEX,206.240000,200
2019-10-17 17:32:21.628079104,2019-10-17 17:32:21.628057578,9546730,T,IEX,206.240000,400
2019-10-17 17:32:40.602818048,2019-10-17 17:32:40.602796365,9552171,T,IEX,206.300000,100
2019-10-17 17:33:25.212605952,2019-10-17 17:33:25.212585570,9569172,T,IEX,206.370000,100
2019-10-17 17:33:57.564493056,2019-10-17 17:33:57.564470599,9582688,T,IEX,206.335000,100
2019-10-17 17:35:01.634179072,2019-10-17 17:35:01.634157471,9609355,T,IEX,206.450000,100
2019-10-17 17:35:06.425498880,2019-10-17 17:35:06.425481520,9611590,T,IEX,206.330000,1
2019-10-17 17:35:06.426458880,2019-10-17 17:35:06.426440689,9611594,T,IEX,206.330000,99
2019-10-17 17:35:15.911162880,2019-10-17 17:35:15.911145619,9614821,T,IEX,206.120000,50
2019-10-17 17:35:20.594260992,2019-10-17 17:35:20.594245349,9616454,T,IEX,206.210000,43
2019-10-17 17:35:26.358393088,2019-10-17 17:35:26.358374981,9619203,T,IEX,206.250000,100
2019-10-17 17:35:34.43077888,2019-10-17 17:35:34.43059360,9623124,T,IEX,206.285000,100
2019-10-17 17:36:04.479479040,2019-10-17 17:36:04.479454482,9634492,T,IEX,206.275000,100
2019-10-17 17:37:47.126713088,2019-10-17 17:37:47.126692242,9667483,T,IEX,206.340000,100
2019-10-17 17:37:47.126726912,2019-10-17 17:37:47.126708623,9667484,T,IEX,206.340000,20
2019-10-17 17:38:47.463374080,2019-10-17 17:38:47.463353659,9687201,T,IEX,206.360000,100
2019-10-17 17:39:14.20617984,2019-10-17 17:39:14.20601380,9697125,T,IEX,206.390000,48
2019-10-17 17:39:14.20736000,2019-10-17 17:39:14.20712060,9697129,T,IEX,206.390000,100
2019-10-17 17:39:15.212592896,2019-10-17 17:39:15.212572745,9697657,T,IEX,206.390000,23
2019-10-17 17:39:17.830021120,2019-10-17 17:39:17.829998741,9698347,T,IEX,206.425000,100
2019-10-17 17:40:39.736817920,2019-10-17 17:40:39.736796791,9723074,T,IEX,206.400000,100
2019-10-17 17:41:21.125758976,2019-10-17 17:41:21.125739291,9736451,T,IEX,206.395000,31
2019-10-17 17:42:02.804090112,2019-10-17 17:42:02.804072299,9748230,T,IEX,206.350000,100
2019-10-17 17:42:04.55579904,2019-10-17 17:42:04.55563081,9749033,T,IEX,206.335000,100
2019-10-17 17:43:36.47432960,2019-10-17 17:43:36.47411986,9782759,T,IEX,206.360000,100
2019-10-17 17:43:36.47446016,2019-10-17 17:43:36.47427778,9782760,T,IEX,206.360000,169
2019-10-17 17:43:42.549095936,2019-10-17 17:43:42.549077555,9785800,T,IEX,206.370000,100
2019-10-17 17:43:42.554790912,2019-10-17 17:43:42.554771480,9785804,T,IEX,206.370000,600
2019-10-17 17:44:14.994501888,2019-10-17 17:44:14.994486311,9797651,T,IEX,206.470000,100
2019-10-17 17:45:14.634152960,2019-10-17 17:45:14.634135022,9819220,T,IEX,206.470000,100
2019-10-17 17:45:19.993172992,2019-10-17 17:45:19.993153230,9820468,T,IEX,206.545000,100
2019-10-17 17:45:37.273623040,2019-10-17 17:45:37.273602662,9824730,T,IEX,206.545000,100
2019-10-17 17:45:49.660083968,2019-10-17 17:45:49.660062607,9828754,T,IEX,206.585000,100
2019-10-17 17:46:06.745644032,2019-10-17 17:46:06.745625571,9833404,T,IEX,206.580000,100
2019-10-17 17:46:44.112076032,2019-10-17 17:46:44.112055947,9844115,T,IEX,206.660000,100
2019-10-17 17:46:56.923656960,2019-10-17 17:46:56.923636592,9848201,T,IEX,206.745000,100
2019-10-17 17:47:45.336084992,2019-10-17 17:47:45.336062567,9862135,T,IEX,206.750000,100
2019-10-17 17:47:51.222007040,2019-10-17 17:47:51.221986800,9864383,T,IEX,206.775000,100
2019-10-17 17:47:51.225849088,2019-10-17 17:47:51.225830934,9864385,T,IEX,206.765000,100
2019-10-17 17:47:51.225947904,2019-10-17 17:47:51.225931595,9864386,T,IEX,206.765000,100
2019-10-17 17:47:51.745862912,2019-10-17 17:47:51.745844692,9864644,T,IEX,206.760000,100
2019-10-17 17:47:57.488557056,2019-10-17 17:47:57.488535095,9866434,T,IEX,206.770000,162
2019-10-17 17:47:57.704399104,2019-10-17 17:47:57.704377183,9866469,T,IEX,206.800000,100
2019-10-17 17:47:57.779710976,2019-10-17 17:47:57.779689739,9866499,T,IEX,206.770000,100
2019-10-17 17:47:58.347013888,2019-10-17 17:47:58.346996510,9866627,T,IEX,206.800000,100
2019-10-17 17:48:01.830909952,2019-10-17 17:48:01.830886487,9868896,T,IEX,206.770000,100
2019-10-17 17:48:24.854161920,2019-10-17 17:48:24.854141494,9877263,T,IEX,206.725000,100
2019-10-17 17:48:32.783390976,2019-10-17 17:48:32.783373237,9879348,T,IEX,206.770000,100
2019-10-17 17:48:46.556048896,2019-10-17 17:48:46.556029306,9884705,T,IEX,206.830000,100
2019-10-17 17:48:54.471490048,2019-10-17 17:48:54.471472118,9886671,T,IEX,206.820000,100
2019-10-17 17:49:28.406860032,2019-10-17 17:49:28.406842686,9898125,T,IEX,206.715000,100
2019-10-17 17:49:42.423858944,2019-10-17 17:49:42.423836251,9902597,T,IEX,206.740000,100
2019-10-17 17:50:39.410514944,2019-10-17 17:50:39.410495177,9917675,T,IEX,206.735000,100
2019-10-17 17:50:57.499779072,2019-10-17 17:50:57.499758138,9926530,T,IEX,206.770000,100
2019-10-17 17:51:55.756873984,2019-10-17 17:51:55.756852680,9949163,T,IEX,206.930000,100
2019-10-17 17:51:56.759006976,2019-10-17 17:51:56.758988027,9949739,T,IEX,206.930000,100
2019-10-17 17:51:57.753954048,2019-10-17 17:51:57.753934562,9950380,T,IEX,206.965000,100
2019-10-17 17:52:07.666398976,2019-10-17 17:52:07.666378866,9953160,T,IEX,206.895000,100
2019-10-17 17:52:26.109751040,2019-10-17 17:52:26.109729887,9960125,T,IEX,206.975000,100
2019-10-17 17:52:26.111737088,2019-10-17 17:52:26.111718035,9960128,T,IEX,206.975000,100
2019-10-17 17:52:26.112945920,2019-10-17 17:52:26.112928007,9960130,T,IEX,206.975000,26
2019-10-17 17:52:26.147585024,2019-10-17 17:52:26.147567481,9960139,T,IEX,206.975000,100
2019-10-17 17:52:41.66407936,2019-10-17 17:52:41.66387742,9966370,T,IEX,206.875000,100
2019-10-17 17:53:39.994844928,2019-10-17 17:53:39.994824790,9984951,T,IEX,206.900000,100
2019-10-17 17:53:46.765555968,2019-10-17 17:53:46.765537277,9986737,T,IEX,206.910000,100
2019-10-17 17:53:49.282976000,2019-10-17 17:53:49.282957984,9987954,T,IEX,206.950000,97
2019-10-17 17:53:51.879971072,2019-10-17 17:53:51.879949611,9988613,T,IEX,206.950000,100
2019-10-17 17:53:51.887529984,2019-10-17 17:53:51.887510652,9988617,T,IEX,206.940000,100
2019-10-17 17:53:52.3540992,2019-10-17 17:53:52.3521173,9988642,T,IEX,206.970000,3
2019-10-17 17:53:52.3550976,2019-10-17 17:53:52.3534267,9988643,T,IEX,206.970000,35
2019-10-17 17:53:52.3568128,2019-10-17 17:53:52.3551477,9988644,T,IEX,206.970000,62
2019-10-17 17:53:52.104911104,2019-10-17 17:53:52.104889685,9988662,T,IEX,206.960000,100
2019-10-17 17:53:52.121314048,2019-10-17 17:53:52.121294273,9988663,T,IEX,206.960000,100
2019-10-17 17:54:11.512261888,2019-10-17 17:54:11.512243389,9997360,T,IEX,206.965000,100
2019-10-17 17:54:40.842416128,2019-10-17 17:54:40.842398558,10006555,T,IEX,206.930000,100
2019-10-17 17:55:50.745182976,2019-10-17 17:55:50.745166054,10031741,T,IEX,206.910000,100
2019-10-17 17:56:35.43326976,2019-10-17 17:56:35.43306674,10045392,T,IEX,206.765000,100
2019-10-17 17:56:35.43348992,2019-10-17 17:56:35.43332740,10045393,T,IEX,206.765000,100
2019-10-17 17:56:56.79252992,2019-10-17 17:56:56.79231900,10050621,T,IEX,206.820000,100
2019-10-17 17:57:09.356432896,2019-10-17 17:57:09.356414263,10055234,T,IEX,206.870000,100
2019-10-17 17:57:17.114694912,2019-10-17 17:57:17.114674793,10058626,T,IEX,206.850000,100
2019-10-17 17:57:17.114711040,2019-10-17 17:57:17.114693950,10058627,T,IEX,206.850000,100
2019-10-17 17:57:22.659613952,2019-10-17 17:57:22.659593124,10060409,T,IEX,206.850000,200
2019-10-17 17:57:48.150529024,2019-10-17 17:57:48.150508269,10067316,T,IEX,206.850000,100
2019-10-17 17:58:14.185555968,2019-10-17 17:58:14.185532951,10074356,T,IEX,206.880000,100
2019-10-17 17:58:39.223319040,2019-10-17 17:58:39.223298835,10086123,T,IEX,206.805000,100
2019-10-17 17:59:33.296601088,2019-10-17 17:59:33.296577571,10109771,T,IEX,206.795000,100
2019-10-17 17:59:54.330049024,2019-10-17 17:59:54.330025826,10116926,T,IEX,206.825000,100
2019-10-17 18:00:21.662887936,2019-10-17 18:00:21.662868985,10130399,T,IEX,206.790000,100
2019-10-17 18:00:51.408096000,2019-10-17 18:00:51.408076612,10140965,T,IEX,206.770000,100
2019-10-17 18:01:14.907548928,2019-10-17 18:01:14.907526917,10148792,T,IEX,206.690000,100
2019-10-17 18:01:46.730160128,2019-10-17 18:01:46.730137138,10162518,T,IEX,206.660000,100
2019-10-17 18:02:07.764576000,2019-10-17 18:02:07.764554915,10176305,T,IEX,206.610000,100
2019-10-17 18:02:20.312233984,2019-10-17 18:02:20.312214370,10184110,T,IEX,206.550000,200
2019-10-17 18:02:33.87916032,2019-10-17 18:02:33.87896859,10191283,T,IEX,206.575000,100
2019-10-17 18:04:54.270580992,2019-10-17 18:04:54.270564586,10256680,T,IEX,206.580000,100
2019-10-17 18:06:07.881596928,2019-10-17 18:06:07.881578942,10282640,T,IEX,206.545000,100
2019-10-17 18:06:34.995405056,2019-10-17 18:06:34.995382425,10292517,T,IEX,206.555000,100
2019-10-17 18:06:34.995480064,2019-10-17 18:06:34.995462650,10292518,T,IEX,206.570000,50
2019-10-17 18:09:31.37915904,2019-10-17 18:09:31.37897078,10348632,T,IEX,206.600000,100
2019-10-17 18:11:05.717785088,2019-10-17 18:11:05.717765167,10385875,T,IEX,206.525000,17
2019-10-17 18:11:17.293161984,2019-10-17 18:11:17.293142283,10389803,T,IEX,206.590000,100
2019-10-17 18:11:18.489499904,2019-10-17 18:11:18.489478262,10390223,T,IEX,206.585000,100
2019-10-17 18:11:26.144248064,2019-10-17 18:11:26.144228081,10393159,T,IEX,206.625000,100
2019-10-17 18:11:51.384409088,2019-10-17 18:11:51.384388755,10402851,T,IEX,206.730000,100
2019-10-17 18:12:01.169453056,2019-10-17 18:12:01.169434360,10407315,T,IEX,206.730000,100
2019-10-17 18:12:12.804137984,2019-10-17 18:12:12.804121618,10410882,T,IEX,206.725000,100
2019-10-17 18:12:56.223403008,2019-10-17 18:12:56.223382385,10429021,T,IEX,206.685000,100
2019-10-17 18:13:30.247196928,2019-10-17 18:13:30.247179278,10442631,T,IEX,206.655000,100
2019-10-17 18:14:28.298091008,2019-10-17 18:14:28.298069162,10465245,T,IEX,206.685000,100
2019-10-17 18:14:59.508126976,2019-10-17 18:14:59.508108277,10476712,T,IEX,206.735000,100
2019-10-17 18:16:11.589011968,2019-10-17 18:16:11.588993925,10506668,T,IEX,206.725000,100
2019-10-17 18:17:33.609800960,2019-10-17 18:17:33.609781181,10537931,T,IEX,206.775000,100
2019-10-17 18:19:09.805216000,2019-10-17 18:19:09.805197631,10573508,T,IEX,206.860000,100
2019-10-17 18:19:27.766577920,2019-10-17 18:19:27.766557933,10582464,T,IEX,206.880000,100
2019-10-17 18:20:02.795795968,2019-10-17 18:20:02.795774783,10595908,T,IEX,206.905000,100
2019-10-17 18:20:43.310166016,2019-10-17 18:20:43.310144720,10613486,T,IEX,206.900000,100
2019-10-17 18:22:03.824625920,2019-10-17 18:22:03.824607152,10640893,T,IEX,206.940000,100
2019-10-17 18:22:03.851387904,2019-10-17 18:22:03.851363831,10640894,T,IEX,206.970000,100
2019-10-17 18:22:03.863514112,2019-10-17 18:22:03.863493929,10640895,T,IEX,207.000000,121
2019-10-17 18:22:14.434000896,2019-10-17 18:22:14.433982287,10644091,T,IEX,206.975000,100
2019-10-17 18:25:11.77893888,2019-10-17 18:25:11.77807002,10698849,T,IEX,206.920000,100
2019-10-17 18:25:28.64822016,2019-10-17 18:25:28.64801847,10706781,T,IEX,206.955000,100
2019-10-17 18:26:14.266023936,2019-10-17 18:26:14.266006353,10720137,T,IEX,206.925000,100
2019-10-17 18:26:40.701902080,2019-10-17 18:26:40.701880449,10730899,T,IEX,206.970000,320
2019-10-17 18:27:09.480436992,2019-10-17 18:27:09.480419107,10742319,T,IEX,207.000000,779
2019-10-17 18:27:09.480457984,2019-10-17 18:27:09.480440038,10742320,T,IEX,207.000000,196
2019-10-17 18:27:09.480664064,2019-10-17 18:27:09.480645663,10742323,T,IEX,207.000000,4
2019-10-17 18:27:09.483286016,2019-10-17 18:27:09.483265827,10742344,T,IEX,207.000000,700
2019-10-17 18:27:10.10544896,2019-10-17 18:27:10.10529855,10742848,T,IEX,207.000000,196
2019-10-17 18:27:10.10564096,2019-10-17 18:27:10.10547068,10742849,T,IEX,207.000000,4
2019-10-17 18:29:14.754163968,2019-10-17 18:29:14.754146125,10792065,T,IEX,207.000000,100
2019-10-17 18:29:14.754190080,2019-10-17 18:29:14.754172591,10792066,T,IEX,207.000000,100
2019-10-17 18:30:04.807955968,2019-10-17 18:30:04.807937897,10809666,T,IEX,206.975000,200
2019-10-17 18:31:05.404189952,2019-10-17 18:31:05.404168027,10829456,T,IEX,206.790000,100
2019-10-17 18:34:40.647528960,2019-10-17 18:34:40.647512588,10907676,T,IEX,206.895000,100
2019-10-17 18:35:41.740997888,2019-10-17 18:35:41.740978171,10929550,T,IEX,206.840000,100
2019-10-17 18:35:42.757003008,2019-10-17 18:35:42.756984561,10929848,T,IEX,206.805000,100
2019-10-17 18:36:03.352889088,2019-10-17 18:36:03.352869460,10936516,T,IEX,206.840000,100
2019-10-17 18:36:23.820162048,2019-10-17 18:36:23.820141141,10946460,T,IEX,206.915000,100
2019-10-17 18:36:30.597559040,2019-10-17 18:36:30.597538936,10949238,T,IEX,206.925000,100
2019-10-17 18:36:31.384143104,2019-10-17 18:36:31.384125051,10949398,T,IEX,206.925000,100
2019-10-17 18:36:42.848787968,2019-10-17 18:36:42.848768542,10952521,T,IEX,206.860000,100
2019-10-17 18:37:06.327396096,2019-10-17 18:37:06.327378685,10963952,T,IEX,206.875000,106
2019-10-17 18:37:06.850044928,2019-10-17 18:37:06.850023859,10964438,T,IEX,206.880000,100
2019-10-17 18:37:09.850480128,2019-10-17 18:37:09.850460324,10965461,T,IEX,206.875000,100
2019-10-17 18:37:38.385739008,2019-10-17 18:37:38.385720847,10974822,T,IEX,206.885000,100
2019-10-17 18:38:06.9947904,2019-10-17 18:38:06.9930635,10985764,T,IEX,206.925000,100
2019-10-17 18:38:22.946332928,2019-10-17 18:38:22.946311388,10991326,T,IEX,206.970000,100
2019-10-17 18:38:30.599721984,2019-10-17 18:38:30.599699586,10993176,T,IEX,206.940000,100
2019-10-17 18:38:30.602220032,2019-10-17 18:38:30.602200783,10993177,T,IEX,206.940000,100
2019-10-17 18:38:44.641841920,2019-10-17 18:38:44.641823441,10996535,T,IEX,206.950000,100
2019-10-17 18:39:23.235644928,2019-10-17 18:39:23.235625009,11008240,T,IEX,206.965000,100
2019-10-17 18:41:30.597807104,2019-10-17 18:41:30.597783710,11051786,T,IEX,206.960000,100
2019-10-17 18:41:42.854942976,2019-10-17 18:41:42.854921590,11054904,T,IEX,206.955000,100
2019-10-17 18:42:10.530511872,2019-10-17 18:42:10.530493874,11062580,T,IEX,206.990000,108
2019-10-17 18:42:10.566224896,2019-10-17 18:42:10.566205265,11062721,T,IEX,207.030000,100
2019-10-17 18:42:10.589289984,2019-10-17 18:42:10.589268327,11062741,T,IEX,207.045000,100
2019-10-17 18:42:10.589305088,2019-10-17 18:42:10.589288186,11062742,T,IEX,207.045000,100
2019-10-17 18:42:15.596611072,2019-10-17 18:42:15.596592911,11063895,T,IEX,207.060000,100
2019-10-17 18:42:35.582693120,2019-10-17 18:42:35.582671747,11068873,T,IEX,207.100000,100
2019-10-17 18:42:45.598308096,2019-10-17 18:42:45.598288608,11072209,T,IEX,207.030000,100
2019-10-17 18:43:19.129903104,2019-10-17 18:43:19.129884805,11084062,T,IEX,207.075000,100
2019-10-17 18:43:33.855789056,2019-10-17 18:43:33.855771206,11090267,T,IEX,207.040000,100
2019-10-17 18:44:05.585392896,2019-10-17 18:44:05.585373699,11100850,T,IEX,207.010000,100
2019-10-17 18:45:15.598310912,2019-10-17 18:45:15.598291446,11121690,T,IEX,207.020000,100
2019-10-17 18:45:15.859502080,2019-10-17 18:45:15.859481260,11121747,T,IEX,207.020000,100
2019-10-17 18:45:30.598458880,2019-10-17 18:45:30.598438758,11126433,T,IEX,207.020000,100
2019-10-17 18:45:39.862386944,2019-10-17 18:45:39.862368720,11128933,T,IEX,207.040000,100
2019-10-17 18:45:51.757340928,2019-10-17 18:45:51.757319676,11132415,T,IEX,207.015000,100
2019-10-17 18:46:18.231739904,2019-10-17 18:46:18.231720277,11139944,T,IEX,207.015000,100
2019-10-17 18:47:00.23238912,2019-10-17 18:47:00.23219299,11153433,T,IEX,207.010000,100
2019-10-17 18:47:15.597327104,2019-10-17 18:47:15.597307614,11159468,T,IEX,207.065000,100
2019-10-17 18:47:52.321601024,2019-10-17 18:47:52.321582124,11171109,T,IEX,207.020000,100
2019-10-17 18:47:54.627155968,2019-10-17 18:47:54.627136968,11172051,T,IEX,207.055000,100
2019-10-17 18:48:39.266899968,2019-10-17 18:48:39.266880887,11188032,T,IEX,207.095000,100
2019-10-17 18:48:41.933389056,2019-10-17 18:48:41.933372003,11189004,T,IEX,207.100000,100
2019-10-17 18:48:44.96012032,2019-10-17 18:48:44.95993340,11189461,T,IEX,207.135000,100
2019-10-17 18:48:44.894300928,2019-10-17 18:48:44.894279831,11189695,T,IEX,207.135000,100
2019-10-17 18:49:29.19297024,2019-10-17 18:49:29.19275151,11202108,T,IEX,207.170000,100
2019-10-17 18:49:33.813959936,2019-10-17 18:49:33.813940944,11203161,T,IEX,207.195000,100
2019-10-17 18:50:02.724873984,2019-10-17 18:50:02.724855082,11212234,T,IEX,207.205000,100
2019-10-17 18:50:19.77146112,2019-10-17 18:50:19.77127310,11221645,T,IEX,207.230000,100
2019-10-17 18:50:22.737155072,2019-10-17 18:50:22.737135916,11225532,T,IEX,207.290000,100
2019-10-17 18:50:25.404845056,2019-10-17 18:50:25.404818907,11228350,T,IEX,207.250000,100
2019-10-17 18:51:06.343048960,2019-10-17 18:51:06.343031153,11254611,T,IEX,207.220000,2
2019-10-17 18:51:12.870362880,2019-10-17 18:51:12.870342478,11258074,T,IEX,207.210000,50
2019-10-17 18:51:12.870376960,2019-10-17 18:51:12.870360931,11258075,T,IEX,207.200000,50
2019-10-17 18:51:31.807841024,2019-10-17 18:51:31.807822989,11265920,T,IEX,207.205000,100
2019-10-17 18:51:47.259856896,2019-10-17 18:51:47.259837981,11271522,T,IEX,207.215000,100
2019-10-17 18:52:21.629230080,2019-10-17 18:52:21.629207515,11282183,T,IEX,207.260000,100
2019-10-17 18:52:28.735090944,2019-10-17 18:52:28.735071692,11283809,T,IEX,207.365000,100
2019-10-17 18:52:28.735150080,2019-10-17 18:52:28.735134896,11283810,T,IEX,207.380000,100
2019-10-17 18:52:31.550452992,2019-10-17 18:52:31.550433437,11284712,T,IEX,207.350000,50
2019-10-17 18:53:23.604290048,2019-10-17 18:53:23.604265563,11301325,T,IEX,207.340000,200
2019-10-17 18:53:23.605764096,2019-10-17 18:53:23.605746186,11301375,T,IEX,207.320000,100
2019-10-17 18:53:29.409666048,2019-10-17 18:53:29.409632432,11304210,T,IEX,207.300000,100
2019-10-17 18:55:46.141314048,2019-10-17 18:55:46.141294543,11359112,T,IEX,207.365000,100
2019-10-17 18:55:59.436357120,2019-10-17 18:55:59.436336817,11362878,T,IEX,207.475000,100
2019-10-17 18:56:16.19240960,2019-10-17 18:56:16.19220653,11367500,T,IEX,207.530000,29
2019-10-17 18:57:12.827166976,2019-10-17 18:57:12.827142551,11387457,T,IEX,207.610000,17
2019-10-17 18:57:23.100720128,2019-10-17 18:57:23.100701620,11392841,T,IEX,207.630000,100
2019-10-17 18:58:23.819252992,2019-10-17 18:58:23.819230206,11413720,T,IEX,207.535000,100
2019-10-17 18:58:23.822817024,2019-10-17 18:58:23.822797412,11413722,T,IEX,207.535000,200
2019-10-17 18:58:47.210842112,2019-10-17 18:58:47.210824407,11421629,T,IEX,207.580000,100
2019-10-17 18:58:48.161787904,2019-10-17 18:58:48.161767808,11422391,T,IEX,207.525000,100
2019-10-17 18:58:48.161829120,2019-10-17 18:58:48.161811988,11422392,T,IEX,207.525000,100
2019-10-17 18:58:50.337961984,2019-10-17 18:58:50.337937832,11423387,T,IEX,207.530000,100
2019-10-17 18:59:20.326454016,2019-10-17 18:59:20.326435087,11435628,T,IEX,207.560000,100
2019-10-17 19:00:16.274180096,2019-10-17 19:00:16.274163027,11458990,T,IEX,207.565000,100
2019-10-17 19:00:18.853179904,2019-10-17 19:00:18.853162059,11460779,T,IEX,207.515000,40
2019-10-17 19:00:18.958351104,2019-10-17 19:00:18.958335730,11460908,T,IEX,207.515000,100
2019-10-17 19:00:36.886152960,2019-10-17 19:00:36.886131548,11467274,T,IEX,207.510000,50
2019-10-17 19:00:57.887741952,2019-10-17 19:00:57.887722387,11475343,T,IEX,207.420000,100
2019-10-17 19:03:53.952442880,2019-10-17 19:03:53.952421284,11532491,T,IEX,207.410000,600
2019-10-17 19:05:27.691560960,2019-10-17 19:05:27.691539495,11564490,T,IEX,207.360000,100
2019-10-17 19:06:04.637912064,2019-10-17 19:06:04.637892542,11577074,T,IEX,207.390000,32
2019-10-17 19:07:26.978396928,2019-10-17 19:07:26.978380697,11604948,T,IEX,207.385000,100
2019-10-17 19:07:29.609957888,2019-10-17 19:07:29.609938626,11605812,T,IEX,207.360000,100
2019-10-17 19:07:30.125163008,2019-10-17 19:07:30.125145525,11605944,T,IEX,207.380000,100
2019-10-17 19:07:30.126636032,2019-10-17 19:07:30.126616214,11605945,T,IEX,207.380000,100
2019-10-17 19:07:30.126699008,2019-10-17 19:07:30.126681960,11605946,T,IEX,207.400000,200
2019-10-17 19:07:44.886147072,2019-10-17 19:07:44.886129260,11609606,T,IEX,207.400000,66
2019-10-17 19:08:10.51215872,2019-10-17 19:08:10.51194179,11622797,T,IEX,207.340000,100
2019-10-17 19:08:53.422651904,2019-10-17 19:08:53.422631179,11635894,T,IEX,207.355000,100
2019-10-17 19:10:23.250477056,2019-10-17 19:10:23.250458562,11665207,T,IEX,207.295000,100
2019-10-17 19:12:57.904397056,2019-10-17 19:12:57.904380939,11718818,T,IEX,207.370000,100
2019-10-17 19:12:57.906437120,2019-10-17 19:12:57.906418377,11718819,T,IEX,207.370000,3
2019-10-17 19:14:48.143840000,2019-10-17 19:14:48.143819196,11756491,T,IEX,207.440000,100
2019-10-17 19:15:27.314909952,2019-10-17 19:15:27.314891741,11770912,T,IEX,207.420000,100
2019-10-17 19:18:49.22392064,2019-10-17 19:18:49.22376295,11841807,T,IEX,207.265000,200
2019-10-17 19:18:49.25384960,2019-10-17 19:18:49.25363223,11841809,T,IEX,207.265000,200
2019-10-17 19:19:08.265082880,2019-10-17 19:19:08.265063232,11848419,T,IEX,207.235000,100
2019-10-17 19:19:08.265099008,2019-10-17 19:19:08.265083952,11848420,T,IEX,207.235000,100
2019-10-17 19:19:12.238704128,2019-10-17 19:19:12.238682718,11849447,T,IEX,207.235000,100
2019-10-17 19:20:42.926884096,2019-10-17 19:20:42.926866194,11879263,T,IEX,207.185000,100
2019-10-17 19:21:17.735190016,2019-10-17 19:21:17.735170261,11890835,T,IEX,207.150000,100
2019-10-17 19:21:17.735542016,2019-10-17 19:21:17.735524897,11890837,T,IEX,207.150000,100
2019-10-17 19:21:17.735772928,2019-10-17 19:21:17.735751925,11890838,T,IEX,207.150000,100
2019-10-17 19:21:28.412431104,2019-10-17 19:21:28.412410284,11894494,T,IEX,207.190000,100
2019-10-17 19:22:53.110223104,2019-10-17 19:22:53.110202595,11924938,T,IEX,207.230000,200
2019-10-17 19:23:40.32726016,2019-10-17 19:23:40.32706418,11939531,T,IEX,207.210000,100
2019-10-17 19:24:33.138743040,2019-10-17 19:24:33.138724683,11956557,T,IEX,207.220000,100
2019-10-17 19:25:21.103772928,2019-10-17 19:25:21.103753562,11971130,T,IEX,207.270000,100
2019-10-17 19:25:41.64951040,2019-10-17 19:25:41.64933542,11977925,T,IEX,207.270000,100
2019-10-17 19:25:41.66128896,2019-10-17 19:25:41.66108407,11977926,T,IEX,207.270000,100
2019-10-17 19:26:07.537417984,2019-10-17 19:26:07.537397801,11987709,T,IEX,207.290000,100
2019-10-17 19:26:07.537428992,2019-10-17 19:26:07.537410163,11987710,T,IEX,207.290000,100
2019-10-17 19:26:07.626721024,2019-10-17 19:26:07.626700187,11987826,T,IEX,207.300000,100
2019-10-17 19:27:27.967106048,2019-10-17 19:27:27.967083526,12015907,T,IEX,207.340000,2
2019-10-17 19:27:27.967121920,2019-10-17 19:27:27.967096058,12015908,T,IEX,207.340000,100
2019-10-17 19:29:45.126927872,2019-10-17 19:29:45.126910985,12070118,T,IEX,207.300000,100
2019-10-17 19:30:27.701304064,2019-10-17 19:30:27.701284261,12094652,T,IEX,207.370000,200
2019-10-17 19:30:54.964427008,2019-10-17 19:30:54.964411467,12110423,T,IEX,207.360000,100
2019-10-17 19:31:06.356003072,2019-10-17 19:31:06.355984804,12115578,T,IEX,207.360000,100
2019-10-17 19:32:00.940686080,2019-10-17 19:32:00.940667305,12140357,T,IEX,207.330000,50
2019-10-17 19:32:23.922889984,2019-10-17 19:32:23.922870997,12156079,T,IEX,207.380000,39
2019-10-17 19:32:46.837894912,2019-10-17 19:32:46.837874516,12169936,T,IEX,207.320000,100
2019-10-17 19:34:07.371300096,2019-10-17 19:34:07.371277047,12204926,T,IEX,207.140000,50
2019-10-17 19:34:07.372119040,2019-10-17 19:34:07.372101350,12204927,T,IEX,207.140000,50
2019-10-17 19:34:13.14993920,2019-10-17 19:34:13.14972164,12207638,T,IEX,207.150000,100
2019-10-17 19:34:20.37693952,2019-10-17 19:34:20.37675267,12211588,T,IEX,207.195000,100
2019-10-17 19:34:20.38480896,2019-10-17 19:34:20.38463868,12211638,T,IEX,207.200000,100
2019-10-17 19:34:20.38970880,2019-10-17 19:34:20.38952235,12211668,T,IEX,207.200000,100
2019-10-17 19:34:20.41886976,2019-10-17 19:34:20.41868414,12211797,T,IEX,207.200000,100
2019-10-17 19:35:35.705584128,2019-10-17 19:35:35.705563552,12250778,T,IEX,207.160000,100
2019-10-17 19:41:14.233272064,2019-10-17 19:41:14.233250839,12401431,T,IEX,206.990000,100
2019-10-17 19:44:26.973185024,2019-10-17 19:44:26.973165787,12484778,T,IEX,206.980000,172
2019-10-17 19:45:40.312570112,2019-10-17 19:45:40.312550206,12517735,T,IEX,206.950000,1
2019-10-17 19:45:58.878158080,2019-10-17 19:45:58.878140116,12525526,T,IEX,206.970000,100
2019-10-17 19:48:02.458444032,2019-10-17 19:48:02.458424311,12590595,T,IEX,207.070000,3
2019-10-17 19:48:19.932732928,2019-10-17 19:48:19.932711304,12603141,T,IEX,207.025000,16
2019-10-17 19:48:19.933414912,2019-10-17 19:48:19.933397428,12603142,T,IEX,207.025000,10
2019-10-17 19:48:19.933763072,2019-10-17 19:48:19.933744530,12603143,T,IEX,207.025000,11
2019-10-17 19:48:19.935328000,2019-10-17 19:48:19.935306917,12603144,T,IEX,207.025000,9
2019-10-17 19:48:19.935429888,2019-10-17 19:48:19.935413409,12603146,T,IEX,207.025000,3
2019-10-17 19:48:19.938273024,2019-10-17 19:48:19.938253248,12603147,T,IEX,207.025000,1
2019-10-17 19:48:19.938845952,2019-10-17 19:48:19.938827074,12603148,T,IEX,207.025000,3
2019-10-17 19:48:47.174042880,2019-10-17 19:48:47.174021288,12615451,T,IEX,207.050000,2
2019-10-17 19:49:03.633517056,2019-10-17 19:49:03.633500656,12624731,T,IEX,207.060000,45
2019-10-17 19:49:03.633531904,2019-10-17 19:49:03.633515283,12624732,T,IEX,207.060000,16
2019-10-17 19:49:03.633545984,2019-10-17 19:49:03.633529445,12624733,T,IEX,207.060000,4
2019-10-17 19:49:03.633559040,2019-10-17 19:49:03.633542786,12624734,T,IEX,207.060000,17
2019-10-17 19:49:03.633573120,2019-10-17 19:49:03.633555807,12624735,T,IEX,207.060000,12
2019-10-17 19:49:03.633585920,2019-10-17 19:49:03.633568859,12624736,T,IEX,207.060000,1
2019-10-17 19:49:03.633600000,2019-10-17 19:49:03.633582261,12624737,T,IEX,207.060000,3
2019-10-17 19:49:03.633618944,2019-10-17 19:49:03.633602024,12624738,T,IEX,207.060000,2
2019-10-17 19:49:26.129758976,2019-10-17 19:49:26.129738747,12642024,T,IEX,207.030000,3
2019-10-17 19:50:00.165914880,2019-10-17 19:50:00.165896898,12672211,T,IEX,206.975000,100
2019-10-17 19:50:08.822393088,2019-10-17 19:50:08.822374082,12694188,T,IEX,206.900000,25
2019-10-17 19:50:08.822867968,2019-10-17 19:50:08.822850761,12694208,T,IEX,206.900000,29
2019-10-17 19:50:11.434587904,2019-10-17 19:50:11.434570622,12698970,T,IEX,206.930000,100
2019-10-17 19:50:11.434604032,2019-10-17 19:50:11.434586376,12698971,T,IEX,206.930000,100
2019-10-17 19:50:11.434718976,2019-10-17 19:50:11.434699795,12698972,T,IEX,206.950000,100
2019-10-17 19:50:12.804225024,2019-10-17 19:50:12.804207003,12701760,T,IEX,206.915000,200
2019-10-17 19:50:25.137673984,2019-10-17 19:50:25.137651611,12710513,T,IEX,206.860000,100
2019-10-17 19:51:05.616322048,2019-10-17 19:51:05.616303259,12742648,T,IEX,206.960000,100
2019-10-17 19:51:25.14509056,2019-10-17 19:51:25.14490781,12757340,T,IEX,206.940000,100
2019-10-17 19:51:33.930105088,2019-10-17 19:51:33.930085034,12762628,T,IEX,206.965000,130
2019-10-17 19:52:19.277123072,2019-10-17 19:52:19.277102934,12787645,T,IEX,206.920000,150
2019-10-17 19:52:42.856893952,2019-10-17 19:52:42.856871788,12800902,T,IEX,206.865000,50
2019-10-17 19:52:48.854342912,2019-10-17 19:52:48.854323523,12804296,T,IEX,206.810000,50
2019-10-17 19:52:48.995045888,2019-10-17 19:52:48.995025240,12804428,T,IEX,206.800000,50
2019-10-17 19:52:49.683968000,2019-10-17 19:52:49.683948206,12804808,T,IEX,206.820000,100
2019-10-17 19:52:49.683983872,2019-10-17 19:52:49.683967456,12804809,T,IEX,206.820000,100
2019-10-17 19:52:51.995141888,2019-10-17 19:52:51.995119787,12806173,T,IEX,206.800000,100
2019-10-17 19:53:22.736724992,2019-10-17 19:53:22.736703687,12826340,T,IEX,206.900000,100
2019-10-17 19:54:22.185882112,2019-10-17 19:54:22.185859451,12870468,T,IEX,206.710000,100
2019-10-17 19:54:24.996804096,2019-10-17 19:54:24.996784947,12872123,T,IEX,206.690000,100
2019-10-17 19:54:24.996819968,2019-10-17 19:54:24.996803505,12872124,T,IEX,206.690000,100
2019-10-17 19:54:27.747208960,2019-10-17 19:54:27.747187168,12875181,T,IEX,206.750000,100
2019-10-17 19:54:33.126857984,2019-10-17 19:54:33.126836408,12879584,T,IEX,206.770000,3
2019-10-17 19:54:36.996329984,2019-10-17 19:54:36.996313017,12882984,T,IEX,206.760000,50
2019-10-17 19:54:37.378694912,2019-10-17 19:54:37.378678144,12883271,T,IEX,206.770000,50
2019-10-17 19:55:36.460836096,2019-10-17 19:55:36.460818082,12955691,T,IEX,206.705000,100
2019-10-17 19:55:44.511336960,2019-10-17 19:55:44.511316928,12963081,T,IEX,206.660000,100
2019-10-17 19:55:48.735806976,2019-10-17 19:55:48.735785416,12966267,T,IEX,206.665000,100
2019-10-17 19:56:07.963325952,2019-10-17 19:56:07.963302828,12986065,T,IEX,206.700000,100
2019-10-17 19:56:07.963836928,2019-10-17 19:56:07.963817595,12986092,T,IEX,206.700000,100
2019-10-17 19:56:08.692508928,2019-10-17 19:56:08.692491806,12987645,T,IEX,206.720000,100
2019-10-17 19:56:37.676758016,2019-10-17 19:56:37.676737662,13012238,T,IEX,206.640000,100
2019-10-17 19:56:37.676894976,2019-10-17 19:56:37.676878788,13012240,T,IEX,206.640000,100
2019-10-17 19:56:48.294106112,2019-10-17 19:56:48.294088671,13022709,T,IEX,206.585000,100
2019-10-17 19:57:17.771641088,2019-10-17 19:57:17.771624341,13050420,T,IEX,206.600000,100
2019-10-17 19:57:17.772613120,2019-10-17 19:57:17.772595424,13050423,T,IEX,206.600000,400
2019-10-17 19:57:18.246785024,2019-10-17 19:57:18.246766716,13050939,T,IEX,206.585000,100
2019-10-17 19:57:31.1176064,2019-10-17 19:57:31.1157088,13063231,T,IEX,206.520000,100
2019-10-17 19:57:38.514918912,2019-10-17 19:57:38.514900583,13070813,T,IEX,206.515000,100
2019-10-17 19:57:59.136887040,2019-10-17 19:57:59.136867045,13090821,T,IEX,206.575000,100
2019-10-17 19:58:00.546341888,2019-10-17 19:58:00.546319110,13093372,T,IEX,206.590000,100
2019-10-17 19:58:00.546354944,2019-10-17 19:58:00.546338189,13093373,T,IEX,206.590000,100
2019-10-17 19:58:02.576624128,2019-10-17 19:58:02.576605979,13096161,T,IEX,206.590000,100
2019-10-17 19:58:14.697056000,2019-10-17 19:58:14.697038134,13111485,T,IEX,206.680000,100
2019-10-17 19:58:19.272128000,2019-10-17 19:58:19.272110288,13117266,T,IEX,206.705000,100
2019-10-17 19:58:24.239516928,2019-10-17 19:58:24.239497187,13124554,T,IEX,206.720000,100
2019-10-17 19:58:24.239582976,2019-10-17 19:58:24.239566101,13124556,T,IEX,206.720000,100
2019-10-17 19:58:24.242240000,2019-10-17 19:58:24.242222861,13124563,T,IEX,206.720000,100
2019-10-17 19:58:25.823949056,2019-10-17 19:58:25.823931976,13126243,T,IEX,206.720000,100
2019-10-17 19:58:25.824219904,2019-10-17 19:58:25.824201647,13126245,T,IEX,206.720000,100
2019-10-17 19:58:25.824292096,2019-10-17 19:58:25.824274684,13126247,T,IEX,206.720000,100
2019-10-17 19:58:25.824616960,2019-10-17 19:58:25.824599924,13126249,T,IEX,206.720000,100
2019-10-17 19:58:25.824741888,2019-10-17 19:58:25.824722252,13126251,T,IEX,206.720000,100
2019-10-17 19:58:26.54932992,2019-10-17 19:58:26.54912922,13126580,T,IEX,206.710000,100
2019-10-17 19:58:30.697426944,2019-10-17 19:58:30.697407840,13133960,T,IEX,206.650000,100
2019-10-17 19:58:32.407248896,2019-10-17 19:58:32.407228799,13135763,T,IEX,206.650000,100
2019-10-17 19:58:36.658251008,2019-10-17 19:58:36.658233623,13140053,T,IEX,206.635000,100
2019-10-17 19:58:36.679222016,2019-10-17 19:58:36.679202061,13140073,T,IEX,206.640000,17
2019-10-17 19:58:37.558371072,2019-10-17 19:58:37.558350225,13140846,T,IEX,206.600000,100
2019-10-17 19:58:39.200649984,2019-10-17 19:58:39.200628261,13142413,T,IEX,206.600000,100
2019-10-17 19:58:44.467045120,2019-10-17 19:58:44.467022567,13148072,T,IEX,206.605000,100
2019-10-17 19:58:52.734178048,2019-10-17 19:58:52.734156457,13157707,T,IEX,206.550000,100
2019-10-17 19:58:55.348839936,2019-10-17 19:58:55.348819118,13161508,T,IEX,206.600000,33
2019-10-17 19:58:55.349588992,2019-10-17 19:58:55.349572010,13161511,T,IEX,206.600000,67
2019-10-17 19:59:02.751450112,2019-10-17 19:59:02.751431111,13172954,T,IEX,206.670000,71
2019-10-17 19:59:08.436009984,2019-10-17 19:59:08.435989402,13180972,T,IEX,206.670000,75
2019-10-17 19:59:12.317571072,2019-10-17 19:59:12.317552537,13186540,T,IEX,206.670000,89
2019-10-17 19:59:24.493377024,2019-10-17 19:59:24.493360835,13205183,T,IEX,206.525000,50
2019-10-17 19:59:27.324601088,2019-10-17 19:59:27.324582550,13209122,T,IEX,206.530000,50
2019-10-17 19:59:27.324659968,2019-10-17 19:59:27.324643270,13209123,T,IEX,206.530000,100
2019-10-17 19:59:27.451951104,2019-10-17 19:59:27.451933217,13209284,T,IEX,206.550000,100
2019-10-17 19:59:30.749221888,2019-10-17 19:59:30.749202983,13218103,T,IEX,206.540000,100
2019-10-17 19:59:32.11963904,2019-10-17 19:59:32.11938181,13225951,T,IEX,206.550000,100
2019-10-17 19:59:34.823200000,2019-10-17 19:59:34.823183214,13240693,T,IEX,206.525000,2
2019-10-17 19:59:37.53532928,2019-10-17 19:59:37.53513265,13254680,T,IEX,206.530000,100
2019-10-17 19:59:37.53554944,2019-10-17 19:59:37.53530154,13254682,T,IEX,206.530000,100
2019-10-17 19:59:37.53565952,2019-10-17 19:59:37.53547107,13254683,T,IEX,206.530000,100
2019-10-17 19:59:37.56236032,2019-10-17 19:59:37.56218544,13254908,T,IEX,206.520000,100
2019-10-17 19:59:43.694405888,2019-10-17 19:59:43.694388375,13297854,T,IEX,206.520000,100
2019-10-17 19:59:49.8976896,2019-10-17 19:59:49.8957184,13338226,T,IEX,206.510000,100
2019-10-17 19:59:50.35404032,2019-10-17 19:59:50.35386787,13347096,T,IEX,206.540000,58
2019-10-17 19:59:52.8976896,2019-10-17 19:59:52.8958586,13359806,T,IEX,206.510000,100
2019-10-17 19:59:53.715932928,2019-10-17 19:59:53.715913037,13365709,T,IEX,206.510000,100
2019-10-17 19:59:54.962608128,2019-10-17 19:59:54.962588351,13372947,T,IEX,206.520000,100
2019-10-17 19:59:54.963489024,2019-10-17 19:59:54.963470301,13373029,T,IEX,206.520000,100
2019-10-17 19:59:54.963514880,2019-10-17 19:59:54.963496215,13373031,T,IEX,206.520000,100
2019-10-17 19:59:57.302711040,2019-10-17 19:59:57.302692095,13389887,T,IEX,206.460000,28
2019-10-17 19:59:58.9028096,2019-10-17 19:59:58.8982748,13396553,T,IEX,206.490000,100
2019-10-17 19:59:58.9114112,2019-10-17 19:59:58.9069789,13396566,T,IEX,206.490000,38
2019-10-17 19:59:58.9624064,2019-10-17 19:59:58.9583162,13396641,T,IEX,206.440000,100
2019-10-17 19:59:58.898003968,2019-10-17 19:59:58.897985672,13403737,T,IEX,206.500000,100
2019-10-17 19:59:58.898665984,2019-10-17 19:59:58.898648722,13403742,T,IEX,206.520000,100
2019-10-17 19:59:58.898679040,2019-10-17 19:59:58.898662432,13403743,T,IEX,206.520000,6
