StrategyName,TradeTime,Symbol,Quantity,Price,ExecutionCost,LiquidityAction,LiquidityCode,RawLiquidity,Account,Trader,MarketCenter,OrderID,ExecID,TransactionType
IchimokuATRCrypto,2022-Jan-01 20:25:00.011000,MSFT,-11,177.850000,0.057022,REMOVED,0,,SIM-1001-101,dlariviere,IEX,366133077872530,,FILL
IchimokuATRCrypto,2022-Jan-01 20:25:00.011000,MSFT,-19,177.840000,0.098489,REMOVED,0,,SIM-1001-101,dlariviere,IEX,366133077872530,,FILL
IchimokuATRCrypto,2022-Jan-01 20:25:00.011000,MSFT,10,170.010000,0.012000,REMOVED,0,,SIM-1001-101,dlariviere,IEX,366133077872531,,FILL
IchimokuATRCrypto,2022-Jan-01 20:25:00.011000,MSFT,20,170.020000,0.024000,REMOVED,0,,SIM-1001-101,dlariviere,IEX,366133077872531,,FILL
IchimokuATRCrypto,2022-Jan-11 16:09:00.011000,MSFT,-30,138.350000,0.128971,REMOVED,0,,SIM-1001-101,dlariviere,IEX,366133077872532,,FILL
IchimokuATRCrypto,2022-Jan-11 16:09:00.011000,MSFT,30,133.820000,0.036000,REMOVED,0,,SIM-1001-101,dlariviere,IEX,366133077872533,,FILL
IchimokuATRCrypto,2022-Jan-11 16:18:00.011000,MSFT,-30,139.310000,0.129616,REMOVED,0,,SIM-1001-101,dlariviere,IEX,366133077872534,,FILL
IchimokuATRCrypto,2022-Jan-11 16:18:00.011000,MSFT,30,133.820000,0.036000,REMOVED,0,,SIM-1001-101,dlariviere,IEX,366133077872535,,FILL
IchimokuATRCrypto,2022-Jan-11 16:18:00.011000,MSFT,-30,139.310000,0.129616,REMOVED,0,,SIM-1001-101,dlariviere,IEX,366133077872536,,FILL
IchimokuATRCrypto,2022-Jan-11 16:18:00.011000,MSFT,30,133.820000,0.036000,REMOVED,0,,SIM-1001-101,dlariviere,IEX,366133077872537,,FILL
IchimokuATRCrypto,2022-Jan-11 16:36:00.011000,MSFT,-30,139.600000,0.129811,REMOVED,0,,SIM-1001-101,dlariviere,IEX,366133077872538,,FILL
IchimokuATRCrypto,2022-Jan-11 16:36:00.011000,MSFT,30,133.820000,0.036000,REMOVED,0,,SIM-1001-101,dlariviere,IEX,366133077872539,,FILL
IchimokuATRCrypto,2022-Jan-13 19:40:00.011000,MSFT,-13,157.630000,0.061502,REMOVED,0,,SIM-1001-101,dlariviere,IEX,366133077872540,,FILL
IchimokuATRCrypto,2022-Jan-13 19:40:00.011000,MSFT,-17,157.620000,0.080422,REMOVED,0,,SIM-1001-101,dlariviere,IEX,366133077872540,,FILL
IchimokuATRCrypto,2022-Jan-13 19:40:00.011000,MSFT,4,147.330000,0.004800,REMOVED,0,,SIM-1001-101,dlariviere,IEX,366133077872541,,FILL
IchimokuATRCrypto,2022-Jan-13 19:40:00.011000,MSFT,26,147.340000,0.031200,REMOVED,0,,SIM-1001-101,dlariviere,IEX,366133077872541,,FILL
IchimokuATRCrypto,2022-Jan-20 15:04:00.011000,MSFT,-14,142.500000,0.061488,REMOVED,0,,SIM-1001-101,dlariviere,IEX,366133077872542,,FILL
IchimokuATRCrypto,2022-Jan-20 15:04:00.011000,MSFT,-16,142.490000,0.070268,REMOVED,0,,SIM-1001-101,dlariviere,IEX,366133077872542,,FILL
IchimokuATRCrypto,2022-Jan-20 15:04:00.011000,MSFT,30,134.740000,0.036000,REMOVED,0,,SIM-1001-101,dlariviere,IEX,366133077872543,,FILL
IchimokuATRCrypto,2022-Jan-20 15:04:00.011000,MSFT,-14,142.500000,0.061488,REMOVED,0,,SIM-1001-101,dlariviere,IEX,366133077872544,,FILL
IchimokuATRCrypto,2022-Jan-20 15:04:00.011000,MSFT,-16,142.490000,0.070268,REMOVED,0,,SIM-1001-101,dlariviere,IEX,366133077872544,,FILL
IchimokuATRCrypto,2022-Jan-20 15:04:00.011000,MSFT,30,134.740000,0.036000,REMOVED,0,,SIM-1001-101,dlariviere,IEX,366133077872545,,FILL
