2019-10-28 14:00:33.885562880,2019-10-28 14:00:33.885544769,1842421,T,IEX,14.335000,100
2019-10-28 14:24:29.61306880,2019-10-28 14:24:29.61286889,2878450,T,IEX,14.570000,20
2019-10-28 14:24:39.148443904,2019-10-28 14:24:39.148424270,2885069,T,IEX,14.570000,27
2019-10-28 14:29:52.120978944,2019-10-28 14:29:52.120961708,3074962,T,IEX,14.630000,100
2019-10-28 14:38:59.252398080,2019-10-28 14:38:59.252383015,3446144,T,IEX,14.670000,15
2019-10-28 14:59:16.957274880,2019-10-28 14:59:16.957259898,4190940,T,IEX,14.730000,62
2019-10-28 15:25:38.396888064,2019-10-28 15:25:38.396866928,5080985,T,IEX,14.800000,112
2019-10-28 15:25:38.396921088,2019-10-28 15:25:38.396904275,5080987,T,IEX,14.800000,75
2019-10-28 15:25:38.396963072,2019-10-28 15:25:38.396946807,5080989,T,IEX,14.800000,75
2019-10-28 15:52:52.936975872,2019-10-28 15:52:52.936959270,5960097,T,IEX,14.790000,75
2019-10-28 15:54:01.902683904,2019-10-28 15:54:01.902667602,6003447,T,IEX,14.825000,100
2019-10-28 16:01:40.926605056,2019-10-28 16:01:40.926584522,6242389,T,IEX,14.810000,75
2019-10-28 16:01:40.926674944,2019-10-28 16:01:40.926658041,6242391,T,IEX,14.810000,25
2019-10-28 16:02:05.394818048,2019-10-28 16:02:05.394800875,6260443,T,IEX,14.820000,100
2019-10-28 16:02:05.394887936,2019-10-28 16:02:05.394869754,6260445,T,IEX,14.820000,100
2019-10-28 16:02:05.394946048,2019-10-28 16:02:05.394927813,6260448,T,IEX,14.820000,100
2019-10-28 16:24:50.115920896,2019-10-28 16:24:50.115902915,6874854,T,IEX,14.920000,100
2019-10-28 16:24:51.764431104,2019-10-28 16:24:51.764414374,6875576,T,IEX,14.930000,100
2019-10-28 16:34:02.938274048,2019-10-28 16:34:02.938254696,7146331,T,IEX,14.980000,112
2019-10-28 16:34:02.954063104,2019-10-28 16:34:02.954046462,7146342,T,IEX,14.980000,75
2019-10-28 16:34:02.954104064,2019-10-28 16:34:02.954086441,7146344,T,IEX,14.980000,80
2019-10-28 16:34:03.13334016,2019-10-28 16:34:03.13313578,7146376,T,IEX,14.985000,53
2019-10-28 16:39:17.695862016,2019-10-28 16:39:17.695842890,7272415,T,IEX,14.970000,100
2019-10-28 17:06:24.786274048,2019-10-28 17:06:24.786253051,7844071,T,IEX,14.890000,112
2019-10-28 17:06:24.786835968,2019-10-28 17:06:24.786818918,7844075,T,IEX,14.890000,100
2019-10-28 17:06:24.786924032,2019-10-28 17:06:24.786907382,7844077,T,IEX,14.890000,138
2019-10-28 17:08:05.516943104,2019-10-28 17:08:05.516925925,7877319,T,IEX,14.910000,100
2019-10-28 17:08:05.517033984,2019-10-28 17:08:05.517015490,7877321,T,IEX,14.910000,75
2019-10-28 17:40:18.520890880,2019-10-28 17:40:18.520873584,8530357,T,IEX,14.930000,13
2019-10-28 17:50:49.594124032,2019-10-28 17:50:49.594103095,8730734,T,IEX,14.950000,100
2019-10-28 18:01:46.120028928,2019-10-28 18:01:46.120012066,9004901,T,IEX,14.990000,100
2019-10-28 18:01:48.259639040,2019-10-28 18:01:48.259622410,9006299,T,IEX,14.990000,41
2019-10-28 19:15:04.418205952,2019-10-28 19:15:04.418188152,10560708,T,IEX,15.000000,101
2019-10-28 19:32:53.97272064,2019-10-28 19:32:53.97250066,10954438,T,IEX,15.040000,34
