2019-10-25 14:11:59.49947904,2019-10-25 14:11:59.49928680,2338116,T,IEX,268.690000,50
2019-10-25 14:13:38.434706944,2019-10-25 14:13:38.434687729,2424408,T,IEX,268.700000,100
2019-10-25 14:20:11.403888128,2019-10-25 14:20:11.403868651,2698456,T,IEX,268.855000,100
2019-10-25 14:32:41.870362880,2019-10-25 14:32:41.870344799,3237247,T,IEX,268.835000,100
2019-10-25 14:48:59.794440960,2019-10-25 14:48:59.794420653,3894147,T,IEX,269.010000,100
2019-10-25 15:05:36.553454080,2019-10-25 15:05:36.553434217,4590467,T,IEX,269.270000,100
2019-10-25 15:11:45.88075008,2019-10-25 15:11:45.88051238,4837057,T,IEX,269.330000,100
2019-10-25 15:20:16.876492032,2019-10-25 15:20:16.876467118,5210201,T,IEX,269.760000,100
2019-10-25 15:44:25.2981888,2019-10-25 15:44:25.2961389,6191410,T,IEX,269.870000,100
2019-10-25 15:57:20.218644992,2019-10-25 15:57:20.218626561,6619938,T,IEX,270.000000,100
2019-10-25 15:57:58.74318080,2019-10-25 15:57:58.74297833,6638602,T,IEX,270.015000,200
2019-10-25 15:58:44.241285888,2019-10-25 15:58:44.241267067,6667024,T,IEX,269.970000,19
2019-10-25 15:59:01.152972032,2019-10-25 15:59:01.152953742,6676000,T,IEX,269.950000,100
2019-10-25 16:01:00.70278912,2019-10-25 16:01:00.70254275,6746503,T,IEX,270.010000,100
2019-10-25 16:03:36.805664000,2019-10-25 16:03:36.805635597,6851287,T,IEX,269.800000,100
2019-10-25 16:08:57.515973120,2019-10-25 16:08:57.515955217,7049074,T,IEX,269.730000,200
2019-10-25 16:11:56.961703936,2019-10-25 16:11:56.961687647,7128711,T,IEX,269.810000,100
2019-10-25 16:41:38.214679040,2019-10-25 16:41:38.214662109,7876690,T,IEX,269.700000,100
2019-10-25 16:41:40.319717120,2019-10-25 16:41:40.319696799,7877847,T,IEX,269.700000,100
2019-10-25 16:56:31.475023872,2019-10-25 16:56:31.474986660,8227443,T,IEX,269.770000,100
2019-10-25 18:05:00.228068096,2019-10-25 18:05:00.228050274,9826045,T,IEX,269.460000,9
2019-10-25 18:19:02.828293888,2019-10-25 18:19:02.828273762,10182018,T,IEX,269.580000,8
2019-10-25 18:34:39.626499072,2019-10-25 18:34:39.626479384,10543374,T,IEX,269.335000,11
2019-10-25 18:56:00.400462080,2019-10-25 18:56:00.400444468,11002393,T,IEX,269.540000,100
2019-10-25 18:56:09.222132992,2019-10-25 18:56:09.222114175,11007713,T,IEX,269.560000,100
2019-10-25 18:56:17.107600896,2019-10-25 18:56:17.107579383,11011999,T,IEX,269.560000,100
2019-10-25 19:06:27.256496896,2019-10-25 19:06:27.256477357,11258662,T,IEX,269.450000,100
2019-10-25 19:06:27.256507904,2019-10-25 19:06:27.256489182,11258663,T,IEX,269.450000,100
2019-10-25 19:06:27.256622080,2019-10-25 19:06:27.256602536,11258675,T,IEX,269.450000,100
2019-10-25 19:14:17.698212096,2019-10-25 19:14:17.698195352,11439238,T,IEX,269.580000,100
2019-10-25 19:19:03.946343936,2019-10-25 19:19:03.946328854,11548766,T,IEX,269.580000,10
2019-10-25 19:25:04.528536064,2019-10-25 19:25:04.528518935,11697756,T,IEX,269.740000,6
2019-10-25 19:30:41.618707968,2019-10-25 19:30:41.618688007,11855450,T,IEX,269.630000,100
2019-10-25 19:30:42.85558016,2019-10-25 19:30:42.85540438,11855788,T,IEX,269.640000,100
2019-10-25 19:44:26.995709952,2019-10-25 19:44:26.995689803,12261497,T,IEX,269.690000,18
2019-10-25 19:58:41.186317056,2019-10-25 19:58:41.186296438,12977687,T,IEX,269.610000,100
2019-10-25 19:59:31.643387904,2019-10-25 19:59:31.643369764,13056636,T,IEX,269.590000,100
2019-10-25 19:59:32.817999104,2019-10-25 19:59:32.817967658,13064250,T,IEX,269.570000,100
2019-10-25 19:59:46.188849920,2019-10-25 19:59:46.188831534,13140918,T,IEX,269.550000,100
2019-10-25 19:59:53.5647872,2019-10-25 19:59:53.5628890,13178294,T,IEX,269.530000,100
2019-10-25 19:59:54.27282944,2019-10-25 19:59:54.27263412,13183394,T,IEX,269.490000,100
2019-10-25 19:59:54.32451072,2019-10-25 19:59:54.32433235,13183826,T,IEX,269.480000,100
2019-10-25 19:59:54.40201984,2019-10-25 19:59:54.40166039,13184330,T,IEX,269.470000,100
2019-10-25 19:59:54.40239104,2019-10-25 19:59:54.40192825,13184334,T,IEX,269.470000,100
2019-10-25 19:59:55.120647936,2019-10-25 19:59:55.120629580,13196156,T,IEX,269.430000,100
2019-10-25 19:59:55.120667904,2019-10-25 19:59:55.120651082,13196157,T,IEX,269.430000,100
2019-10-25 19:59:55.152864000,2019-10-25 19:59:55.152840593,13197100,T,IEX,269.450000,100
2019-10-25 19:59:57.172249088,2019-10-25 19:59:57.172230360,13210007,T,IEX,269.420000,100
2019-10-25 19:59:57.172264960,2019-10-25 19:59:57.172242892,13210009,T,IEX,269.420000,100
2019-10-25 19:59:58.120212992,2019-10-25 19:59:58.120197521,13217519,T,IEX,269.420000,100
2019-10-25 19:59:59.239001088,2019-10-25 19:59:59.238980804,13225501,T,IEX,269.400000,100
2019-10-25 19:59:59.373772032,2019-10-25 19:59:59.373754043,13228011,T,IEX,269.410000,100
