2019-10-04 13:31:09.197492992,2019-10-04 13:31:09.197470519,243994,T,IEX,293.170000,87
2019-10-04 13:51:39.628290048,2019-10-04 13:51:39.628273356,1844483,T,IEX,293.290000,100
2019-10-04 13:51:39.630814976,2019-10-04 13:51:39.630797573,1844485,T,IEX,293.290000,200
2019-10-04 13:51:39.630840064,2019-10-04 13:51:39.630823457,1844486,T,IEX,293.290000,100
2019-10-04 13:51:39.633115904,2019-10-04 13:51:39.633097711,1844487,T,IEX,293.290000,300
2019-10-04 13:51:39.635096064,2019-10-04 13:51:39.635075854,1844488,T,IEX,293.290000,100
2019-10-04 13:51:39.647191040,2019-10-04 13:51:39.647170815,1844492,T,IEX,293.290000,100
2019-10-04 13:52:37.638818048,2019-10-04 13:52:37.638800074,1915519,T,IEX,293.360000,100
2019-10-04 13:55:24.812193024,2019-10-04 13:55:24.812159520,2121608,T,IEX,293.590000,100
2019-10-04 13:57:20.798034944,2019-10-04 13:57:20.798009861,2275506,T,IEX,293.550000,100
2019-10-04 13:58:23.669906944,2019-10-04 13:58:23.669877681,2357905,T,IEX,293.710000,100
2019-10-04 13:59:24.626481920,2019-10-04 13:59:24.626458167,2438451,T,IEX,293.890000,100
2019-10-04 14:00:07.299087872,2019-10-04 14:00:07.299069311,2479556,T,IEX,293.840000,20
2019-10-04 14:06:50.244122112,2019-10-04 14:06:50.244103134,2938408,T,IEX,294.080000,100
2019-10-04 14:16:17.187117056,2019-10-04 14:16:17.187091512,3509863,T,IEX,294.060000,100
2019-10-04 14:28:52.617501952,2019-10-04 14:28:52.617481226,4266342,T,IEX,293.820000,100
2019-10-04 14:29:08.161501952,2019-10-04 14:29:08.161482517,4284730,T,IEX,293.695000,100
2019-10-04 14:33:00.205495040,2019-10-04 14:33:00.205472674,4567464,T,IEX,293.490000,100
2019-10-04 14:33:53.350209024,2019-10-04 14:33:53.350187020,4624288,T,IEX,293.440000,746
2019-10-04 14:34:55.871300096,2019-10-04 14:34:55.871278402,4680411,T,IEX,293.450000,100
2019-10-04 14:36:06.860634880,2019-10-04 14:36:06.860614916,4771459,T,IEX,293.365000,500
2019-10-04 14:36:07.609388032,2019-10-04 14:36:07.609371389,4772437,T,IEX,293.385000,400
2019-10-04 14:36:11.241378048,2019-10-04 14:36:11.241358359,4775456,T,IEX,293.375000,500
2019-10-04 14:38:25.157716992,2019-10-04 14:38:25.157698005,4910566,T,IEX,293.340000,100
2019-10-04 14:39:58.696954112,2019-10-04 14:39:58.696933909,4993610,T,IEX,293.290000,200
2019-10-04 14:40:00.94692096,2019-10-04 14:40:00.94674153,4995436,T,IEX,293.265000,100
2019-10-04 14:40:12.191856896,2019-10-04 14:40:12.191837265,5010410,T,IEX,293.315000,100
2019-10-04 14:40:15.20732928,2019-10-04 14:40:15.20712392,5013244,T,IEX,293.335000,100
2019-10-04 15:19:47.928299008,2019-10-04 15:19:47.928277540,7209703,T,IEX,294.030000,100
2019-10-04 15:34:34.356076032,2019-10-04 15:34:34.356054383,7881415,T,IEX,294.360000,100
2019-10-04 15:34:42.938365952,2019-10-04 15:34:42.938345792,7886341,T,IEX,294.380000,500
2019-10-04 15:50:29.907259904,2019-10-04 15:50:29.907240857,8438072,T,IEX,294.650000,400
2019-10-04 15:50:29.907353088,2019-10-04 15:50:29.907327072,8438080,T,IEX,294.640000,300
2019-10-04 15:50:38.719414016,2019-10-04 15:50:38.719393839,8449253,T,IEX,294.705000,500
2019-10-04 15:58:24.897580032,2019-10-04 15:58:24.897555412,8693481,T,IEX,294.570000,100
2019-10-04 16:00:15.503881984,2019-10-04 16:00:15.503862458,8752342,T,IEX,294.550000,100
2019-10-04 16:09:26.351500032,2019-10-04 16:09:26.351480870,9007254,T,IEX,294.640000,300
2019-10-04 16:11:01.297566976,2019-10-04 16:11:01.297546568,9041750,T,IEX,294.660000,100
2019-10-04 16:27:03.898761984,2019-10-04 16:27:03.898743760,9499421,T,IEX,294.640000,300
2019-10-04 16:51:49.162789120,2019-10-04 16:51:49.162765313,10087230,T,IEX,294.620000,119
2019-10-04 16:51:49.163748096,2019-10-04 16:51:49.163728369,10087231,T,IEX,294.620000,100
2019-10-04 16:52:19.310106112,2019-10-04 16:52:19.310088894,10101906,T,IEX,294.570000,100
2019-10-04 16:52:26.944460032,2019-10-04 16:52:26.944443073,10106231,T,IEX,294.550000,100
2019-10-04 16:57:06.972817920,2019-10-04 16:57:06.972796227,10216526,T,IEX,294.490000,100
2019-10-04 16:57:08.929850880,2019-10-04 16:57:08.929828540,10217680,T,IEX,294.490000,100
2019-10-04 16:57:10.943831040,2019-10-04 16:57:10.943809750,10218494,T,IEX,294.490000,100
2019-10-04 16:59:31.20816896,2019-10-04 16:59:31.20796008,10275884,T,IEX,294.605000,100
2019-10-04 16:59:32.900952064,2019-10-04 16:59:32.900930673,10276872,T,IEX,294.610000,25
2019-10-04 17:08:30.316892928,2019-10-04 17:08:30.316871564,10473976,T,IEX,294.480000,100
2019-10-04 17:10:08.665171968,2019-10-04 17:10:08.665148609,10523010,T,IEX,294.460000,200
2019-10-04 17:13:39.331246080,2019-10-04 17:13:39.331006365,10596119,T,IEX,294.545000,100
2019-10-04 17:13:41.335013888,2019-10-04 17:13:41.334996502,10596581,T,IEX,294.550000,100
2019-10-04 17:16:30.253649920,2019-10-04 17:16:30.253629016,10661529,T,IEX,294.520000,100
2019-10-04 17:17:55.221421056,2019-10-04 17:17:55.221401555,10691404,T,IEX,294.515000,100
2019-10-04 17:21:21.212453888,2019-10-04 17:21:21.212433760,10763019,T,IEX,294.560000,200
2019-10-04 17:26:00.546482944,2019-10-04 17:26:00.546460203,10857348,T,IEX,294.500000,100
2019-10-04 17:26:00.548790016,2019-10-04 17:26:00.548770564,10857350,T,IEX,294.500000,100
2019-10-04 17:27:51.791886080,2019-10-04 17:27:51.791865585,10893559,T,IEX,294.555000,100
2019-10-04 17:27:53.807872000,2019-10-04 17:27:53.807849801,10893996,T,IEX,294.555000,100
2019-10-04 17:27:55.806629888,2019-10-04 17:27:55.806611760,10894462,T,IEX,294.555000,100
2019-10-04 17:27:55.808783872,2019-10-04 17:27:55.808765008,10894465,T,IEX,294.555000,100
2019-10-04 17:29:58.219777024,2019-10-04 17:29:58.219755654,10937775,T,IEX,294.625000,7
2019-10-04 17:29:59.444715008,2019-10-04 17:29:59.444692423,10938484,T,IEX,294.655000,100
2019-10-04 17:31:58.839606016,2019-10-04 17:31:58.839588843,10984488,T,IEX,294.645000,100
2019-10-04 17:31:58.842279936,2019-10-04 17:31:58.842259420,10984492,T,IEX,294.640000,100
2019-10-04 17:31:58.844478976,2019-10-04 17:31:58.844458386,10984495,T,IEX,294.640000,100
2019-10-04 17:33:39.621556992,2019-10-04 17:33:39.621535990,11025933,T,IEX,294.650000,100
2019-10-04 17:34:24.778323968,2019-10-04 17:34:24.778308064,11041886,T,IEX,294.670000,100
2019-10-04 17:35:37.455255040,2019-10-04 17:35:37.455233824,11066481,T,IEX,294.680000,170
2019-10-04 17:35:46.920779008,2019-10-04 17:35:46.920758472,11069861,T,IEX,294.670000,100
2019-10-04 17:35:46.943347968,2019-10-04 17:35:46.943330533,11069868,T,IEX,294.665000,100
2019-10-04 17:35:54.676602112,2019-10-04 17:35:54.676581054,11072056,T,IEX,294.680000,100
2019-10-04 17:37:02.707629056,2019-10-04 17:37:02.707607715,11092800,T,IEX,294.680000,100
2019-10-04 17:37:02.710171904,2019-10-04 17:37:02.710151500,11092801,T,IEX,294.680000,100
2019-10-04 17:42:46.342872064,2019-10-04 17:42:46.342853080,11215788,T,IEX,294.920000,400
2019-10-04 17:42:48.990209024,2019-10-04 17:42:48.990190235,11230488,T,IEX,294.920000,100
2019-10-04 17:42:49.9852928,2019-10-04 17:42:49.9832997,11230767,T,IEX,294.920000,100
2019-10-04 17:42:54.648582912,2019-10-04 17:42:54.648562916,11239139,T,IEX,294.900000,100
2019-10-04 17:42:58.359575040,2019-10-04 17:42:58.359555313,11242557,T,IEX,294.900000,100
2019-10-04 17:42:58.765615104,2019-10-04 17:42:58.765590509,11243254,T,IEX,294.880000,100
2019-10-04 17:42:58.765733120,2019-10-04 17:42:58.765696288,11243268,T,IEX,294.880000,300
2019-10-04 17:42:59.927888896,2019-10-04 17:42:59.927866930,11245836,T,IEX,294.870000,400
2019-10-04 17:51:46.557934080,2019-10-04 17:51:46.557916095,11448946,T,IEX,294.700000,100
2019-10-04 17:55:54.161970944,2019-10-04 17:55:54.161950116,11549266,T,IEX,294.705000,100
2019-10-04 17:56:24.336366080,2019-10-04 17:56:24.336347282,11559766,T,IEX,294.740000,100
2019-10-04 18:10:26.765240064,2019-10-04 18:10:26.765218580,11952763,T,IEX,294.895000,100
2019-10-04 18:10:42.698409984,2019-10-04 18:10:42.698391456,11959761,T,IEX,294.855000,300
2019-10-04 18:20:44.271702016,2019-10-04 18:20:44.271670226,12227363,T,IEX,295.070000,100
2019-10-04 18:30:38.74178048,2019-10-04 18:30:38.74156100,12473733,T,IEX,295.150000,91
2019-10-04 18:30:38.741408000,2019-10-04 18:30:38.741385998,12473920,T,IEX,295.150000,100
2019-10-04 18:30:40.812915968,2019-10-04 18:30:40.812897895,12474418,T,IEX,295.150000,100
2019-10-04 18:30:41.319884032,2019-10-04 18:30:41.319864027,12474563,T,IEX,295.150000,180
2019-10-04 18:38:44.283497984,2019-10-04 18:38:44.283477092,12669185,T,IEX,295.300000,100
2019-10-04 18:38:44.667539968,2019-10-04 18:38:44.667518891,12669309,T,IEX,295.300000,131
2019-10-04 18:40:14.270419968,2019-10-04 18:40:14.270399047,12702107,T,IEX,295.315000,400
2019-10-04 18:40:14.293857024,2019-10-04 18:40:14.293837528,12702116,T,IEX,295.315000,400
2019-10-04 18:40:24.690328064,2019-10-04 18:40:24.690308605,12705975,T,IEX,295.315000,400
2019-10-04 18:40:53.502786048,2019-10-04 18:40:53.502766633,12714443,T,IEX,295.325000,100
2019-10-04 18:40:56.25193984,2019-10-04 18:40:56.25173713,12715179,T,IEX,295.325000,365
2019-10-04 18:41:53.639619072,2019-10-04 18:41:53.639598395,12730614,T,IEX,295.340000,100
2019-10-04 18:41:53.642796032,2019-10-04 18:41:53.642775888,12730615,T,IEX,295.340000,100
2019-10-04 18:41:57.146522112,2019-10-04 18:41:57.146506695,12731416,T,IEX,295.340000,100
2019-10-04 18:43:19.671078912,2019-10-04 18:43:19.671057909,12757611,T,IEX,295.320000,100
2019-10-04 18:43:19.673598976,2019-10-04 18:43:19.673578299,12757612,T,IEX,295.320000,100
2019-10-04 18:43:19.675911936,2019-10-04 18:43:19.675892300,12757613,T,IEX,295.320000,100
2019-10-04 18:49:58.201050880,2019-10-04 18:49:58.201031344,12900577,T,IEX,295.250000,100
2019-10-04 18:55:47.944593920,2019-10-04 18:55:47.944576391,13035564,T,IEX,295.190000,400
2019-10-04 18:55:47.967802880,2019-10-04 18:55:47.967783700,13035578,T,IEX,295.190000,400
2019-10-04 18:56:52.132365056,2019-10-04 18:56:52.132348214,13056958,T,IEX,295.220000,100
2019-10-04 18:59:07.813281024,2019-10-04 18:59:07.813264726,13110637,T,IEX,295.190000,100
2019-10-04 19:47:48.842163968,2019-10-04 19:47:48.842141499,14481686,T,IEX,295.900000,8
2019-10-04 19:48:28.630379008,2019-10-04 19:48:28.630354843,14508426,T,IEX,295.940000,100
2019-10-04 19:48:28.630423040,2019-10-04 19:48:28.630387984,14508431,T,IEX,295.940000,100
2019-10-04 19:48:37.660433920,2019-10-04 19:48:37.660409389,14517688,T,IEX,295.970000,300
2019-10-04 19:49:00.257732096,2019-10-04 19:49:00.257712340,14536691,T,IEX,295.965000,100
2019-10-04 19:49:15.192548096,2019-10-04 19:49:15.192526881,14545376,T,IEX,295.985000,296
2019-10-04 19:49:21.122733056,2019-10-04 19:49:21.122712737,14549520,T,IEX,296.035000,100
2019-10-04 19:49:27.512709888,2019-10-04 19:49:27.512692734,14553054,T,IEX,296.050000,4
2019-10-04 19:55:12.80722944,2019-10-04 19:55:12.80703736,14869377,T,IEX,296.050000,100
2019-10-04 19:57:15.584529920,2019-10-04 19:57:15.584510131,15014687,T,IEX,296.050000,100
2019-10-04 19:57:27.792314880,2019-10-04 19:57:27.792296053,15028793,T,IEX,296.090000,100
