2019-10-08 13:32:29.176499968,2019-10-08 13:32:29.176474863,296269,T,IEX,44.790000,100
2019-10-08 13:32:29.176540928,2019-10-08 13:32:29.176522228,296270,T,IEX,44.790000,100
2019-10-08 13:32:29.176583936,2019-10-08 13:32:29.176566030,296271,T,IEX,44.790000,100
2019-10-08 13:33:03.225358080,2019-10-08 13:33:03.225331693,330861,T,IEX,44.750000,100
2019-10-08 13:33:04.956989952,2019-10-08 13:33:04.956964485,333784,T,IEX,44.730000,100
2019-10-08 13:33:04.967926016,2019-10-08 13:33:04.967905571,333796,T,IEX,44.750000,400
2019-10-08 13:33:16.688455936,2019-10-08 13:33:16.688436145,351563,T,IEX,44.780000,100
2019-10-08 13:35:04.753669888,2019-10-08 13:35:04.753649345,484855,T,IEX,44.740000,400
2019-10-08 13:35:07.914496000,2019-10-08 13:35:07.914480355,488563,T,IEX,44.700000,100
2019-10-08 13:35:07.914550016,2019-10-08 13:35:07.914534719,488564,T,IEX,44.700000,300
2019-10-08 13:35:23.417497088,2019-10-08 13:35:23.417481605,507818,T,IEX,44.750000,100
2019-10-08 13:37:14.527947008,2019-10-08 13:37:14.527926552,634782,T,IEX,44.800000,100
2019-10-08 13:39:03.128367104,2019-10-08 13:39:03.128350799,750824,T,IEX,44.830000,100
2019-10-08 13:39:03.128412928,2019-10-08 13:39:03.128398234,750825,T,IEX,44.830000,100
2019-10-08 13:39:04.70877952,2019-10-08 13:39:04.70859197,751943,T,IEX,44.830000,200
2019-10-08 13:39:27.71376896,2019-10-08 13:39:27.71360470,774608,T,IEX,44.800000,600
2019-10-08 13:39:27.96035072,2019-10-08 13:39:27.96017938,774637,T,IEX,44.820000,100
2019-10-08 13:39:45.817782016,2019-10-08 13:39:45.817764654,798963,T,IEX,44.885000,100
2019-10-08 13:40:24.909814016,2019-10-08 13:40:24.909797456,845720,T,IEX,44.910000,100
2019-10-08 13:42:11.743458048,2019-10-08 13:42:11.743443090,964023,T,IEX,44.940000,100
2019-10-08 13:42:11.770733056,2019-10-08 13:42:11.770716616,964047,T,IEX,44.940000,100
2019-10-08 13:42:16.390392064,2019-10-08 13:42:16.390374348,969741,T,IEX,44.890000,78
2019-10-08 13:42:16.390415104,2019-10-08 13:42:16.390400128,969742,T,IEX,44.890000,22
2019-10-08 13:42:18.52743936,2019-10-08 13:42:18.52723318,971630,T,IEX,44.880000,78
2019-10-08 13:42:18.52764928,2019-10-08 13:42:18.52749694,971631,T,IEX,44.880000,22
2019-10-08 13:42:43.113701120,2019-10-08 13:42:43.113680042,994277,T,IEX,44.810000,48
2019-10-08 13:42:43.113761024,2019-10-08 13:42:43.113747330,994279,T,IEX,44.810000,37
2019-10-08 13:42:43.113809920,2019-10-08 13:42:43.113794416,994280,T,IEX,44.810000,15
2019-10-08 13:42:43.113829888,2019-10-08 13:42:43.113815768,994281,T,IEX,44.810000,37
2019-10-08 13:42:43.113893888,2019-10-08 13:42:43.113879425,994282,T,IEX,44.810000,50
2019-10-08 13:42:43.113986048,2019-10-08 13:42:43.113969986,994284,T,IEX,44.810000,13
2019-10-08 13:42:47.348186112,2019-10-08 13:42:47.348168370,997813,T,IEX,44.900000,100
2019-10-08 13:42:49.793891072,2019-10-08 13:42:49.793873590,1000801,T,IEX,44.925000,100
2019-10-08 13:44:09.94923008,2019-10-08 13:44:09.94901479,1072896,T,IEX,45.000000,100
2019-10-08 13:44:10.541835008,2019-10-08 13:44:10.541816317,1074221,T,IEX,44.950000,100
2019-10-08 13:45:37.383051008,2019-10-08 13:45:37.383030915,1165563,T,IEX,45.025000,100
2019-10-08 13:49:07.119311872,2019-10-08 13:49:07.119296231,1372822,T,IEX,44.720000,100
2019-10-08 13:49:07.119369984,2019-10-08 13:49:07.119352913,1372824,T,IEX,44.720000,100
2019-10-08 13:49:07.119488000,2019-10-08 13:49:07.119471370,1372825,T,IEX,44.720000,100
2019-10-08 13:49:38.335963904,2019-10-08 13:49:38.335945093,1404060,T,IEX,44.700000,100
2019-10-08 13:49:38.335988992,2019-10-08 13:49:38.335971446,1404061,T,IEX,44.700000,200
2019-10-08 13:49:41.471060992,2019-10-08 13:49:41.471039587,1407396,T,IEX,44.700000,300
2019-10-08 13:49:41.472794880,2019-10-08 13:49:41.472778195,1407397,T,IEX,44.700000,2000
2019-10-08 13:49:46.157523968,2019-10-08 13:49:46.157508876,1411651,T,IEX,44.700000,300
2019-10-08 13:49:46.159318016,2019-10-08 13:49:46.159298515,1411654,T,IEX,44.700000,1700
2019-10-08 13:49:49.704965120,2019-10-08 13:49:49.704947199,1414327,T,IEX,44.680000,16
2019-10-08 13:49:49.714290944,2019-10-08 13:49:49.714274923,1414334,T,IEX,44.690000,100
2019-10-08 13:49:49.716069888,2019-10-08 13:49:49.716051937,1414335,T,IEX,44.700000,1800
2019-10-08 13:50:30.417312000,2019-10-08 13:50:30.417292591,1464949,T,IEX,44.700000,300
2019-10-08 13:50:30.419214080,2019-10-08 13:50:30.419197247,1464950,T,IEX,44.700000,1900
2019-10-08 13:50:35.645403904,2019-10-08 13:50:35.645384892,1474882,T,IEX,44.700000,300
2019-10-08 13:50:35.647105024,2019-10-08 13:50:35.647088502,1474892,T,IEX,44.700000,1700
2019-10-08 13:50:35.647122944,2019-10-08 13:50:35.647106560,1474893,T,IEX,44.700000,100
2019-10-08 13:50:39.934948096,2019-10-08 13:50:39.934928492,1481728,T,IEX,44.710000,300
2019-10-08 13:50:39.936855040,2019-10-08 13:50:39.936838145,1481731,T,IEX,44.710000,1400
2019-10-08 13:50:56.556312064,2019-10-08 13:50:56.556294995,1501566,T,IEX,44.740000,300
2019-10-08 13:50:56.566056960,2019-10-08 13:50:56.566035951,1501583,T,IEX,44.750000,1100
2019-10-08 13:51:46.578008064,2019-10-08 13:51:46.577988901,1556407,T,IEX,44.730000,300
2019-10-08 13:51:46.579826944,2019-10-08 13:51:46.579807822,1556408,T,IEX,44.730000,1100
2019-10-08 13:51:46.593315072,2019-10-08 13:51:46.593296570,1556415,T,IEX,44.750000,200
2019-10-08 13:51:46.634179072,2019-10-08 13:51:46.634157064,1556423,T,IEX,44.750000,100
2019-10-08 13:52:16.210718976,2019-10-08 13:52:16.210698714,1595199,T,IEX,44.720000,300
2019-10-08 13:52:16.214839040,2019-10-08 13:52:16.214818851,1595200,T,IEX,44.720000,900
2019-10-08 13:52:21.565757952,2019-10-08 13:52:21.565738604,1600284,T,IEX,44.720000,300
2019-10-08 13:52:21.569182976,2019-10-08 13:52:21.569165613,1600285,T,IEX,44.720000,700
2019-10-08 13:52:26.476185088,2019-10-08 13:52:26.476167361,1606249,T,IEX,44.730000,300
2019-10-08 13:52:26.478033920,2019-10-08 13:52:26.478017699,1606251,T,IEX,44.730000,600
2019-10-08 13:53:11.439476992,2019-10-08 13:53:11.439458449,1653331,T,IEX,44.710000,300
2019-10-08 13:53:11.449505024,2019-10-08 13:53:11.449488063,1653337,T,IEX,44.710000,500
2019-10-08 13:53:11.454094080,2019-10-08 13:53:11.454077415,1653343,T,IEX,44.730000,1
2019-10-08 13:53:21.793403904,2019-10-08 13:53:21.793383960,1666130,T,IEX,44.720000,1
2019-10-08 13:53:21.793421056,2019-10-08 13:53:21.793404210,1666131,T,IEX,44.720000,299
2019-10-08 13:53:21.795640064,2019-10-08 13:53:21.795621872,1666132,T,IEX,44.720000,501
2019-10-08 13:54:40.581285888,2019-10-08 13:54:40.581267694,1747371,T,IEX,44.740000,400
2019-10-08 13:54:40.583052032,2019-10-08 13:54:40.583034243,1747373,T,IEX,44.740000,300
2019-10-08 13:54:40.583067904,2019-10-08 13:54:40.583052256,1747374,T,IEX,44.740000,200
2019-10-08 13:54:44.727010048,2019-10-08 13:54:44.726993519,1751479,T,IEX,44.740000,200
2019-10-08 13:54:44.727024896,2019-10-08 13:54:44.727009438,1751480,T,IEX,44.740000,100
2019-10-08 13:54:44.729057024,2019-10-08 13:54:44.729041778,1751482,T,IEX,44.740000,500
2019-10-08 13:55:10.944386048,2019-10-08 13:55:10.944365039,1784532,T,IEX,44.720000,350
2019-10-08 13:55:10.984370944,2019-10-08 13:55:10.984355727,1784597,T,IEX,44.720000,250
2019-10-08 13:55:10.984385024,2019-10-08 13:55:10.984370483,1784598,T,IEX,44.720000,200
2019-10-08 13:55:10.984404992,2019-10-08 13:55:10.984389463,1784599,T,IEX,44.720000,100
2019-10-08 13:55:29.484723968,2019-10-08 13:55:29.484701987,1805359,T,IEX,44.740000,100
2019-10-08 13:56:15.841393920,2019-10-08 13:56:15.841376584,1858803,T,IEX,44.750000,1
2019-10-08 13:56:23.348165120,2019-10-08 13:56:23.348147735,1867778,T,IEX,44.740000,100
2019-10-08 13:59:30.625559040,2019-10-08 13:59:30.625540163,2071705,T,IEX,44.600000,100
2019-10-08 13:59:37.625842944,2019-10-08 13:59:37.625826807,2077866,T,IEX,44.580000,100
2019-10-08 13:59:37.641008128,2019-10-08 13:59:37.640985031,2077889,T,IEX,44.565000,300
2019-10-08 13:59:46.25229056,2019-10-08 13:59:46.25209117,2084520,T,IEX,44.560000,100
2019-10-08 13:59:46.142106112,2019-10-08 13:59:46.142089135,2085277,T,IEX,44.565000,1
2019-10-08 14:00:18.108583936,2019-10-08 14:00:18.108569407,2123297,T,IEX,44.595000,200
2019-10-08 14:00:57.903821056,2019-10-08 14:00:57.903801832,2174873,T,IEX,44.700000,19
2019-10-08 14:00:57.903837952,2019-10-08 14:00:57.903821923,2174874,T,IEX,44.700000,100
2019-10-08 14:01:56.392869120,2019-10-08 14:01:56.392850720,2257912,T,IEX,44.660000,100
2019-10-08 14:01:59.359123968,2019-10-08 14:01:59.359105499,2262329,T,IEX,44.635000,100
2019-10-08 14:02:00.690899968,2019-10-08 14:02:00.690881501,2263989,T,IEX,44.600000,100
2019-10-08 14:02:24.726480896,2019-10-08 14:02:24.726464227,2296098,T,IEX,44.560000,100
2019-10-08 14:03:22.901975040,2019-10-08 14:03:22.901955871,2372249,T,IEX,44.550000,100
2019-10-08 14:03:22.903264000,2019-10-08 14:03:22.903244387,2372316,T,IEX,44.550000,100
2019-10-08 14:03:22.903355904,2019-10-08 14:03:22.903329631,2372325,T,IEX,44.550000,100
2019-10-08 14:04:58.452922880,2019-10-08 14:04:58.452905155,2495662,T,IEX,44.530000,100
2019-10-08 14:05:50.377792000,2019-10-08 14:05:50.377773399,2565106,T,IEX,44.590000,6
2019-10-08 14:06:22.639096064,2019-10-08 14:06:22.639076139,2599638,T,IEX,44.550000,100
2019-10-08 14:06:30.226140928,2019-10-08 14:06:30.226120205,2607527,T,IEX,44.570000,100
2019-10-08 14:09:18.321858048,2019-10-08 14:09:18.321840774,2813784,T,IEX,44.600000,200
2019-10-08 14:09:42.887616000,2019-10-08 14:09:42.887598934,2845134,T,IEX,44.650000,35
2019-10-08 14:10:47.46739968,2019-10-08 14:10:47.46721085,2947727,T,IEX,44.790000,37
2019-10-08 14:10:54.938767104,2019-10-08 14:10:54.938748726,2957313,T,IEX,44.790000,100
2019-10-08 14:10:54.938928128,2019-10-08 14:10:54.938909436,2957321,T,IEX,44.790000,63
2019-10-08 14:12:34.495642880,2019-10-08 14:12:34.495624808,3086284,T,IEX,44.780000,75
2019-10-08 14:14:16.469696000,2019-10-08 14:14:16.469680672,3199626,T,IEX,44.785000,39
2019-10-08 14:15:04.496610048,2019-10-08 14:15:04.496592360,3252241,T,IEX,44.770000,200
2019-10-08 14:17:18.36542976,2019-10-08 14:17:18.36522808,3381997,T,IEX,44.640000,100
2019-10-08 14:17:18.37383936,2019-10-08 14:17:18.37366385,3381998,T,IEX,44.670000,100
2019-10-08 14:17:18.37470976,2019-10-08 14:17:18.37452123,3382000,T,IEX,44.670000,100
2019-10-08 14:17:46.688001024,2019-10-08 14:17:46.687984908,3407467,T,IEX,44.720000,100
2019-10-08 14:19:46.342155008,2019-10-08 14:19:46.342139746,3528361,T,IEX,44.710000,1
2019-10-08 14:20:14.871571968,2019-10-08 14:20:14.871556062,3557697,T,IEX,44.670000,100
2019-10-08 14:20:14.871596032,2019-10-08 14:20:14.871577352,3557698,T,IEX,44.670000,7
2019-10-08 14:23:37.452793088,2019-10-08 14:23:37.452772808,3728783,T,IEX,44.705000,100
2019-10-08 14:24:09.29911040,2019-10-08 14:24:09.29892549,3758241,T,IEX,44.690000,100
2019-10-08 14:24:32.697804032,2019-10-08 14:24:32.697785889,3779124,T,IEX,44.720000,1
2019-10-08 14:24:55.470146048,2019-10-08 14:24:55.470127714,3799207,T,IEX,44.740000,100
2019-10-08 14:25:27.722372096,2019-10-08 14:25:27.722353456,3832957,T,IEX,44.685000,200
2019-10-08 14:28:23.744990976,2019-10-08 14:28:23.744967685,3978153,T,IEX,44.690000,100
2019-10-08 14:28:23.744996096,2019-10-08 14:28:23.744978461,3978154,T,IEX,44.690000,100
2019-10-08 14:28:29.405460992,2019-10-08 14:28:29.405441945,3981553,T,IEX,44.690000,75
2019-10-08 14:28:29.405505024,2019-10-08 14:28:29.405483860,3981556,T,IEX,44.690000,75
2019-10-08 14:28:29.405580032,2019-10-08 14:28:29.405562340,3981560,T,IEX,44.690000,75
2019-10-08 14:28:29.405634048,2019-10-08 14:28:29.405616308,3981563,T,IEX,44.690000,16
2019-10-08 14:28:50.75267072,2019-10-08 14:28:50.75247963,3998178,T,IEX,44.650000,100
2019-10-08 14:29:15.393007104,2019-10-08 14:29:15.392988187,4021067,T,IEX,44.610000,100
2019-10-08 14:30:45.125734912,2019-10-08 14:30:45.125716527,4117127,T,IEX,44.615000,1
2019-10-08 14:31:10.474117120,2019-10-08 14:31:10.474099183,4165250,T,IEX,44.650000,100
2019-10-08 14:32:32.701165056,2019-10-08 14:32:32.701145816,4249338,T,IEX,44.590000,100
2019-10-08 14:33:14.998040064,2019-10-08 14:33:14.998021265,4293760,T,IEX,44.550000,100
2019-10-08 14:33:58.260215040,2019-10-08 14:33:58.260194528,4335199,T,IEX,44.540000,16
2019-10-08 14:35:03.834806016,2019-10-08 14:35:03.834787727,4406606,T,IEX,44.540000,1
2019-10-08 14:35:15.927665920,2019-10-08 14:35:15.927644327,4421148,T,IEX,44.560000,200
2019-10-08 14:36:07.643005952,2019-10-08 14:36:07.642988833,4466005,T,IEX,44.580000,200
2019-10-08 14:36:08.631947008,2019-10-08 14:36:08.631928785,4467520,T,IEX,44.605000,1
2019-10-08 14:36:17.658989056,2019-10-08 14:36:17.658969862,4478253,T,IEX,44.620000,50
2019-10-08 14:36:17.659179008,2019-10-08 14:36:17.659153516,4478261,T,IEX,44.620000,50
2019-10-08 14:36:27.212555008,2019-10-08 14:36:27.212535374,4486490,T,IEX,44.590000,100
2019-10-08 14:37:45.753308928,2019-10-08 14:37:45.753286763,4556487,T,IEX,44.600000,64
2019-10-08 14:38:13.284726016,2019-10-08 14:38:13.284707860,4595305,T,IEX,44.650000,100
2019-10-08 14:40:01.794796032,2019-10-08 14:40:01.794771859,4699904,T,IEX,44.670000,100
2019-10-08 14:40:01.794963968,2019-10-08 14:40:01.794945516,4699913,T,IEX,44.670000,75
2019-10-08 14:40:01.795589888,2019-10-08 14:40:01.795568013,4699928,T,IEX,44.670000,25
2019-10-08 14:40:23.143672064,2019-10-08 14:40:23.143650190,4724159,T,IEX,44.620000,74
2019-10-08 14:41:37.898899968,2019-10-08 14:41:37.898881950,4792128,T,IEX,44.565000,1
2019-10-08 14:44:00.746520064,2019-10-08 14:44:00.746503846,4907359,T,IEX,44.545000,200
2019-10-08 14:44:46.248980992,2019-10-08 14:44:46.248959502,4942647,T,IEX,44.525000,100
2019-10-08 14:47:48.521751040,2019-10-08 14:47:48.521732157,5096188,T,IEX,44.525000,100
2019-10-08 14:48:12.538216960,2019-10-08 14:48:12.538201126,5119657,T,IEX,44.525000,200
2019-10-08 14:48:22.72899072,2019-10-08 14:48:22.72879960,5125291,T,IEX,44.520000,1
2019-10-08 14:48:29.80464896,2019-10-08 14:48:29.80446473,5136575,T,IEX,44.560000,100
2019-10-08 14:50:45.424019968,2019-10-08 14:50:45.424002652,5244015,T,IEX,44.565000,100
2019-10-08 14:51:14.326251008,2019-10-08 14:51:14.326230091,5265517,T,IEX,44.570000,100
2019-10-08 14:51:50.511522048,2019-10-08 14:51:50.511500986,5289752,T,IEX,44.550000,1
2019-10-08 14:52:19.100875008,2019-10-08 14:52:19.100856519,5312607,T,IEX,44.575000,200
2019-10-08 14:54:00.976116992,2019-10-08 14:54:00.976098094,5395174,T,IEX,44.545000,1
2019-10-08 14:55:03.194824960,2019-10-08 14:55:03.194807065,5457367,T,IEX,44.580000,100
2019-10-08 14:55:44.153683968,2019-10-08 14:55:44.153664115,5577815,T,IEX,44.630000,100
2019-10-08 14:56:33.595749888,2019-10-08 14:56:33.595730577,5667218,T,IEX,44.640000,200
2019-10-08 14:57:34.281849088,2019-10-08 14:57:34.281830277,5733212,T,IEX,44.660000,200
2019-10-08 14:58:46.567454976,2019-10-08 14:58:46.567434305,5809446,T,IEX,44.640000,200
2019-10-08 14:59:54.241776128,2019-10-08 14:59:54.241757329,5869536,T,IEX,44.630000,100
2019-10-08 14:59:54.685155072,2019-10-08 14:59:54.685135634,5869991,T,IEX,44.630000,100
2019-10-08 15:00:05.132777984,2019-10-08 15:00:05.132756005,5882449,T,IEX,44.570000,1
2019-10-08 15:00:21.664134912,2019-10-08 15:00:21.664116054,5896823,T,IEX,44.570000,100
2019-10-08 15:00:42.461819904,2019-10-08 15:00:42.461800702,5919013,T,IEX,44.580000,1
2019-10-08 15:01:02.720114944,2019-10-08 15:01:02.720093690,5946333,T,IEX,44.560000,100
2019-10-08 15:01:53.12858880,2019-10-08 15:01:53.12840775,5991838,T,IEX,44.530000,100
2019-10-08 15:05:01.387730944,2019-10-08 15:05:01.387693075,6137794,T,IEX,44.560000,100
2019-10-08 15:06:52.210339072,2019-10-08 15:06:52.210321951,6221765,T,IEX,44.540000,1
2019-10-08 15:10:04.812797952,2019-10-08 15:10:04.812777352,6356465,T,IEX,44.500000,96
2019-10-08 15:10:04.813320960,2019-10-08 15:10:04.813304492,6356467,T,IEX,44.500000,100
2019-10-08 15:12:24.944591104,2019-10-08 15:12:24.944574905,6457320,T,IEX,44.490000,100
2019-10-08 15:13:13.491639040,2019-10-08 15:13:13.491618034,6491118,T,IEX,44.480000,1
2019-10-08 15:13:13.491651072,2019-10-08 15:13:13.491635972,6491119,T,IEX,44.480000,100
2019-10-08 15:17:27.512061952,2019-10-08 15:17:27.512042041,6695775,T,IEX,44.480000,1
2019-10-08 15:17:55.396611072,2019-10-08 15:17:55.396590951,6720861,T,IEX,44.450000,49
2019-10-08 15:18:01.162394880,2019-10-08 15:18:01.162378815,6726896,T,IEX,44.440000,1
2019-10-08 15:18:12.405792000,2019-10-08 15:18:12.405768945,6737497,T,IEX,44.430000,100
2019-10-08 15:18:22.604476928,2019-10-08 15:18:22.604455567,6745765,T,IEX,44.420000,5
2019-10-08 15:21:41.570813952,2019-10-08 15:21:41.570796853,6916841,T,IEX,44.360000,100
2019-10-08 15:22:34.395414016,2019-10-08 15:22:34.395394415,6977312,T,IEX,44.300000,50
2019-10-08 15:23:01.358198016,2019-10-08 15:23:01.358175764,6998813,T,IEX,44.320000,100
2019-10-08 15:24:11.313507072,2019-10-08 15:24:11.313491123,7052605,T,IEX,44.290000,1
2019-10-08 15:24:24.64188928,2019-10-08 15:24:24.64171775,7062691,T,IEX,44.260000,109
2019-10-08 15:25:32.987041024,2019-10-08 15:25:32.987025295,7120512,T,IEX,44.210000,300
2019-10-08 15:25:32.987060992,2019-10-08 15:25:32.987045389,7120513,T,IEX,44.210000,300
2019-10-08 15:25:37.495770112,2019-10-08 15:25:37.495749898,7123413,T,IEX,44.200000,110
2019-10-08 15:26:10.557242112,2019-10-08 15:26:10.557226760,7148706,T,IEX,44.180000,100
2019-10-08 15:28:59.563644928,2019-10-08 15:28:59.563628801,7275346,T,IEX,44.170000,100
2019-10-08 15:29:17.132571904,2019-10-08 15:29:17.132555919,7291356,T,IEX,44.170000,100
2019-10-08 15:30:04.711707904,2019-10-08 15:30:04.711688197,7326668,T,IEX,44.180000,700
2019-10-08 15:30:19.794458880,2019-10-08 15:30:19.794441313,7337999,T,IEX,44.180000,1
2019-10-08 15:30:49.815881984,2019-10-08 15:30:49.815863486,7357109,T,IEX,44.180000,100
2019-10-08 15:31:02.906127104,2019-10-08 15:31:02.906109674,7368521,T,IEX,44.160000,100
2019-10-08 15:31:07.642625024,2019-10-08 15:31:07.642610287,7371726,T,IEX,44.165000,100
2019-10-08 15:32:34.1370112,2019-10-08 15:32:34.1351578,7426187,T,IEX,44.165000,1
2019-10-08 15:32:40.53054976,2019-10-08 15:32:40.53034986,7430160,T,IEX,44.165000,92
2019-10-08 15:32:58.315547904,2019-10-08 15:32:58.315526685,7446356,T,IEX,44.130000,12
2019-10-08 15:32:58.315561984,2019-10-08 15:32:58.315546650,7446357,T,IEX,44.130000,100
2019-10-08 15:33:09.113052928,2019-10-08 15:33:09.113035441,7463993,T,IEX,44.110000,100
2019-10-08 15:33:10.834008064,2019-10-08 15:33:10.833990443,7475411,T,IEX,44.025000,100
2019-10-08 15:33:11.600214016,2019-10-08 15:33:11.600194402,7477685,T,IEX,44.040000,100
2019-10-08 15:33:11.600408064,2019-10-08 15:33:11.600390815,7477688,T,IEX,44.040000,100
2019-10-08 15:33:12.799908096,2019-10-08 15:33:12.799888134,7479680,T,IEX,44.055000,100
2019-10-08 15:34:33.975420928,2019-10-08 15:34:33.975402053,7563259,T,IEX,43.990000,100
2019-10-08 15:34:48.945167104,2019-10-08 15:34:48.945148050,7575278,T,IEX,44.000000,100
2019-10-08 15:35:18.680233984,2019-10-08 15:35:18.680216455,7605940,T,IEX,43.960000,100
2019-10-08 15:35:18.901880064,2019-10-08 15:35:18.901861830,7609099,T,IEX,44.000000,100
2019-10-08 15:35:18.902749952,2019-10-08 15:35:18.902731590,7609104,T,IEX,44.000000,100
2019-10-08 15:36:06.707671040,2019-10-08 15:36:06.707650443,7656397,T,IEX,43.980000,26
2019-10-08 15:36:06.707727104,2019-10-08 15:36:06.707708903,7656399,T,IEX,43.980000,74
2019-10-08 15:36:28.259753984,2019-10-08 15:36:28.259736609,7670990,T,IEX,43.960000,1
2019-10-08 15:36:35.59314944,2019-10-08 15:36:35.59294799,7673919,T,IEX,43.980000,100
2019-10-08 15:36:38.61114880,2019-10-08 15:36:38.61098556,7675887,T,IEX,43.970000,14
2019-10-08 15:37:56.326811904,2019-10-08 15:37:56.326792824,7731161,T,IEX,43.960000,100
2019-10-08 15:39:16.235214080,2019-10-08 15:39:16.235189467,7784669,T,IEX,43.925000,284
2019-10-08 15:39:16.236569088,2019-10-08 15:39:16.236550599,7784670,T,IEX,43.920000,216
2019-10-08 15:39:46.947479040,2019-10-08 15:39:46.947461755,7805821,T,IEX,43.880000,100
2019-10-08 15:40:11.35276032,2019-10-08 15:40:11.35255956,7824279,T,IEX,43.900000,12
2019-10-08 15:40:11.35373056,2019-10-08 15:40:11.35357550,7824281,T,IEX,43.900000,88
2019-10-08 15:40:11.935561984,2019-10-08 15:40:11.935546966,7825113,T,IEX,43.900000,400
2019-10-08 15:40:11.960284928,2019-10-08 15:40:11.960270410,7825199,T,IEX,43.900000,300
2019-10-08 15:41:31.366672896,2019-10-08 15:41:31.366654073,7871076,T,IEX,43.900000,100
2019-10-08 15:42:14.303874048,2019-10-08 15:42:14.303856544,7896886,T,IEX,43.930000,6
2019-10-08 15:43:02.403969024,2019-10-08 15:43:02.403951803,7924142,T,IEX,43.965000,1
2019-10-08 15:44:39.731463936,2019-10-08 15:44:39.731448032,7980172,T,IEX,43.950000,100
2019-10-08 15:45:56.5750016,2019-10-08 15:45:56.5732324,8050678,T,IEX,44.030000,100
2019-10-08 15:45:56.291568896,2019-10-08 15:45:56.291543487,8051040,T,IEX,44.040000,100
2019-10-08 15:46:30.393673984,2019-10-08 15:46:30.393652624,8075902,T,IEX,44.015000,100
2019-10-08 15:47:45.118665984,2019-10-08 15:47:45.118645077,8125271,T,IEX,43.980000,100
2019-10-08 15:49:15.217785088,2019-10-08 15:49:15.217767292,8182590,T,IEX,43.940000,300
2019-10-08 15:49:59.26674944,2019-10-08 15:49:59.26657879,8215137,T,IEX,44.005000,1
2019-10-08 15:50:54.658119936,2019-10-08 15:50:54.658102894,8256104,T,IEX,43.985000,100
2019-10-08 15:50:58.229356032,2019-10-08 15:50:58.229337534,8259416,T,IEX,44.000000,100
2019-10-08 15:51:00.762234880,2019-10-08 15:51:00.762215505,8260968,T,IEX,44.030000,5
2019-10-08 15:51:08.621628928,2019-10-08 15:51:08.621611735,8264014,T,IEX,44.025000,100
2019-10-08 15:51:41.845872896,2019-10-08 15:51:41.845849563,8281780,T,IEX,44.030000,3
2019-10-08 15:51:41.845927936,2019-10-08 15:51:41.845908028,8281783,T,IEX,44.030000,95
2019-10-08 15:51:41.845936896,2019-10-08 15:51:41.845917128,8281784,T,IEX,44.030000,5
2019-10-08 15:51:41.846004992,2019-10-08 15:51:41.845983922,8281789,T,IEX,44.030000,76
2019-10-08 15:51:41.846135040,2019-10-08 15:51:41.846115341,8281794,T,IEX,44.030000,12
2019-10-08 15:51:41.846321920,2019-10-08 15:51:41.846302198,8281800,T,IEX,44.030000,4
2019-10-08 15:51:47.707826944,2019-10-08 15:51:47.707808299,8288499,T,IEX,44.060000,200
2019-10-08 15:51:48.710748928,2019-10-08 15:51:48.710730392,8289125,T,IEX,44.060000,200
2019-10-08 15:51:48.717668096,2019-10-08 15:51:48.717652265,8289128,T,IEX,44.060000,300
2019-10-08 15:51:48.733723904,2019-10-08 15:51:48.733705884,8289134,T,IEX,44.060000,102
2019-10-08 15:52:03.771122944,2019-10-08 15:52:03.771099844,8300049,T,IEX,44.030000,100
2019-10-08 15:52:07.96409088,2019-10-08 15:52:07.96392728,8301636,T,IEX,44.030000,100
2019-10-08 15:52:17.121498112,2019-10-08 15:52:17.121475627,8305945,T,IEX,44.020000,100
2019-10-08 15:52:26.326626048,2019-10-08 15:52:26.326604958,8310854,T,IEX,44.000000,100
2019-10-08 15:53:40.185970944,2019-10-08 15:53:40.185954872,8352340,T,IEX,44.010000,200
2019-10-08 15:54:14.74447872,2019-10-08 15:54:14.74427837,8378885,T,IEX,43.970000,100
2019-10-08 15:54:31.729020928,2019-10-08 15:54:31.729003471,8391420,T,IEX,44.010000,100
2019-10-08 15:57:00.198981888,2019-10-08 15:57:00.198962445,8475363,T,IEX,44.000000,2
2019-10-08 15:59:53.797025024,2019-10-08 15:59:53.797006259,8582394,T,IEX,44.030000,100
2019-10-08 16:00:43.957775104,2019-10-08 16:00:43.957757438,8614415,T,IEX,44.070000,12
2019-10-08 16:03:03.668919040,2019-10-08 16:03:03.668898682,8691202,T,IEX,44.110000,30
2019-10-08 16:03:27.227420928,2019-10-08 16:03:27.227399465,8704222,T,IEX,44.100000,12
2019-10-08 16:03:34.766299904,2019-10-08 16:03:34.766278586,8707331,T,IEX,44.090000,1
2019-10-08 16:03:52.293155072,2019-10-08 16:03:52.293136574,8714834,T,IEX,44.085000,11
2019-10-08 16:03:52.312228096,2019-10-08 16:03:52.312212017,8714875,T,IEX,44.080000,84
2019-10-08 16:03:52.313293056,2019-10-08 16:03:52.313276839,8714880,T,IEX,44.080000,16
2019-10-08 16:04:14.300281088,2019-10-08 16:04:14.300263431,8728940,T,IEX,44.080000,100
2019-10-08 16:05:01.686490880,2019-10-08 16:05:01.686471631,8747940,T,IEX,44.075000,1
2019-10-08 16:06:46.331692032,2019-10-08 16:06:46.331672103,8805843,T,IEX,44.060000,100
2019-10-08 16:07:38.34283008,2019-10-08 16:07:38.34263662,8828433,T,IEX,44.030000,2
2019-10-08 16:07:43.906583040,2019-10-08 16:07:43.906564772,8831171,T,IEX,44.030000,14
2019-10-08 16:07:59.738872064,2019-10-08 16:07:59.738854040,8839786,T,IEX,44.035000,17
2019-10-08 16:08:22.763527936,2019-10-08 16:08:22.763509443,8849880,T,IEX,44.055000,100
2019-10-08 16:13:20.956770048,2019-10-08 16:13:20.956749721,8990736,T,IEX,44.010000,1
2019-10-08 16:16:06.40934912,2019-10-08 16:16:06.40916524,9066056,T,IEX,44.005000,100
2019-10-08 16:16:49.349820928,2019-10-08 16:16:49.349803822,9079438,T,IEX,44.020000,100
2019-10-08 16:17:37.350146048,2019-10-08 16:17:37.350129221,9100839,T,IEX,44.020000,100
2019-10-08 16:20:23.4871936,2019-10-08 16:20:23.4850859,9188273,T,IEX,44.060000,100
2019-10-08 16:20:39.952816128,2019-10-08 16:20:39.952796371,9197153,T,IEX,44.060000,100
2019-10-08 16:20:40.81584896,2019-10-08 16:20:40.81566731,9197217,T,IEX,44.060000,21
2019-10-08 16:20:40.81602048,2019-10-08 16:20:40.81586307,9197218,T,IEX,44.060000,59
2019-10-08 16:21:55.272112128,2019-10-08 16:21:55.272093617,9239429,T,IEX,44.080000,100
2019-10-08 16:22:55.195795968,2019-10-08 16:22:55.195775379,9273018,T,IEX,44.100000,1
2019-10-08 16:22:55.200998912,2019-10-08 16:22:55.200978890,9273021,T,IEX,44.100000,6
2019-10-08 16:23:16.371418880,2019-10-08 16:23:16.371403122,9282714,T,IEX,44.100000,1
2019-10-08 16:24:44.206029056,2019-10-08 16:24:44.206010643,9321120,T,IEX,44.100000,12
2019-10-08 16:26:55.957715968,2019-10-08 16:26:55.957686734,9385030,T,IEX,44.100000,100
2019-10-08 16:28:13.552649984,2019-10-08 16:28:13.552632517,9419851,T,IEX,44.130000,100
2019-10-08 16:29:38.568237056,2019-10-08 16:29:38.568219665,9457020,T,IEX,44.160000,100
2019-10-08 16:32:20.908495104,2019-10-08 16:32:20.908477103,9529439,T,IEX,44.150000,1
2019-10-08 16:32:56.98702080,2019-10-08 16:32:56.98681740,9541909,T,IEX,44.140000,100
2019-10-08 16:33:59.969431040,2019-10-08 16:33:59.969412985,9566520,T,IEX,44.155000,100
2019-10-08 16:34:10.551198976,2019-10-08 16:34:10.551179401,9571585,T,IEX,44.150000,100
2019-10-08 16:34:22.944595968,2019-10-08 16:34:22.944578970,9577273,T,IEX,44.150000,100
2019-10-08 16:37:19.517283072,2019-10-08 16:37:19.517265778,9642392,T,IEX,44.070000,100
2019-10-08 16:37:27.625611008,2019-10-08 16:37:27.625590583,9644955,T,IEX,44.050000,65
2019-10-08 16:37:40.439298048,2019-10-08 16:37:40.439278428,9650417,T,IEX,44.060000,100
2019-10-08 16:38:08.105307904,2019-10-08 16:38:08.105292439,9663547,T,IEX,44.100000,400
2019-10-08 16:39:04.846127104,2019-10-08 16:39:04.846106105,9681036,T,IEX,44.090000,100
2019-10-08 16:39:26.98033920,2019-10-08 16:39:26.98015575,9687635,T,IEX,44.090000,100
2019-10-08 16:39:26.120207872,2019-10-08 16:39:26.120189274,9687647,T,IEX,44.110000,100
2019-10-08 16:39:52.845245952,2019-10-08 16:39:52.845225443,9695007,T,IEX,44.110000,100
2019-10-08 16:41:02.767802880,2019-10-08 16:41:02.767784847,9720224,T,IEX,44.160000,1
2019-10-08 16:42:19.172391936,2019-10-08 16:42:19.172373371,9748478,T,IEX,44.170000,100
2019-10-08 16:43:05.298460928,2019-10-08 16:43:05.298440038,9762833,T,IEX,44.170000,100
2019-10-08 16:43:10.544478976,2019-10-08 16:43:10.544451625,9763971,T,IEX,44.190000,100
2019-10-08 16:43:11.46298112,2019-10-08 16:43:11.46278618,9764090,T,IEX,44.235000,100
2019-10-08 16:44:56.248655104,2019-10-08 16:44:56.248635354,9813085,T,IEX,44.300000,100
2019-10-08 16:44:57.669039104,2019-10-08 16:44:57.669023574,9823062,T,IEX,44.310000,77
2019-10-08 16:47:17.621062912,2019-10-08 16:47:17.621046122,10052452,T,IEX,44.430000,200
2019-10-08 16:47:20.159599104,2019-10-08 16:47:20.159578585,10054106,T,IEX,44.410000,100
2019-10-08 16:48:21.855033088,2019-10-08 16:48:21.855014793,10103500,T,IEX,44.390000,100
2019-10-08 16:51:02.788592128,2019-10-08 16:51:02.788575739,10200502,T,IEX,44.340000,1
2019-10-08 16:53:25.668776960,2019-10-08 16:53:25.668758490,10279503,T,IEX,44.340000,100
2019-10-08 16:55:06.102720000,2019-10-08 16:55:06.102701536,10339337,T,IEX,44.320000,37
2019-10-08 16:55:06.102856960,2019-10-08 16:55:06.102837973,10339341,T,IEX,44.320000,75
2019-10-08 16:55:06.103054080,2019-10-08 16:55:06.103036455,10339347,T,IEX,44.320000,63
2019-10-08 16:55:06.103098112,2019-10-08 16:55:06.103079877,10339348,T,IEX,44.320000,25
2019-10-08 16:55:29.679194112,2019-10-08 16:55:29.679177090,10355482,T,IEX,44.260000,100
2019-10-08 16:55:49.415276032,2019-10-08 16:55:49.415256024,10372724,T,IEX,44.235000,1
2019-10-08 16:56:08.154785024,2019-10-08 16:56:08.154766277,10385440,T,IEX,44.230000,100
2019-10-08 16:56:35.55356928,2019-10-08 16:56:35.55337680,10402619,T,IEX,44.190000,100
2019-10-08 16:57:37.36843008,2019-10-08 16:57:37.36823666,10439075,T,IEX,44.180000,100
2019-10-08 16:59:12.230328064,2019-10-08 16:59:12.230309391,10491462,T,IEX,44.170000,100
2019-10-08 16:59:18.923556096,2019-10-08 16:59:18.923536051,10495512,T,IEX,44.190000,300
2019-10-08 16:59:45.903555072,2019-10-08 16:59:45.903539479,10510239,T,IEX,44.195000,1
2019-10-08 17:00:07.562554112,2019-10-08 17:00:07.562538196,10523011,T,IEX,44.160000,96
2019-10-08 17:00:44.884049920,2019-10-08 17:00:44.884032262,10544270,T,IEX,44.170000,50
2019-10-08 17:00:44.884121088,2019-10-08 17:00:44.884104414,10544272,T,IEX,44.170000,50
2019-10-08 17:00:44.892016896,2019-10-08 17:00:44.891997048,10544280,T,IEX,44.170000,100
2019-10-08 17:01:05.311015936,2019-10-08 17:01:05.310993788,10553413,T,IEX,44.190000,12
2019-10-08 17:01:05.311075072,2019-10-08 17:01:05.311054541,10553419,T,IEX,44.190000,75
2019-10-08 17:01:05.311120896,2019-10-08 17:01:05.311101742,10553422,T,IEX,44.190000,88
2019-10-08 17:01:05.311130880,2019-10-08 17:01:05.311111917,10553423,T,IEX,44.190000,24
2019-10-08 17:01:05.311734016,2019-10-08 17:01:05.311711336,10553435,T,IEX,44.190000,1
2019-10-08 17:08:03.674991104,2019-10-08 17:08:03.674971275,10770981,T,IEX,44.190000,100
2019-10-08 17:09:43.192269056,2019-10-08 17:09:43.192250893,10822481,T,IEX,44.210000,1
2019-10-08 17:14:28.599659008,2019-10-08 17:14:28.599639041,10964663,T,IEX,44.180000,100
2019-10-08 17:14:45.949688064,2019-10-08 17:14:45.949671842,10971782,T,IEX,44.190000,5
2019-10-08 17:14:48.876793088,2019-10-08 17:14:48.876772684,10973272,T,IEX,44.180000,100
2019-10-08 17:16:46.49015040,2019-10-08 17:16:46.48995706,11022734,T,IEX,44.180000,9
2019-10-08 17:17:59.214356992,2019-10-08 17:17:59.214337046,11055248,T,IEX,44.220000,97
2019-10-08 17:20:23.547782912,2019-10-08 17:20:23.547765228,11124715,T,IEX,44.240000,1
2019-10-08 17:21:24.519924992,2019-10-08 17:21:24.519903858,11150605,T,IEX,44.255000,100
2019-10-08 17:24:01.182732032,2019-10-08 17:24:01.182710355,11213358,T,IEX,44.260000,100
2019-10-08 17:24:17.658042112,2019-10-08 17:24:17.658024231,11223152,T,IEX,44.300000,5
2019-10-08 17:24:23.76955904,2019-10-08 17:24:23.76939340,11225186,T,IEX,44.290000,100
2019-10-08 17:25:53.953232896,2019-10-08 17:25:53.953216805,11264799,T,IEX,44.290000,100
2019-10-08 17:27:13.820178944,2019-10-08 17:27:13.820156946,11304066,T,IEX,44.330000,100
2019-10-08 17:27:13.842592000,2019-10-08 17:27:13.842574246,11304479,T,IEX,44.340000,70
2019-10-08 17:27:13.842688000,2019-10-08 17:27:13.842671147,11304481,T,IEX,44.340000,30
2019-10-08 17:30:45.187521024,2019-10-08 17:30:45.187493460,11396698,T,IEX,44.330000,100
2019-10-08 17:31:46.610692096,2019-10-08 17:31:46.610675557,11432164,T,IEX,44.315000,1
2019-10-08 17:33:04.606274048,2019-10-08 17:33:04.606255025,11466062,T,IEX,44.290000,2
2019-10-08 17:33:05.199710976,2019-10-08 17:33:05.199689619,11466321,T,IEX,44.280000,4
2019-10-08 17:33:22.167322880,2019-10-08 17:33:22.167304834,11472764,T,IEX,44.290000,12
2019-10-08 17:33:22.167384064,2019-10-08 17:33:22.167367423,11472766,T,IEX,44.290000,100
2019-10-08 17:33:22.167481088,2019-10-08 17:33:22.167464647,11472768,T,IEX,44.290000,75
2019-10-08 17:33:22.167514880,2019-10-08 17:33:22.167499729,11472770,T,IEX,44.290000,37
2019-10-08 17:33:22.167578112,2019-10-08 17:33:22.167561225,11472772,T,IEX,44.290000,100
2019-10-08 17:33:28.840448000,2019-10-08 17:33:28.840430686,11476045,T,IEX,44.295000,157
2019-10-08 17:33:50.707123968,2019-10-08 17:33:50.707101027,11484598,T,IEX,44.280000,11
2019-10-08 17:33:50.707236096,2019-10-08 17:33:50.707209100,11484607,T,IEX,44.280000,75
2019-10-08 17:33:50.707304960,2019-10-08 17:33:50.707283867,11484610,T,IEX,44.280000,14
2019-10-08 17:35:07.726277120,2019-10-08 17:35:07.726258337,11516163,T,IEX,44.270000,100
2019-10-08 17:37:46.237467904,2019-10-08 17:37:46.237452135,11605564,T,IEX,44.260000,63
2019-10-08 17:37:46.237681920,2019-10-08 17:37:46.237663893,11605566,T,IEX,44.260000,37
2019-10-08 17:39:32.159668992,2019-10-08 17:39:32.159653766,11647847,T,IEX,44.245000,100
2019-10-08 17:40:40.383481088,2019-10-08 17:40:40.383462749,11678894,T,IEX,44.230000,1
2019-10-08 17:43:22.574566912,2019-10-08 17:43:22.574549629,11751024,T,IEX,44.295000,100
2019-10-08 17:46:19.483782912,2019-10-08 17:46:19.483764846,11814031,T,IEX,44.290000,37
2019-10-08 17:46:19.483845120,2019-10-08 17:46:19.483829365,11814033,T,IEX,44.290000,63
2019-10-08 17:50:14.932175104,2019-10-08 17:50:14.932154400,11896966,T,IEX,44.290000,1
2019-10-08 17:53:41.940698880,2019-10-08 17:53:41.940679478,11964181,T,IEX,44.270000,9
2019-10-08 17:54:43.814733056,2019-10-08 17:54:43.814714063,11981519,T,IEX,44.250000,100
2019-10-08 17:55:00.918466048,2019-10-08 17:55:00.918446537,11993196,T,IEX,44.250000,100
2019-10-08 17:58:11.896651008,2019-10-08 17:58:11.896635065,12077006,T,IEX,44.220000,5
2019-10-08 17:58:43.53302016,2019-10-08 17:58:43.53285696,12087370,T,IEX,44.220000,1
2019-10-08 17:58:43.53320960,2019-10-08 17:58:43.53299368,12087372,T,IEX,44.220000,1
2019-10-08 18:01:59.508562944,2019-10-08 18:01:59.508544870,12205486,T,IEX,44.160000,100
2019-10-08 18:02:12.331535104,2019-10-08 18:02:12.331519203,12212210,T,IEX,44.175000,2
2019-10-08 18:02:41.11718912,2019-10-08 18:02:41.11691469,12230927,T,IEX,44.200000,49
2019-10-08 18:02:41.11749888,2019-10-08 18:02:41.11732181,12230929,T,IEX,44.200000,51
2019-10-08 18:03:10.896741888,2019-10-08 18:03:10.896724294,12249233,T,IEX,44.210000,100
2019-10-08 18:03:43.896787968,2019-10-08 18:03:43.896771299,12264485,T,IEX,44.220000,100
2019-10-08 18:03:43.897772032,2019-10-08 18:03:43.897752689,12264525,T,IEX,44.220000,4
2019-10-08 18:03:56.229694976,2019-10-08 18:03:56.229677955,12272561,T,IEX,44.240000,100
2019-10-08 18:03:56.235150080,2019-10-08 18:03:56.235132643,12272564,T,IEX,44.240000,100
2019-10-08 18:04:19.616218112,2019-10-08 18:04:19.616197933,12297717,T,IEX,44.210000,100
2019-10-08 18:04:19.617516032,2019-10-08 18:04:19.617498313,12297720,T,IEX,44.205000,100
2019-10-08 18:06:39.181128960,2019-10-08 18:06:39.181110631,12424531,T,IEX,44.240000,100
2019-10-08 18:08:47.366746880,2019-10-08 18:08:47.366726065,12497488,T,IEX,44.240000,75
2019-10-08 18:08:47.366871040,2019-10-08 18:08:47.366852416,12497491,T,IEX,44.240000,25
2019-10-08 18:08:49.621395968,2019-10-08 18:08:49.621377285,12499803,T,IEX,44.220000,1
2019-10-08 18:09:17.997881088,2019-10-08 18:09:17.997863816,12513087,T,IEX,44.250000,100
2019-10-08 18:10:21.346052096,2019-10-08 18:10:21.346031667,12548285,T,IEX,44.220000,37
2019-10-08 18:10:21.346215936,2019-10-08 18:10:21.346200066,12548287,T,IEX,44.220000,63
2019-10-08 18:11:22.957233920,2019-10-08 18:11:22.957216260,12577045,T,IEX,44.220000,100
2019-10-08 18:11:22.957273088,2019-10-08 18:11:22.957249478,12577049,T,IEX,44.220000,352
2019-10-08 18:11:22.957772032,2019-10-08 18:11:22.957749590,12577062,T,IEX,44.220000,100
2019-10-08 18:12:08.796380928,2019-10-08 18:12:08.796361683,12603576,T,IEX,44.220000,100
2019-10-08 18:13:08.874849024,2019-10-08 18:13:08.874831603,12635308,T,IEX,44.210000,100
2019-10-08 18:13:53.744049920,2019-10-08 18:13:53.744031629,12656053,T,IEX,44.220000,100
2019-10-08 18:14:08.623951104,2019-10-08 18:14:08.623932418,12662647,T,IEX,44.200000,100
2019-10-08 18:14:08.802054912,2019-10-08 18:14:08.802034921,12662755,T,IEX,44.195000,100
2019-10-08 18:14:08.804102912,2019-10-08 18:14:08.804083171,12662756,T,IEX,44.195000,100
2019-10-08 18:15:01.607373056,2019-10-08 18:15:01.607353666,12687665,T,IEX,44.210000,100
2019-10-08 18:15:01.608288000,2019-10-08 18:15:01.608268748,12687699,T,IEX,44.210000,100
2019-10-08 18:15:01.608316928,2019-10-08 18:15:01.608300413,12687700,T,IEX,44.210000,100
2019-10-08 18:15:06.205339904,2019-10-08 18:15:06.205319076,12692858,T,IEX,44.210000,100
2019-10-08 18:17:20.251832064,2019-10-08 18:17:20.251813990,12750539,T,IEX,44.185000,1
2019-10-08 18:17:51.897810944,2019-10-08 18:17:51.897786276,12762485,T,IEX,44.200000,100
2019-10-08 18:19:47.406253056,2019-10-08 18:19:47.406236588,12822956,T,IEX,44.190000,100
2019-10-08 18:23:26.435767040,2019-10-08 18:23:26.435748836,12927932,T,IEX,44.165000,100
2019-10-08 18:25:22.293394944,2019-10-08 18:25:22.293374964,12983731,T,IEX,44.165000,1
2019-10-08 18:25:31.855785984,2019-10-08 18:25:31.855766829,12987725,T,IEX,44.160000,100
2019-10-08 18:26:09.382358016,2019-10-08 18:26:09.382339636,13003399,T,IEX,44.140000,3
2019-10-08 18:27:30.761778944,2019-10-08 18:27:30.761759591,13036596,T,IEX,44.120000,100
2019-10-08 18:27:48.179154944,2019-10-08 18:27:48.179136536,13044190,T,IEX,44.150000,100
2019-10-08 18:27:48.183421952,2019-10-08 18:27:48.183401821,13044196,T,IEX,44.150000,200
2019-10-08 18:29:06.163493120,2019-10-08 18:29:06.163471982,13085300,T,IEX,44.135000,200
2019-10-08 18:30:04.645586944,2019-10-08 18:30:04.645568732,13148771,T,IEX,44.190000,1
2019-10-08 18:30:15.341739008,2019-10-08 18:30:15.341719507,13202298,T,IEX,44.200000,35
2019-10-08 18:33:01.152323072,2019-10-08 18:33:01.152304127,13547456,T,IEX,44.250000,4
2019-10-08 18:36:09.110107904,2019-10-08 18:36:09.110087871,13732104,T,IEX,44.280000,25
2019-10-08 18:36:09.110215936,2019-10-08 18:36:09.110195615,13732109,T,IEX,44.280000,33
2019-10-08 18:36:09.110298112,2019-10-08 18:36:09.110277958,13732115,T,IEX,44.280000,100
2019-10-08 18:36:09.110498048,2019-10-08 18:36:09.110480272,13732120,T,IEX,44.280000,42
2019-10-08 18:36:17.329549056,2019-10-08 18:36:17.329529127,13740403,T,IEX,44.295000,200
2019-10-08 18:36:25.261668096,2019-10-08 18:36:25.261650546,13747183,T,IEX,44.290000,100
2019-10-08 18:36:25.261776896,2019-10-08 18:36:25.261758831,13747186,T,IEX,44.290000,10
2019-10-08 18:36:59.786561024,2019-10-08 18:36:59.786542501,13799365,T,IEX,44.330000,100
2019-10-08 18:39:23.907471872,2019-10-08 18:39:23.907450440,13941663,T,IEX,44.360000,1
2019-10-08 18:39:51.397192960,2019-10-08 18:39:51.397174837,13956751,T,IEX,44.340000,1
2019-10-08 18:40:30.896773888,2019-10-08 18:40:30.896756228,13996657,T,IEX,44.320000,100
2019-10-08 18:46:14.250908928,2019-10-08 18:46:14.250889260,14221814,T,IEX,44.290000,100
2019-10-08 18:46:14.250993920,2019-10-08 18:46:14.250975025,14221816,T,IEX,44.290000,100
2019-10-08 18:46:37.385264896,2019-10-08 18:46:37.385243965,14237332,T,IEX,44.290000,2
2019-10-08 18:46:58.292374016,2019-10-08 18:46:58.292353111,14251066,T,IEX,44.290000,5
2019-10-08 18:50:24.656172032,2019-10-08 18:50:24.656150743,14429961,T,IEX,44.360000,100
2019-10-08 18:51:06.561455104,2019-10-08 18:51:06.561435304,14462207,T,IEX,44.340000,100
2019-10-08 18:52:18.449367040,2019-10-08 18:52:18.449347658,14504094,T,IEX,44.360000,75
2019-10-08 18:52:18.449462016,2019-10-08 18:52:18.449445588,14504096,T,IEX,44.360000,25
2019-10-08 18:53:04.986833920,2019-10-08 18:53:04.986813744,14531601,T,IEX,44.340000,6
2019-10-08 18:53:04.986848000,2019-10-08 18:53:04.986832934,14531602,T,IEX,44.340000,9
2019-10-08 18:53:05.283403008,2019-10-08 18:53:05.283384350,14532403,T,IEX,44.320000,100
2019-10-08 18:54:14.929812992,2019-10-08 18:54:14.929787722,14571059,T,IEX,44.330000,100
2019-10-08 18:54:46.468378112,2019-10-08 18:54:46.468357834,14587597,T,IEX,44.325000,28
2019-10-08 18:55:06.791610880,2019-10-08 18:55:06.791590745,14603195,T,IEX,44.300000,100
2019-10-08 18:55:06.812274944,2019-10-08 18:55:06.812255692,14603209,T,IEX,44.300000,100
2019-10-08 18:55:34.284225024,2019-10-08 18:55:34.284201557,14618785,T,IEX,44.320000,35
2019-10-08 18:55:34.284262912,2019-10-08 18:55:34.284244287,14618787,T,IEX,44.320000,65
2019-10-08 18:56:57.641785088,2019-10-08 18:56:57.641765014,14667445,T,IEX,44.355000,100
2019-10-08 18:57:27.987316992,2019-10-08 18:57:27.987298234,14685454,T,IEX,44.365000,100
2019-10-08 18:57:31.94430976,2019-10-08 18:57:31.94412655,14686934,T,IEX,44.350000,100
2019-10-08 18:57:31.377494016,2019-10-08 18:57:31.377473792,14697315,T,IEX,44.315000,16
2019-10-08 18:57:54.839731968,2019-10-08 18:57:54.839707775,14877593,T,IEX,44.160000,100
2019-10-08 18:57:56.626336000,2019-10-08 18:57:56.626316663,14887316,T,IEX,44.150000,9
2019-10-08 18:58:01.185163008,2019-10-08 18:58:01.185142269,14908175,T,IEX,44.110000,100
2019-10-08 18:58:08.32589056,2019-10-08 18:58:08.32573529,14942502,T,IEX,44.140000,100
2019-10-08 18:58:09.982075904,2019-10-08 18:58:09.982055293,14952182,T,IEX,44.130000,100
2019-10-08 18:58:58.65456128,2019-10-08 18:58:58.65438919,15100126,T,IEX,44.195000,10
2019-10-08 18:58:58.260516096,2019-10-08 18:58:58.260498233,15101327,T,IEX,44.185000,1
2019-10-08 18:59:01.507224064,2019-10-08 18:59:01.507205114,15111623,T,IEX,44.185000,9
2019-10-08 19:00:51.990160896,2019-10-08 19:00:51.990142164,15347067,T,IEX,44.240000,100
2019-10-08 19:03:01.789143040,2019-10-08 19:03:01.789120967,15501443,T,IEX,44.210000,65
2019-10-08 19:03:01.789208064,2019-10-08 19:03:01.789192330,15501445,T,IEX,44.210000,10
2019-10-08 19:03:01.789222912,2019-10-08 19:03:01.789207999,15501446,T,IEX,44.210000,25
2019-10-08 19:03:17.336732928,2019-10-08 19:03:17.336713698,15521741,T,IEX,44.210000,10
2019-10-08 19:03:21.735437056,2019-10-08 19:03:21.735416550,15528733,T,IEX,44.190000,9
2019-10-08 19:04:07.823195904,2019-10-08 19:04:07.823179009,15586594,T,IEX,44.165000,100
2019-10-08 19:05:15.831546880,2019-10-08 19:05:15.831526106,15667265,T,IEX,44.205000,1
2019-10-08 19:05:36.405070080,2019-10-08 19:05:36.405047270,15692499,T,IEX,44.250000,2
2019-10-08 19:05:42.349435904,2019-10-08 19:05:42.349419185,15700371,T,IEX,44.220000,100
2019-10-08 19:05:58.330102016,2019-10-08 19:05:58.330085326,15718425,T,IEX,44.210000,100
2019-10-08 19:06:13.915811072,2019-10-08 19:06:13.915793941,15732691,T,IEX,44.180000,12
2019-10-08 19:06:13.915830016,2019-10-08 19:06:13.915813145,15732692,T,IEX,44.170000,5
2019-10-08 19:06:13.915843072,2019-10-08 19:06:13.915825418,15732693,T,IEX,44.170000,28
2019-10-08 19:06:14.10414080,2019-10-08 19:06:14.10397027,15732750,T,IEX,44.170000,100
2019-10-08 19:07:48.911177984,2019-10-08 19:07:48.911160042,15834470,T,IEX,44.180000,100
2019-10-08 19:09:47.860028928,2019-10-08 19:09:47.860013372,15947687,T,IEX,44.180000,100
2019-10-08 19:10:51.778319872,2019-10-08 19:10:51.778302406,16014593,T,IEX,44.150000,1
2019-10-08 19:10:57.955333120,2019-10-08 19:10:57.955310511,16021474,T,IEX,44.180000,100
2019-10-08 19:10:57.955341056,2019-10-08 19:10:57.955323276,16021475,T,IEX,44.180000,27
2019-10-08 19:10:58.326539008,2019-10-08 19:10:58.326522924,16022222,T,IEX,44.140000,100
2019-10-08 19:11:20.938403072,2019-10-08 19:11:20.938386292,16043475,T,IEX,44.135000,1
2019-10-08 19:12:13.709754112,2019-10-08 19:12:13.709733812,16101048,T,IEX,44.150000,100
2019-10-08 19:12:22.882646016,2019-10-08 19:12:22.882630328,16111001,T,IEX,44.110000,100
2019-10-08 19:13:15.456005120,2019-10-08 19:13:15.455985237,16156026,T,IEX,44.095000,100
2019-10-08 19:17:14.248026112,2019-10-08 19:17:14.248007936,16334516,T,IEX,44.170000,1
2019-10-08 19:17:47.151674112,2019-10-08 19:17:47.151658802,16355468,T,IEX,44.200000,100
2019-10-08 19:20:19.380073984,2019-10-08 19:20:19.380053500,16472512,T,IEX,44.220000,20
2019-10-08 19:20:19.380387072,2019-10-08 19:20:19.380370741,16472514,T,IEX,44.220000,100
2019-10-08 19:20:19.380397056,2019-10-08 19:20:19.380380314,16472515,T,IEX,44.220000,28
2019-10-08 19:20:19.380410112,2019-10-08 19:20:19.380393132,16472516,T,IEX,44.220000,67
2019-10-08 19:20:19.380876032,2019-10-08 19:20:19.380857616,16472518,T,IEX,44.220000,13
2019-10-08 19:20:41.831759872,2019-10-08 19:20:41.831741453,16490342,T,IEX,44.230000,100
2019-10-08 19:20:42.79145984,2019-10-08 19:20:42.79124816,16490791,T,IEX,44.250000,98
2019-10-08 19:22:14.946507008,2019-10-08 19:22:14.946491650,16572850,T,IEX,44.270000,6
2019-10-08 19:23:49.559885056,2019-10-08 19:23:49.559863063,16639898,T,IEX,44.260000,100
2019-10-08 19:23:49.560236032,2019-10-08 19:23:49.560217730,16639910,T,IEX,44.250000,1
2019-10-08 19:24:32.722778880,2019-10-08 19:24:32.722761084,16666124,T,IEX,44.260000,100
2019-10-08 19:26:19.25208064,2019-10-08 19:26:19.25188409,16724216,T,IEX,44.260000,100
2019-10-08 19:26:19.82985984,2019-10-08 19:26:19.82966425,16724290,T,IEX,44.260000,100
2019-10-08 19:27:07.188474112,2019-10-08 19:27:07.188450784,16744655,T,IEX,44.255000,1
2019-10-08 19:27:37.722134016,2019-10-08 19:27:37.722116072,16760432,T,IEX,44.270000,5
2019-10-08 19:28:04.265724928,2019-10-08 19:28:04.265703733,16771285,T,IEX,44.255000,100
2019-10-08 19:28:23.363333120,2019-10-08 19:28:23.363313920,16782270,T,IEX,44.240000,3
2019-10-08 19:28:23.365933056,2019-10-08 19:28:23.365914895,16782311,T,IEX,44.235000,3
2019-10-08 19:28:23.724517888,2019-10-08 19:28:23.724499854,16785810,T,IEX,44.225000,1
2019-10-08 19:28:24.565298944,2019-10-08 19:28:24.565280093,16787668,T,IEX,44.215000,100
2019-10-08 19:28:37.896922112,2019-10-08 19:28:37.896903034,16800867,T,IEX,44.240000,4
2019-10-08 19:28:39.447396096,2019-10-08 19:28:39.447377802,16803903,T,IEX,44.240000,96
2019-10-08 19:29:33.916092928,2019-10-08 19:29:33.916074772,16844294,T,IEX,44.260000,12
2019-10-08 19:29:38.65862912,2019-10-08 19:29:38.65845004,16847402,T,IEX,44.240000,10
2019-10-08 19:30:34.522974976,2019-10-08 19:30:34.522957738,16881215,T,IEX,44.260000,100
2019-10-08 19:30:34.534316032,2019-10-08 19:30:34.534296030,16881217,T,IEX,44.250000,9
2019-10-08 19:30:52.272289024,2019-10-08 19:30:52.272269974,16891650,T,IEX,44.250000,100
2019-10-08 19:30:52.272759040,2019-10-08 19:30:52.272735753,16891666,T,IEX,44.240000,1
2019-10-08 19:30:55.227736064,2019-10-08 19:30:55.227716974,16896583,T,IEX,44.260000,100
2019-10-08 19:31:27.678138880,2019-10-08 19:31:27.678120622,16922252,T,IEX,44.280000,100
2019-10-08 19:33:07.944754944,2019-10-08 19:33:07.944736025,17002229,T,IEX,44.300000,100
2019-10-08 19:33:26.198640128,2019-10-08 19:33:26.198624627,17012979,T,IEX,44.290000,100
2019-10-08 19:33:29.243298048,2019-10-08 19:33:29.243277754,17014274,T,IEX,44.290000,1500
2019-10-08 19:34:26.688944128,2019-10-08 19:34:26.688922240,17056884,T,IEX,44.250000,1
2019-10-08 19:34:32.739909120,2019-10-08 19:34:32.739891716,17061241,T,IEX,44.250000,1
2019-10-08 19:34:34.79365888,2019-10-08 19:34:34.79344843,17061886,T,IEX,44.270000,37
2019-10-08 19:34:34.79441920,2019-10-08 19:34:34.79421537,17061888,T,IEX,44.270000,75
2019-10-08 19:34:34.79485952,2019-10-08 19:34:34.79465921,17061890,T,IEX,44.270000,37
2019-10-08 19:34:34.79550976,2019-10-08 19:34:34.79530066,17061892,T,IEX,44.270000,75
2019-10-08 19:34:34.461467904,2019-10-08 19:34:34.461447688,17062194,T,IEX,44.270000,25
2019-10-08 19:34:34.461486080,2019-10-08 19:34:34.461467730,17062195,T,IEX,44.270000,51
2019-10-08 19:34:36.873076992,2019-10-08 19:34:36.873059859,17063894,T,IEX,44.280000,100
2019-10-08 19:34:36.874319872,2019-10-08 19:34:36.874303282,17063896,T,IEX,44.280000,100
2019-10-08 19:35:32.536026112,2019-10-08 19:35:32.536007238,17115622,T,IEX,44.220000,33
2019-10-08 19:36:03.350309888,2019-10-08 19:36:03.350294326,17137179,T,IEX,44.220000,10
2019-10-08 19:36:03.467906048,2019-10-08 19:36:03.467887699,17137416,T,IEX,44.220000,3
2019-10-08 19:36:16.238744064,2019-10-08 19:36:16.238721184,17152182,T,IEX,44.195000,100
2019-10-08 19:36:24.537650944,2019-10-08 19:36:24.537632270,17162568,T,IEX,44.185000,9
2019-10-08 19:36:25.555299072,2019-10-08 19:36:25.555282812,17164275,T,IEX,44.180000,12
2019-10-08 19:36:59.136409088,2019-10-08 19:36:59.136386485,17187983,T,IEX,44.180000,100
2019-10-08 19:36:59.136420096,2019-10-08 19:36:59.136402735,17187984,T,IEX,44.180000,100
2019-10-08 19:36:59.140425984,2019-10-08 19:36:59.140407210,17187985,T,IEX,44.180000,100
2019-10-08 19:36:59.142547968,2019-10-08 19:36:59.142529463,17187988,T,IEX,44.180000,100
2019-10-08 19:38:23.650233088,2019-10-08 19:38:23.650215336,17261195,T,IEX,44.145000,1
2019-10-08 19:38:58.770180096,2019-10-08 19:38:58.770161639,17295817,T,IEX,44.140000,37
2019-10-08 19:38:58.837925888,2019-10-08 19:38:58.837908572,17295847,T,IEX,44.145000,100
2019-10-08 19:38:59.417435904,2019-10-08 19:38:59.417419416,17297369,T,IEX,44.140000,100
2019-10-08 19:38:59.417538048,2019-10-08 19:38:59.417520220,17297371,T,IEX,44.130000,100
2019-10-08 19:38:59.417933056,2019-10-08 19:38:59.417916298,17297378,T,IEX,44.130000,100
2019-10-08 19:38:59.417972992,2019-10-08 19:38:59.417955149,17297380,T,IEX,44.135000,100
2019-10-08 19:38:59.418196992,2019-10-08 19:38:59.418175061,17297388,T,IEX,44.130000,75
2019-10-08 19:38:59.418231040,2019-10-08 19:38:59.418213130,17297391,T,IEX,44.130000,75
2019-10-08 19:38:59.418284032,2019-10-08 19:38:59.418266188,17297394,T,IEX,44.130000,50
2019-10-08 19:38:59.418309888,2019-10-08 19:38:59.418293640,17297395,T,IEX,44.130000,63
2019-10-08 19:40:25.701466112,2019-10-08 19:40:25.701447572,17400982,T,IEX,44.040000,100
2019-10-08 19:40:25.840098048,2019-10-08 19:40:25.840077246,17401054,T,IEX,44.040000,100
2019-10-08 19:40:29.917196032,2019-10-08 19:40:29.917177877,17404752,T,IEX,44.050000,97
2019-10-08 19:40:29.917282048,2019-10-08 19:40:29.917262982,17404755,T,IEX,44.050000,100
2019-10-08 19:40:29.917562112,2019-10-08 19:40:29.917542840,17404761,T,IEX,44.050000,100
2019-10-08 19:40:29.917619968,2019-10-08 19:40:29.917602311,17404765,T,IEX,44.050000,98
2019-10-08 19:40:29.918721024,2019-10-08 19:40:29.918699511,17404799,T,IEX,44.050000,100
2019-10-08 19:40:31.27725056,2019-10-08 19:40:31.27704109,17405732,T,IEX,44.050000,5
2019-10-08 19:40:49.185501952,2019-10-08 19:40:49.185481813,17425687,T,IEX,44.040000,100
2019-10-08 19:41:30.105207040,2019-10-08 19:41:30.105191042,17460611,T,IEX,44.065000,1
2019-10-08 19:41:35.800709888,2019-10-08 19:41:35.800690823,17463525,T,IEX,44.065000,100
2019-10-08 19:41:41.222929920,2019-10-08 19:41:41.222913265,17472109,T,IEX,44.030000,10
2019-10-08 19:42:19.842260992,2019-10-08 19:42:19.842240282,17513225,T,IEX,44.020000,2
2019-10-08 19:42:22.824292096,2019-10-08 19:42:22.824276303,17516023,T,IEX,44.020000,98
2019-10-08 19:42:22.844297984,2019-10-08 19:42:22.844279200,17516037,T,IEX,44.010000,100
2019-10-08 19:42:22.844311040,2019-10-08 19:42:22.844294175,17516038,T,IEX,44.010000,32
2019-10-08 19:42:32.741044992,2019-10-08 19:42:32.741026368,17523588,T,IEX,44.020000,1
2019-10-08 19:42:46.264024064,2019-10-08 19:42:46.264008446,17533591,T,IEX,44.010000,100
2019-10-08 19:42:46.269867008,2019-10-08 19:42:46.269848355,17533595,T,IEX,44.010000,100
2019-10-08 19:42:46.279953920,2019-10-08 19:42:46.279935644,17533607,T,IEX,44.000000,50
2019-10-08 19:42:46.279964928,2019-10-08 19:42:46.279947878,17533608,T,IEX,44.000000,50
2019-10-08 19:43:21.962465024,2019-10-08 19:43:21.962447617,17572441,T,IEX,44.035000,1
2019-10-08 19:43:55.361939968,2019-10-08 19:43:55.361920852,17597194,T,IEX,44.020000,100
2019-10-08 19:44:37.314324992,2019-10-08 19:44:37.314305448,17632260,T,IEX,44.010000,100
2019-10-08 19:44:57.232381952,2019-10-08 19:44:57.232362881,17648657,T,IEX,43.980000,100
2019-10-08 19:44:57.232585984,2019-10-08 19:44:57.232568117,17648666,T,IEX,43.980000,100
2019-10-08 19:44:57.232654080,2019-10-08 19:44:57.232632472,17648669,T,IEX,43.980000,60
2019-10-08 19:45:05.703520000,2019-10-08 19:45:05.703500000,17662543,T,IEX,44.010000,2
2019-10-08 19:45:10.301665024,2019-10-08 19:45:10.301644138,17671050,T,IEX,44.020000,100
2019-10-08 19:45:53.706160128,2019-10-08 19:45:53.706139965,17717991,T,IEX,43.980000,107
2019-10-08 19:45:53.707801088,2019-10-08 19:45:53.707777222,17718040,T,IEX,43.980000,28
2019-10-08 19:47:12.255067904,2019-10-08 19:47:12.255054074,17783012,T,IEX,43.980000,5
2019-10-08 19:47:12.791774976,2019-10-08 19:47:12.791759904,17784083,T,IEX,43.975000,100
2019-10-08 19:47:13.855729920,2019-10-08 19:47:13.855706670,17784855,T,IEX,43.990000,100
2019-10-08 19:47:38.430896128,2019-10-08 19:47:38.430878084,17806484,T,IEX,43.970000,8
2019-10-08 19:47:59.379738880,2019-10-08 19:47:59.379720466,17823979,T,IEX,43.950000,4
2019-10-08 19:48:02.766387968,2019-10-08 19:48:02.766366901,17827100,T,IEX,43.950000,10
2019-10-08 19:48:02.766401024,2019-10-08 19:48:02.766385465,17827101,T,IEX,43.940000,100
2019-10-08 19:48:02.978671104,2019-10-08 19:48:02.978655511,17827372,T,IEX,43.940000,100
2019-10-08 19:48:08.660850944,2019-10-08 19:48:08.660833914,17833456,T,IEX,43.960000,100
2019-10-08 19:48:08.661260032,2019-10-08 19:48:08.661244778,17833459,T,IEX,43.960000,100
2019-10-08 19:48:13.961584128,2019-10-08 19:48:13.961567759,17843336,T,IEX,43.940000,10
2019-10-08 19:48:13.961598976,2019-10-08 19:48:13.961582372,17843337,T,IEX,43.940000,28
2019-10-08 19:48:15.56442112,2019-10-08 19:48:15.56420750,17844420,T,IEX,43.920000,100
2019-10-08 19:48:15.351452928,2019-10-08 19:48:15.351431311,17844676,T,IEX,43.910000,100
2019-10-08 19:48:15.352414976,2019-10-08 19:48:15.352394993,17844677,T,IEX,43.910000,249
2019-10-08 19:49:07.285030912,2019-10-08 19:49:07.285013715,17897819,T,IEX,43.920000,5
2019-10-08 19:49:07.321265920,2019-10-08 19:49:07.321248836,17897840,T,IEX,43.910000,100
2019-10-08 19:49:52.62955008,2019-10-08 19:49:52.62936911,17946214,T,IEX,43.930000,97
2019-10-08 19:49:52.63002880,2019-10-08 19:49:52.62986708,17946216,T,IEX,43.930000,3
2019-10-08 19:49:55.159311872,2019-10-08 19:49:55.159292762,17948570,T,IEX,43.930000,142
2019-10-08 19:49:55.162511872,2019-10-08 19:49:55.162494836,17948574,T,IEX,43.930000,100
2019-10-08 19:50:07.194240000,2019-10-08 19:50:07.194222953,17975797,T,IEX,43.920000,10
2019-10-08 19:50:19.51613952,2019-10-08 19:50:19.51594827,17991221,T,IEX,43.935000,1
2019-10-08 19:50:19.607772928,2019-10-08 19:50:19.607753839,17991638,T,IEX,43.940000,100
2019-10-08 19:50:44.196983040,2019-10-08 19:50:44.196965129,18038499,T,IEX,43.970000,7
2019-10-08 19:50:44.197001984,2019-10-08 19:50:44.196984319,18038500,T,IEX,43.970000,93
2019-10-08 19:50:44.200152064,2019-10-08 19:50:44.200134055,18038506,T,IEX,43.970000,7
2019-10-08 19:50:44.218782976,2019-10-08 19:50:44.218763443,18038521,T,IEX,43.970000,10
2019-10-08 19:50:44.218824960,2019-10-08 19:50:44.218806863,18038523,T,IEX,43.970000,90
2019-10-08 19:50:56.807020032,2019-10-08 19:50:56.807000658,18058573,T,IEX,43.940000,87
2019-10-08 19:50:56.852961024,2019-10-08 19:50:56.852943100,18058603,T,IEX,43.930000,28
2019-10-08 19:51:11.930178048,2019-10-08 19:51:11.930161363,18080370,T,IEX,43.925000,100
2019-10-08 19:51:48.544786944,2019-10-08 19:51:48.544766895,18116878,T,IEX,43.940000,34
2019-10-08 19:51:55.922191104,2019-10-08 19:51:55.922172122,18125676,T,IEX,43.940000,66
2019-10-08 19:52:18.696538880,2019-10-08 19:52:18.696521690,18154579,T,IEX,43.960000,100
2019-10-08 19:52:31.663728128,2019-10-08 19:52:31.663707388,18174627,T,IEX,43.920000,5
2019-10-08 19:52:58.952438016,2019-10-08 19:52:58.952415974,18199397,T,IEX,43.920000,100
2019-10-08 19:53:16.657180928,2019-10-08 19:53:16.657164343,18216611,T,IEX,43.935000,2
2019-10-08 19:53:53.988088064,2019-10-08 19:53:53.988069458,18254198,T,IEX,43.940000,5
2019-10-08 19:55:00.563149056,2019-10-08 19:55:00.563130936,18337642,T,IEX,43.910000,12
2019-10-08 19:55:01.126289920,2019-10-08 19:55:01.126270057,18339937,T,IEX,43.920000,2
2019-10-08 19:55:01.126308096,2019-10-08 19:55:01.126289769,18339938,T,IEX,43.920000,2
2019-10-08 19:55:05.691938048,2019-10-08 19:55:05.691918884,18353707,T,IEX,43.900000,4
2019-10-08 19:55:26.33089024,2019-10-08 19:55:26.33069032,18390798,T,IEX,43.930000,100
2019-10-08 19:55:26.271536896,2019-10-08 19:55:26.271516334,18391080,T,IEX,43.920000,100
2019-10-08 19:55:36.739997952,2019-10-08 19:55:36.739978207,18405769,T,IEX,43.915000,100
2019-10-08 19:55:56.445128960,2019-10-08 19:55:56.445111815,18429920,T,IEX,43.900000,1
2019-10-08 19:56:36.693389056,2019-10-08 19:56:36.693372161,18487660,T,IEX,43.910000,28
2019-10-08 19:56:37.468739072,2019-10-08 19:56:37.468720008,18488525,T,IEX,43.900000,100
2019-10-08 19:56:43.479684096,2019-10-08 19:56:43.479667484,18495838,T,IEX,43.890000,100
2019-10-08 19:57:21.421686016,2019-10-08 19:57:21.421665951,18549137,T,IEX,43.900000,100
2019-10-08 19:57:21.422637056,2019-10-08 19:57:21.422619866,18549141,T,IEX,43.900000,100
2019-10-08 19:57:34.95633920,2019-10-08 19:57:34.95616270,18567595,T,IEX,43.900000,100
2019-10-08 19:57:43.20925952,2019-10-08 19:57:43.20907796,18582684,T,IEX,43.880000,100
2019-10-08 19:57:43.20933888,2019-10-08 19:57:43.20916337,18582685,T,IEX,43.880000,11
2019-10-08 19:57:43.20952064,2019-10-08 19:57:43.20935056,18582686,T,IEX,43.880000,3
2019-10-08 19:57:43.22428928,2019-10-08 19:57:43.22407894,18582688,T,IEX,43.880000,6
2019-10-08 19:57:43.22441984,2019-10-08 19:57:43.22424173,18582689,T,IEX,43.880000,3
2019-10-08 19:57:43.22454016,2019-10-08 19:57:43.22437120,18582690,T,IEX,43.880000,7
2019-10-08 19:58:06.480971008,2019-10-08 19:58:06.480954773,18615794,T,IEX,43.865000,100
2019-10-08 19:58:09.568249088,2019-10-08 19:58:09.568233608,18623135,T,IEX,43.870000,10
2019-10-08 19:58:15.435060992,2019-10-08 19:58:15.435042105,18632744,T,IEX,43.880000,100
2019-10-08 19:58:22.24509952,2019-10-08 19:58:22.24491023,18642048,T,IEX,43.890000,100
2019-10-08 19:58:25.549853952,2019-10-08 19:58:25.549835952,18648660,T,IEX,43.870000,100
2019-10-08 19:58:25.983052032,2019-10-08 19:58:25.983030633,18649548,T,IEX,43.900000,100
2019-10-08 19:58:38.557732096,2019-10-08 19:58:38.557712481,18674093,T,IEX,43.920000,100
2019-10-08 19:58:48.784620032,2019-10-08 19:58:48.784601759,18688503,T,IEX,43.900000,100
2019-10-08 19:58:54.399770880,2019-10-08 19:58:54.399753875,18703999,T,IEX,43.910000,1
2019-10-08 19:59:06.27003904,2019-10-08 19:59:06.26985136,18731191,T,IEX,43.880000,4
2019-10-08 19:59:08.377206016,2019-10-08 19:59:08.377190970,18735586,T,IEX,43.870000,100
2019-10-08 19:59:19.916688896,2019-10-08 19:59:19.916673966,18756935,T,IEX,43.910000,8
2019-10-08 19:59:22.995749888,2019-10-08 19:59:22.995730619,18761044,T,IEX,43.870000,100
2019-10-08 19:59:36.632165888,2019-10-08 19:59:36.632149906,18808517,T,IEX,43.860000,100
2019-10-08 19:59:36.633251072,2019-10-08 19:59:36.633236380,18808527,T,IEX,43.860000,1
2019-10-08 19:59:38.235089920,2019-10-08 19:59:38.235070563,18814451,T,IEX,43.860000,100
2019-10-08 19:59:42.115687936,2019-10-08 19:59:42.115665784,18834139,T,IEX,43.865000,10
2019-10-08 19:59:42.684737024,2019-10-08 19:59:42.684719783,18838763,T,IEX,43.870000,90
