2019-10-07 13:30:25.661428992,2019-10-07 13:30:25.661402040,115929,T,IEX,52.890000,100
2019-10-07 13:30:39.117434112,2019-10-07 13:30:39.117407426,129575,T,IEX,53.010000,100
2019-10-07 13:31:00.713940992,2019-10-07 13:31:00.713912950,152504,T,IEX,52.995000,100
2019-10-07 13:31:01.74979072,2019-10-07 13:31:01.74955561,153039,T,IEX,53.030000,100
2019-10-07 13:31:07.958292992,2019-10-07 13:31:07.958271658,162529,T,IEX,52.990000,100
2019-10-07 13:31:15.395373056,2019-10-07 13:31:15.395350819,167908,T,IEX,52.945000,200
2019-10-07 13:31:33.1331968,2019-10-07 13:31:33.1308493,182900,T,IEX,52.850000,100
2019-10-07 13:31:34.655639040,2019-10-07 13:31:34.655610870,184447,T,IEX,52.850000,100
2019-10-07 13:32:03.192376064,2019-10-07 13:32:03.192350845,211331,T,IEX,52.790000,100
2019-10-07 13:32:04.234587904,2019-10-07 13:32:04.234558430,213077,T,IEX,52.790000,100
2019-10-07 13:32:52.398743040,2019-10-07 13:32:52.398719169,263273,T,IEX,52.835000,100
2019-10-07 13:32:52.611888896,2019-10-07 13:32:52.611863350,263467,T,IEX,52.845000,100
2019-10-07 13:33:16.971707904,2019-10-07 13:33:16.971685480,293482,T,IEX,53.010000,100
2019-10-07 13:34:00.15499008,2019-10-07 13:34:00.15477389,334408,T,IEX,52.970000,100
2019-10-07 13:34:31.690523904,2019-10-07 13:34:31.690508474,372574,T,IEX,52.920000,100
2019-10-07 13:35:09.274413056,2019-10-07 13:35:09.274393018,409902,T,IEX,52.880000,100
2019-10-07 13:35:20.354693888,2019-10-07 13:35:20.354675834,423656,T,IEX,52.945000,77
2019-10-07 13:35:48.459834880,2019-10-07 13:35:48.459816415,451682,T,IEX,52.890000,100
2019-10-07 13:37:20.17103872,2019-10-07 13:37:20.17084170,540170,T,IEX,52.820000,100
2019-10-07 13:37:29.217720064,2019-10-07 13:37:29.217698692,549786,T,IEX,52.855000,100
2019-10-07 13:38:25.755267072,2019-10-07 13:38:25.755246983,591701,T,IEX,52.830000,400
2019-10-07 13:39:54.848509952,2019-10-07 13:39:54.848494394,660426,T,IEX,52.735000,600
2019-10-07 13:39:54.851204096,2019-10-07 13:39:54.851187197,660433,T,IEX,52.750000,100
2019-10-07 13:39:54.851319040,2019-10-07 13:39:54.851303004,660436,T,IEX,52.750000,100
2019-10-07 13:40:00.6811904,2019-10-07 13:40:00.6792192,664892,T,IEX,52.760000,100
2019-10-07 13:41:11.797893120,2019-10-07 13:41:11.797873465,720511,T,IEX,52.720000,100
2019-10-07 13:41:11.801724928,2019-10-07 13:41:11.801706661,720513,T,IEX,52.705000,100
2019-10-07 13:41:33.412279040,2019-10-07 13:41:33.412257890,739237,T,IEX,52.665000,1000
2019-10-07 13:41:33.528956928,2019-10-07 13:41:33.528937233,739280,T,IEX,52.665000,700
2019-10-07 13:41:38.388602112,2019-10-07 13:41:38.388586266,742695,T,IEX,52.630000,100
2019-10-07 13:41:39.363911936,2019-10-07 13:41:39.363893900,743276,T,IEX,52.630000,100
2019-10-07 13:41:39.601768960,2019-10-07 13:41:39.601752031,744068,T,IEX,52.620000,100
2019-10-07 13:41:43.406362880,2019-10-07 13:41:43.406343906,747496,T,IEX,52.630000,100
2019-10-07 13:43:00.279578112,2019-10-07 13:43:00.279558923,806974,T,IEX,52.635000,100
2019-10-07 13:43:33.629327872,2019-10-07 13:43:33.629312245,832104,T,IEX,52.640000,8
2019-10-07 13:43:34.308406016,2019-10-07 13:43:34.308386911,832718,T,IEX,52.650000,200
2019-10-07 13:43:34.308440064,2019-10-07 13:43:34.308424222,832719,T,IEX,52.640000,392
2019-10-07 13:43:44.484800000,2019-10-07 13:43:44.484779503,841284,T,IEX,52.630000,100
2019-10-07 13:44:09.465252096,2019-10-07 13:44:09.465232834,860924,T,IEX,52.650000,100
2019-10-07 13:44:13.570244096,2019-10-07 13:44:13.570227956,864076,T,IEX,52.640000,200
2019-10-07 13:44:49.536250880,2019-10-07 13:44:49.536227824,887838,T,IEX,52.720000,100
2019-10-07 13:46:06.181935104,2019-10-07 13:46:06.181916712,962358,T,IEX,52.740000,1
2019-10-07 13:46:10.62031872,2019-10-07 13:46:10.62011786,967229,T,IEX,52.770000,4
2019-10-07 13:47:15.790930944,2019-10-07 13:47:15.790910634,1028645,T,IEX,52.705000,100
2019-10-07 13:47:38.667453952,2019-10-07 13:47:38.667437664,1046067,T,IEX,52.720000,300
2019-10-07 13:48:06.17723904,2019-10-07 13:48:06.17707530,1074873,T,IEX,52.730000,5
2019-10-07 13:48:58.437273088,2019-10-07 13:48:58.437252008,1120875,T,IEX,52.745000,46
2019-10-07 13:48:58.701239040,2019-10-07 13:48:58.701221691,1121106,T,IEX,52.750000,100
2019-10-07 13:49:01.596323072,2019-10-07 13:49:01.596301818,1122974,T,IEX,52.730000,149
2019-10-07 13:50:10.993520128,2019-10-07 13:50:10.993504266,1180534,T,IEX,52.780000,100
2019-10-07 13:51:17.621281024,2019-10-07 13:51:17.621264519,1238811,T,IEX,52.800000,100
2019-10-07 13:52:06.751483904,2019-10-07 13:52:06.751466094,1286494,T,IEX,52.830000,7
2019-10-07 13:52:22.841897984,2019-10-07 13:52:22.841880174,1304695,T,IEX,52.900000,78
2019-10-07 13:52:22.841934080,2019-10-07 13:52:22.841917502,1304696,T,IEX,52.900000,322
2019-10-07 13:53:03.523290112,2019-10-07 13:53:03.523270957,1338291,T,IEX,53.070000,94
2019-10-07 13:53:03.528851968,2019-10-07 13:53:03.528834477,1338366,T,IEX,53.070000,100
2019-10-07 13:53:03.528879104,2019-10-07 13:53:03.528861262,1338367,T,IEX,53.070000,100
2019-10-07 13:55:00.534803968,2019-10-07 13:55:00.534785946,1444960,T,IEX,53.030000,200
2019-10-07 13:55:23.659941888,2019-10-07 13:55:23.659923287,1463926,T,IEX,53.070000,100
2019-10-07 13:55:46.870157056,2019-10-07 13:55:46.870136746,1483617,T,IEX,53.070000,49
2019-10-07 13:55:46.870412032,2019-10-07 13:55:46.870394133,1483631,T,IEX,53.070000,51
2019-10-07 13:56:04.884385024,2019-10-07 13:56:04.884357415,1499761,T,IEX,53.060000,2
2019-10-07 13:56:43.6301952,2019-10-07 13:56:43.6281114,1527110,T,IEX,53.080000,140
2019-10-07 13:56:45.6439936,2019-10-07 13:56:45.6418831,1528856,T,IEX,53.080000,100
2019-10-07 13:56:52.183137024,2019-10-07 13:56:52.183118110,1533659,T,IEX,53.080000,100
2019-10-07 13:57:10.762643968,2019-10-07 13:57:10.762623836,1545097,T,IEX,53.080000,1
2019-10-07 13:57:10.762669056,2019-10-07 13:57:10.762652354,1545098,T,IEX,53.080000,199
2019-10-07 13:59:04.470782976,2019-10-07 13:59:04.470760596,1637153,T,IEX,52.990000,32
2019-10-07 13:59:04.470803968,2019-10-07 13:59:04.470786222,1637154,T,IEX,52.990000,1
2019-10-07 13:59:04.470819072,2019-10-07 13:59:04.470801607,1637155,T,IEX,52.990000,1
2019-10-07 13:59:41.393978880,2019-10-07 13:59:41.393962508,1672003,T,IEX,52.975000,7
2019-10-07 13:59:41.393989888,2019-10-07 13:59:41.393976232,1672004,T,IEX,52.980000,2
2019-10-07 13:59:41.394009088,2019-10-07 13:59:41.393991877,1672005,T,IEX,52.980000,1
2019-10-07 14:00:14.496432128,2019-10-07 14:00:14.496416353,1696672,T,IEX,52.950000,340
2019-10-07 14:01:09.197531904,2019-10-07 14:01:09.197514514,1752585,T,IEX,52.940000,100
2019-10-07 14:02:22.18821888,2019-10-07 14:02:22.18802799,1816488,T,IEX,52.870000,1
2019-10-07 14:02:53.857300992,2019-10-07 14:02:53.857280139,1837531,T,IEX,52.850000,100
2019-10-07 14:02:54.357112064,2019-10-07 14:02:54.357093354,1838206,T,IEX,52.840000,4
2019-10-07 14:03:14.1590016,2019-10-07 14:03:14.1574691,1856166,T,IEX,52.890000,100
2019-10-07 14:03:18.855651072,2019-10-07 14:03:18.855632943,1860210,T,IEX,52.930000,100
2019-10-07 14:03:40.5630976,2019-10-07 14:03:40.5610956,1877654,T,IEX,52.950000,200
2019-10-07 14:03:51.394852096,2019-10-07 14:03:51.394833286,1885186,T,IEX,52.950000,100
2019-10-07 14:04:14.54471936,2019-10-07 14:04:14.54450994,1901624,T,IEX,52.940000,1
2019-10-07 14:05:03.686460928,2019-10-07 14:05:03.686440482,1946985,T,IEX,52.920000,100
2019-10-07 14:05:08.550626048,2019-10-07 14:05:08.550604780,1954507,T,IEX,52.930000,75
2019-10-07 14:05:09.275441920,2019-10-07 14:05:09.275424423,1955844,T,IEX,52.930000,25
2019-10-07 14:05:16.414192128,2019-10-07 14:05:16.414166292,1965398,T,IEX,52.930000,200
2019-10-07 14:06:29.141723904,2019-10-07 14:06:29.141708375,2057713,T,IEX,53.000000,1
2019-10-07 14:07:16.759490048,2019-10-07 14:07:16.759474655,2107718,T,IEX,52.955000,1
2019-10-07 14:07:37.156570880,2019-10-07 14:07:37.156554793,2121181,T,IEX,52.930000,100
2019-10-07 14:09:16.164175872,2019-10-07 14:09:16.164153381,2197508,T,IEX,52.930000,100
2019-10-07 14:09:51.421166080,2019-10-07 14:09:51.421150307,2224518,T,IEX,52.885000,100
2019-10-07 14:10:05.159609088,2019-10-07 14:10:05.159593491,2237050,T,IEX,52.880000,3
2019-10-07 14:10:42.977889024,2019-10-07 14:10:42.977866137,2271504,T,IEX,52.925000,1
2019-10-07 14:10:42.977896960,2019-10-07 14:10:42.977879435,2271505,T,IEX,52.925000,2
2019-10-07 14:10:42.985381120,2019-10-07 14:10:42.985359882,2271510,T,IEX,52.925000,5
2019-10-07 14:10:43.264134912,2019-10-07 14:10:43.264118202,2271732,T,IEX,52.920000,100
2019-10-07 14:10:46.899629056,2019-10-07 14:10:46.899612780,2274401,T,IEX,52.915000,100
2019-10-07 14:10:46.901530112,2019-10-07 14:10:46.901512385,2274410,T,IEX,52.915000,100
2019-10-07 14:10:52.631380992,2019-10-07 14:10:52.631364205,2278523,T,IEX,52.890000,1
2019-10-07 14:10:52.638963968,2019-10-07 14:10:52.638941412,2278526,T,IEX,52.890000,3
2019-10-07 14:10:56.584425984,2019-10-07 14:10:56.584409967,2280768,T,IEX,52.890000,96
2019-10-07 14:11:36.57112064,2019-10-07 14:11:36.57091676,2315101,T,IEX,52.875000,100
2019-10-07 14:12:44.155078912,2019-10-07 14:12:44.155061564,2362832,T,IEX,52.925000,1
2019-10-07 14:12:44.155094016,2019-10-07 14:12:44.155078578,2362833,T,IEX,52.925000,1
2019-10-07 14:12:44.155115008,2019-10-07 14:12:44.155096129,2362835,T,IEX,52.925000,95
2019-10-07 14:13:03.186443008,2019-10-07 14:13:03.186422372,2377553,T,IEX,52.920000,10
2019-10-07 14:13:03.245737984,2019-10-07 14:13:03.245717875,2377582,T,IEX,52.920000,207
2019-10-07 14:13:31.984646912,2019-10-07 14:13:31.984627380,2397513,T,IEX,52.895000,100
2019-10-07 14:13:52.486755072,2019-10-07 14:13:52.486733918,2409195,T,IEX,52.890000,1
2019-10-07 14:13:52.486770944,2019-10-07 14:13:52.486754108,2409196,T,IEX,52.890000,1
2019-10-07 14:14:22.788954880,2019-10-07 14:14:22.788934343,2432528,T,IEX,52.885000,5
2019-10-07 14:14:34.796072960,2019-10-07 14:14:34.796053899,2440995,T,IEX,52.910000,300
2019-10-07 14:15:00.888589056,2019-10-07 14:15:00.888569869,2457440,T,IEX,52.915000,1
2019-10-07 14:15:02.508199936,2019-10-07 14:15:02.508184677,2458471,T,IEX,52.915000,100
2019-10-07 14:15:02.508220928,2019-10-07 14:15:02.508204796,2458472,T,IEX,52.915000,100
2019-10-07 14:15:02.536098048,2019-10-07 14:15:02.536080781,2458552,T,IEX,52.915000,2
2019-10-07 14:15:02.548553984,2019-10-07 14:15:02.548538365,2458630,T,IEX,52.915000,100
2019-10-07 14:15:25.4886016,2019-10-07 14:15:25.4868038,2479792,T,IEX,52.920000,300
2019-10-07 14:15:25.865551872,2019-10-07 14:15:25.865533550,2481319,T,IEX,52.920000,1
2019-10-07 14:15:25.865576960,2019-10-07 14:15:25.865558964,2481320,T,IEX,52.920000,1
2019-10-07 14:15:25.865597952,2019-10-07 14:15:25.865576492,2481322,T,IEX,52.920000,75
2019-10-07 14:17:28.698230016,2019-10-07 14:17:28.698210663,2566170,T,IEX,52.845000,100
2019-10-07 14:17:34.335034880,2019-10-07 14:17:34.335015536,2570074,T,IEX,52.865000,2
2019-10-07 14:17:34.335054080,2019-10-07 14:17:34.335035442,2570075,T,IEX,52.865000,1
2019-10-07 14:17:55.44140032,2019-10-07 14:17:55.44118659,2584109,T,IEX,52.845000,100
2019-10-07 14:19:03.587368960,2019-10-07 14:19:03.587350780,2630053,T,IEX,52.800000,100
2019-10-07 14:19:04.456238080,2019-10-07 14:19:04.456220235,2630417,T,IEX,52.805000,5
2019-10-07 14:19:05.3956992,2019-10-07 14:19:05.3935257,2630759,T,IEX,52.805000,1
2019-10-07 14:19:18.143652096,2019-10-07 14:19:18.143632528,2637820,T,IEX,52.810000,3
2019-10-07 14:19:39.46938880,2019-10-07 14:19:39.46915965,2651373,T,IEX,52.815000,6
2019-10-07 14:20:03.682564096,2019-10-07 14:20:03.682547939,2667985,T,IEX,52.815000,9
2019-10-07 14:20:03.682592000,2019-10-07 14:20:03.682577306,2667986,T,IEX,52.815000,1
2019-10-07 14:20:20.59990016,2019-10-07 14:20:20.59966851,2681179,T,IEX,52.820000,3
2019-10-07 14:20:25.3926016,2019-10-07 14:20:25.3907662,2683190,T,IEX,52.820000,200
2019-10-07 14:20:27.537015040,2019-10-07 14:20:27.536997060,2684026,T,IEX,52.820000,100
2019-10-07 14:20:34.276200960,2019-10-07 14:20:34.276184369,2688656,T,IEX,52.790000,100
2019-10-07 14:21:18.371687936,2019-10-07 14:21:18.371665968,2716515,T,IEX,52.830000,1
2019-10-07 14:21:41.152745984,2019-10-07 14:21:41.152720100,2740232,T,IEX,52.820000,100
2019-10-07 14:22:58.764064000,2019-10-07 14:22:58.764043831,2788808,T,IEX,52.820000,100
2019-10-07 14:22:59.2429952,2019-10-07 14:22:59.2407074,2788950,T,IEX,52.815000,4
2019-10-07 14:22:59.2444032,2019-10-07 14:22:59.2426843,2788951,T,IEX,52.815000,1
2019-10-07 14:23:09.966583040,2019-10-07 14:23:09.966565096,2796150,T,IEX,52.795000,100
2019-10-07 14:24:02.138023936,2019-10-07 14:24:02.138005751,2827412,T,IEX,52.820000,12
2019-10-07 14:24:02.138049024,2019-10-07 14:24:02.138026841,2827414,T,IEX,52.820000,1
2019-10-07 14:24:02.138146048,2019-10-07 14:24:02.138126954,2827420,T,IEX,52.820000,100
2019-10-07 14:24:02.165353984,2019-10-07 14:24:02.165334963,2828344,T,IEX,52.840000,100
2019-10-07 14:24:08.373170944,2019-10-07 14:24:08.373151794,2833861,T,IEX,52.840000,3
2019-10-07 14:24:32.240903936,2019-10-07 14:24:32.240886469,2852118,T,IEX,52.855000,2
2019-10-07 14:24:50.397536000,2019-10-07 14:24:50.397518806,2864422,T,IEX,52.825000,300
2019-10-07 14:27:05.432288000,2019-10-07 14:27:05.432267104,2963279,T,IEX,52.820000,1
2019-10-07 14:27:05.432314112,2019-10-07 14:27:05.432295597,2963281,T,IEX,52.820000,1
2019-10-07 14:27:05.432541952,2019-10-07 14:27:05.432523947,2963290,T,IEX,52.815000,98
2019-10-07 14:27:05.449588992,2019-10-07 14:27:05.449570885,2963410,T,IEX,52.830000,100
2019-10-07 14:27:06.313285120,2019-10-07 14:27:06.313268568,2965146,T,IEX,52.835000,14
2019-10-07 14:28:17.357992960,2019-10-07 14:28:17.357975098,3009269,T,IEX,52.840000,1
2019-10-07 14:28:17.358011904,2019-10-07 14:28:17.357993537,3009270,T,IEX,52.840000,1
2019-10-07 14:28:17.458892032,2019-10-07 14:28:17.458874637,3009610,T,IEX,52.845000,5
2019-10-07 14:28:19.769474048,2019-10-07 14:28:19.769452944,3011405,T,IEX,52.840000,100
2019-10-07 14:28:19.769495040,2019-10-07 14:28:19.769478299,3011406,T,IEX,52.830000,100
2019-10-07 14:28:19.769509888,2019-10-07 14:28:19.769493757,3011407,T,IEX,52.820000,100
2019-10-07 14:28:19.771712000,2019-10-07 14:28:19.771693429,3011411,T,IEX,52.810000,100
2019-10-07 14:28:19.774635008,2019-10-07 14:28:19.774611534,3011415,T,IEX,52.830000,100
2019-10-07 14:28:19.776488960,2019-10-07 14:28:19.776473422,3011418,T,IEX,52.810000,100
2019-10-07 14:28:19.776508928,2019-10-07 14:28:19.776493759,3011419,T,IEX,52.810000,100
2019-10-07 14:28:19.793334016,2019-10-07 14:28:19.793315799,3011428,T,IEX,52.800000,59
2019-10-07 14:28:19.901271040,2019-10-07 14:28:19.901249691,3011596,T,IEX,52.800000,1
2019-10-07 14:28:20.58951936,2019-10-07 14:28:20.58932684,3011684,T,IEX,52.800000,21
2019-10-07 14:28:25.8879104,2019-10-07 14:28:25.8858312,3015151,T,IEX,52.795000,2
2019-10-07 14:28:25.16243968,2019-10-07 14:28:25.16220673,3015156,T,IEX,52.795000,8
2019-10-07 14:28:27.46521088,2019-10-07 14:28:27.46499808,3016965,T,IEX,52.800000,600
2019-10-07 14:29:26.107493120,2019-10-07 14:29:26.107477402,3052271,T,IEX,52.810000,1
2019-10-07 14:29:26.107520000,2019-10-07 14:29:26.107502899,3052272,T,IEX,52.810000,99
2019-10-07 14:29:29.272696064,2019-10-07 14:29:29.272675373,3053849,T,IEX,52.805000,1
2019-10-07 14:29:32.7448064,2019-10-07 14:29:32.7427880,3055421,T,IEX,52.805000,1033
2019-10-07 14:30:02.498876928,2019-10-07 14:30:02.498857594,3075894,T,IEX,52.800000,1
2019-10-07 14:30:22.514114048,2019-10-07 14:30:22.514091726,3094136,T,IEX,52.825000,1
2019-10-07 14:30:22.514123008,2019-10-07 14:30:22.514104671,3094137,T,IEX,52.825000,5
2019-10-07 14:31:06.215635968,2019-10-07 14:31:06.215618101,3124199,T,IEX,52.810000,2
2019-10-07 14:31:10.958477056,2019-10-07 14:31:10.958455822,3127089,T,IEX,52.805000,3
2019-10-07 14:31:13.302595072,2019-10-07 14:31:13.302578780,3128384,T,IEX,52.790000,1
2019-10-07 14:32:30.275802880,2019-10-07 14:32:30.275784488,3185180,T,IEX,52.790000,200
2019-10-07 14:32:49.704834048,2019-10-07 14:32:49.704817390,3198121,T,IEX,52.790000,200
2019-10-07 14:32:50.27008000,2019-10-07 14:32:50.26990921,3198423,T,IEX,52.790000,100
2019-10-07 14:33:21.222236928,2019-10-07 14:33:21.222220961,3216457,T,IEX,52.760000,100
2019-10-07 14:33:26.747890944,2019-10-07 14:33:26.747871900,3222452,T,IEX,52.740000,100
2019-10-07 14:33:39.269852928,2019-10-07 14:33:39.269836476,3232503,T,IEX,52.720000,1
2019-10-07 14:33:39.269879040,2019-10-07 14:33:39.269862568,3232504,T,IEX,52.720000,1
2019-10-07 14:33:39.270863872,2019-10-07 14:33:39.270846078,3232506,T,IEX,52.720000,100
2019-10-07 14:33:39.270876928,2019-10-07 14:33:39.270859170,3232507,T,IEX,52.720000,98
2019-10-07 14:33:45.357906944,2019-10-07 14:33:45.357887532,3235751,T,IEX,52.720000,7
2019-10-07 14:33:52.459056896,2019-10-07 14:33:52.459037267,3239695,T,IEX,52.710000,100
2019-10-07 14:33:52.470693888,2019-10-07 14:33:52.470674508,3239698,T,IEX,52.710000,5
2019-10-07 14:33:52.470716928,2019-10-07 14:33:52.470692918,3239699,T,IEX,52.710000,1
2019-10-07 14:33:52.482334976,2019-10-07 14:33:52.482313333,3239703,T,IEX,52.720000,9
2019-10-07 14:33:58.801091072,2019-10-07 14:33:58.801073108,3243417,T,IEX,52.730000,100
2019-10-07 14:33:59.218971904,2019-10-07 14:33:59.218950392,3243711,T,IEX,52.735000,200
2019-10-07 14:33:59.554217984,2019-10-07 14:33:59.554197218,3243851,T,IEX,52.740000,100
2019-10-07 14:33:59.554262016,2019-10-07 14:33:59.554245229,3243852,T,IEX,52.740000,100
2019-10-07 14:34:02.16923904,2019-10-07 14:34:02.16906103,3245677,T,IEX,52.725000,100
2019-10-07 14:34:02.979470080,2019-10-07 14:34:02.979451199,3246314,T,IEX,52.725000,2
2019-10-07 14:34:03.54728960,2019-10-07 14:34:03.54709120,3246404,T,IEX,52.725000,3
2019-10-07 14:34:08.158246912,2019-10-07 14:34:08.158225704,3249938,T,IEX,52.740000,100
2019-10-07 14:34:20.920545024,2019-10-07 14:34:20.920526969,3259579,T,IEX,52.730000,100
2019-10-07 14:34:37.735217920,2019-10-07 14:34:37.735198458,3269364,T,IEX,52.745000,1500
2019-10-07 14:34:37.737861120,2019-10-07 14:34:37.737843221,3269366,T,IEX,52.745000,1
2019-10-07 14:34:50.707398912,2019-10-07 14:34:50.707379767,3279681,T,IEX,52.740000,5
2019-10-07 14:34:50.707417088,2019-10-07 14:34:50.707399829,3279682,T,IEX,52.740000,95
2019-10-07 14:36:00.26395904,2019-10-07 14:36:00.26373741,3330214,T,IEX,52.735000,3
2019-10-07 14:36:00.26412032,2019-10-07 14:36:00.26393088,3330215,T,IEX,52.735000,1
2019-10-07 14:36:56.344726016,2019-10-07 14:36:56.344708116,3374817,T,IEX,52.705000,7
2019-10-07 14:37:06.101178112,2019-10-07 14:37:06.101155433,3382724,T,IEX,52.685000,14
2019-10-07 14:37:06.110200064,2019-10-07 14:37:06.110181626,3382743,T,IEX,52.690000,2
2019-10-07 14:37:10.861018880,2019-10-07 14:37:10.860995342,3392035,T,IEX,52.670000,100
2019-10-07 14:38:05.534710016,2019-10-07 14:38:05.534691686,3433743,T,IEX,52.675000,1
2019-10-07 14:38:05.534728960,2019-10-07 14:38:05.534711267,3433744,T,IEX,52.675000,1
2019-10-07 14:39:22.244354048,2019-10-07 14:39:22.244336976,3482383,T,IEX,52.660000,100
2019-10-07 14:39:32.737648128,2019-10-07 14:39:32.737629302,3490003,T,IEX,52.660000,100
2019-10-07 14:39:33.873029888,2019-10-07 14:39:33.873008857,3492160,T,IEX,52.675000,100
2019-10-07 14:40:09.252858112,2019-10-07 14:40:09.252837434,3515203,T,IEX,52.695000,1
2019-10-07 14:40:09.252873984,2019-10-07 14:40:09.252856783,3515204,T,IEX,52.695000,1
2019-10-07 14:40:19.309462016,2019-10-07 14:40:19.309442885,3521982,T,IEX,52.735000,100
2019-10-07 14:40:28.941824000,2019-10-07 14:40:28.941805141,3529100,T,IEX,52.735000,100
2019-10-07 14:40:40.815910912,2019-10-07 14:40:40.815889416,3539891,T,IEX,52.730000,100
2019-10-07 14:41:06.35971072,2019-10-07 14:41:06.35954264,3557029,T,IEX,52.740000,100
2019-10-07 14:42:00.771225088,2019-10-07 14:42:00.771204256,3596777,T,IEX,52.765000,1
2019-10-07 14:43:52.928819968,2019-10-07 14:43:52.928800960,3673593,T,IEX,52.745000,1
2019-10-07 14:43:52.928833024,2019-10-07 14:43:52.928814945,3673594,T,IEX,52.750000,99
2019-10-07 14:43:52.928922880,2019-10-07 14:43:52.928897475,3673598,T,IEX,52.750000,1
2019-10-07 14:43:59.304732928,2019-10-07 14:43:59.304715250,3678919,T,IEX,52.760000,100
2019-10-07 14:44:01.516887040,2019-10-07 14:44:01.516869605,3684027,T,IEX,52.770000,200
2019-10-07 14:44:32.698544896,2019-10-07 14:44:32.698525105,3712978,T,IEX,52.740000,200
2019-10-07 14:44:32.767372032,2019-10-07 14:44:32.767352800,3713419,T,IEX,52.740000,1
2019-10-07 14:44:32.767397120,2019-10-07 14:44:32.767379988,3713420,T,IEX,52.740000,1
2019-10-07 14:45:23.362029056,2019-10-07 14:45:23.362010450,3748450,T,IEX,52.720000,7
2019-10-07 14:46:28.399576064,2019-10-07 14:46:28.399560204,3807410,T,IEX,52.745000,1
2019-10-07 14:46:57.400257024,2019-10-07 14:46:57.400240889,3824252,T,IEX,52.800000,100
2019-10-07 14:46:57.400272896,2019-10-07 14:46:57.400257853,3824253,T,IEX,52.800000,100
2019-10-07 14:47:43.350488064,2019-10-07 14:47:43.350472520,3859533,T,IEX,52.850000,300
2019-10-07 14:48:56.477270016,2019-10-07 14:48:56.477250324,3900657,T,IEX,52.785000,1
2019-10-07 14:50:38.527993088,2019-10-07 14:50:38.527971731,3965079,T,IEX,52.830000,100
2019-10-07 14:51:20.834678016,2019-10-07 14:51:20.834658003,3996612,T,IEX,52.865000,1
2019-10-07 14:53:05.478091008,2019-10-07 14:53:05.478068807,4058638,T,IEX,52.825000,100
2019-10-07 14:53:11.796656128,2019-10-07 14:53:11.796637926,4062805,T,IEX,52.830000,1
2019-10-07 14:53:11.796675072,2019-10-07 14:53:11.796657799,4062806,T,IEX,52.830000,1
2019-10-07 14:53:11.871119104,2019-10-07 14:53:11.871101762,4062897,T,IEX,52.830000,1
2019-10-07 14:53:20.391984128,2019-10-07 14:53:20.391965325,4068998,T,IEX,52.820000,200
2019-10-07 14:53:20.393114880,2019-10-07 14:53:20.393097688,4069000,T,IEX,52.820000,300
2019-10-07 14:53:40.907171072,2019-10-07 14:53:40.907148891,4079340,T,IEX,52.825000,200
2019-10-07 14:54:28.42244096,2019-10-07 14:54:28.42222195,4109030,T,IEX,52.825000,100
2019-10-07 14:55:16.169078016,2019-10-07 14:55:16.169058879,4142046,T,IEX,52.815000,1
2019-10-07 14:56:02.983716096,2019-10-07 14:56:02.983698664,4194878,T,IEX,52.880000,100
2019-10-07 14:56:06.218018048,2019-10-07 14:56:06.217998640,4197813,T,IEX,52.895000,100
2019-10-07 14:56:20.4198912,2019-10-07 14:56:20.4181149,4209813,T,IEX,52.885000,300
2019-10-07 14:57:33.779091968,2019-10-07 14:57:33.779074008,4257896,T,IEX,52.885000,1
2019-10-07 14:57:33.779107072,2019-10-07 14:57:33.779087341,4257898,T,IEX,52.885000,2
2019-10-07 14:57:40.931642112,2019-10-07 14:57:40.931624053,4263761,T,IEX,52.900000,100
