2019-10-29 13:33:48.839348992,2019-10-29 13:33:48.839329500,391156,T,IEX,304.680000,200
2019-10-29 13:34:25.600880896,2019-10-29 13:34:25.600863388,436992,T,IEX,304.700000,3300
2019-10-29 13:38:12.641436928,2019-10-29 13:38:12.641419568,662038,T,IEX,304.710000,2500
2019-10-29 13:44:14.717586944,2019-10-29 13:44:14.717570501,961346,T,IEX,304.940000,60
2019-10-29 13:55:44.479292928,2019-10-29 13:55:44.479273344,1514938,T,IEX,305.155000,100
2019-10-29 13:56:19.398882048,2019-10-29 13:56:19.398862304,1540275,T,IEX,305.150000,14
2019-10-29 14:21:39.509797888,2019-10-29 14:21:39.509777122,2661742,T,IEX,305.130000,26
2019-10-29 14:29:51.319447040,2019-10-29 14:29:51.319420418,2969366,T,IEX,305.180000,500
2019-10-29 14:30:56.130309888,2019-10-29 14:30:56.130290407,3025854,T,IEX,305.145000,100
2019-10-29 14:39:17.746791936,2019-10-29 14:39:17.746773550,3373930,T,IEX,305.465000,100
2019-10-29 14:42:11.463053056,2019-10-29 14:42:11.463034259,3479423,T,IEX,305.500000,100
2019-10-29 14:43:55.219320064,2019-10-29 14:43:55.219304117,3565473,T,IEX,305.600000,100
2019-10-29 14:43:55.220303104,2019-10-29 14:43:55.220287242,3565477,T,IEX,305.600000,149
2019-10-29 14:43:55.221242880,2019-10-29 14:43:55.221227027,3565479,T,IEX,305.600000,251
2019-10-29 14:47:24.287322880,2019-10-29 14:47:24.287301425,3701066,T,IEX,305.725000,100
2019-10-29 14:47:46.830927104,2019-10-29 14:47:46.830895471,3715600,T,IEX,305.810000,2800
2019-10-29 14:49:41.479627008,2019-10-29 14:49:41.479609035,3810879,T,IEX,305.770000,300
2019-10-29 14:49:41.480588032,2019-10-29 14:49:41.480573653,3810882,T,IEX,305.770000,1100
2019-10-29 15:07:36.308248064,2019-10-29 15:07:36.308201593,4476395,T,IEX,305.770000,100
2019-10-29 15:12:19.219870976,2019-10-29 15:12:19.219852649,4652723,T,IEX,305.610000,100
2019-10-29 15:12:50.96380928,2019-10-29 15:12:50.96363756,4673894,T,IEX,305.650000,100
2019-10-29 15:17:14.427022080,2019-10-29 15:17:14.427003925,4839423,T,IEX,305.590000,100
2019-10-29 15:17:14.427994112,2019-10-29 15:17:14.427975352,4839424,T,IEX,305.590000,900
2019-10-29 15:17:17.77806080,2019-10-29 15:17:17.77788472,4842228,T,IEX,305.560000,100
2019-10-29 15:35:46.446092032,2019-10-29 15:35:46.446073767,5424638,T,IEX,305.520000,100
2019-10-29 15:38:44.738340096,2019-10-29 15:38:44.738323604,5521994,T,IEX,305.300000,100
2019-10-29 15:44:20.9765888,2019-10-29 15:44:20.9735788,5691573,T,IEX,305.390000,100
2019-10-29 15:44:49.871745024,2019-10-29 15:44:49.871727029,5707918,T,IEX,305.360000,100
2019-10-29 15:45:05.321923072,2019-10-29 15:45:05.321902134,5717961,T,IEX,305.360000,100
2019-10-29 15:45:05.322929920,2019-10-29 15:45:05.322913187,5717964,T,IEX,305.360000,1472
2019-10-29 15:45:48.170356992,2019-10-29 15:45:48.170325094,5740128,T,IEX,305.390000,1360
2019-10-29 15:48:41.400525056,2019-10-29 15:48:41.400506869,5826152,T,IEX,305.400000,92
2019-10-29 15:50:35.715055104,2019-10-29 15:50:35.715035672,5879791,T,IEX,305.370000,100
2019-10-29 15:56:03.95843072,2019-10-29 15:56:03.95824592,6062613,T,IEX,305.475000,100
2019-10-29 15:57:44.606245120,2019-10-29 15:57:44.606226734,6115076,T,IEX,305.490000,100
2019-10-29 16:12:19.10937088,2019-10-29 16:12:19.10919389,7035154,T,IEX,305.250000,100
2019-10-29 16:16:43.102849024,2019-10-29 16:16:43.102830341,7182428,T,IEX,305.420000,1700
2019-10-29 16:19:53.228890112,2019-10-29 16:19:53.228873331,7285941,T,IEX,305.480000,16
2019-10-29 16:26:50.373748992,2019-10-29 16:26:50.373727847,7502119,T,IEX,305.570000,100
2019-10-29 16:32:35.859900928,2019-10-29 16:32:35.859881627,7673236,T,IEX,305.720000,300
2019-10-29 16:41:23.958464000,2019-10-29 16:41:23.958435847,7895625,T,IEX,305.580000,100
2019-10-29 16:41:53.467017984,2019-10-29 16:41:53.467000186,7905978,T,IEX,305.590000,100
2019-10-29 16:43:39.683022080,2019-10-29 16:43:39.683003900,7950585,T,IEX,305.540000,100
2019-10-29 16:47:00.412087040,2019-10-29 16:47:00.412068120,8028365,T,IEX,305.605000,100
2019-10-29 16:47:00.413158912,2019-10-29 16:47:00.413140342,8028366,T,IEX,305.605000,100
2019-10-29 16:50:04.120841984,2019-10-29 16:50:04.120823354,8101831,T,IEX,305.580000,100
2019-10-29 16:54:15.199665920,2019-10-29 16:54:15.199642360,8195361,T,IEX,305.560000,100
2019-10-29 16:56:27.658296064,2019-10-29 16:56:27.658276234,8253015,T,IEX,305.585000,100
2019-10-29 17:05:39.174693888,2019-10-29 17:05:39.174675735,8471290,T,IEX,305.590000,100
2019-10-29 17:05:39.354849024,2019-10-29 17:05:39.354831058,8471363,T,IEX,305.600000,100
2019-10-29 17:06:03.130007040,2019-10-29 17:06:03.129987044,8478882,T,IEX,305.620000,100
2019-10-29 17:18:30.91568896,2019-10-29 17:18:30.91551270,8746338,T,IEX,305.530000,100
2019-10-29 17:24:59.591245056,2019-10-29 17:24:59.591229057,8868506,T,IEX,305.480000,100
2019-10-29 17:24:59.680985088,2019-10-29 17:24:59.680965384,8868860,T,IEX,305.500000,100
2019-10-29 17:26:06.48978944,2019-10-29 17:26:06.48960804,8893843,T,IEX,305.470000,100
2019-10-29 17:28:41.619924992,2019-10-29 17:28:41.619907770,8945657,T,IEX,305.460000,100
2019-10-29 17:40:17.470372096,2019-10-29 17:40:17.470352724,9169684,T,IEX,305.470000,100
2019-10-29 17:45:09.443088896,2019-10-29 17:45:09.443072727,9259206,T,IEX,305.465000,100
2019-10-29 17:46:54.245434880,2019-10-29 17:46:54.245416129,9293417,T,IEX,305.450000,100
2019-10-29 17:50:30.46210048,2019-10-29 17:50:30.46191961,9354490,T,IEX,305.440000,100
2019-10-29 17:51:43.456572928,2019-10-29 17:51:43.456554896,9378282,T,IEX,305.450000,100
2019-10-29 17:51:43.491815936,2019-10-29 17:51:43.491795606,9378339,T,IEX,305.440000,100
2019-10-29 17:59:25.438024960,2019-10-29 17:59:25.438006076,9524927,T,IEX,305.510000,100
2019-10-29 18:08:36.689637888,2019-10-29 18:08:36.689615389,9735764,T,IEX,305.220000,100
2019-10-29 18:09:33.24781056,2019-10-29 18:09:33.24765245,9753772,T,IEX,305.230000,100
2019-10-29 18:12:58.334467072,2019-10-29 18:12:58.334448904,9816372,T,IEX,305.195000,100
2019-10-29 18:12:59.35205120,2019-10-29 18:12:59.35185385,9816656,T,IEX,305.200000,100
2019-10-29 18:13:46.970475008,2019-10-29 18:13:46.970452066,9833218,T,IEX,305.180000,100
2019-10-29 18:13:46.971632896,2019-10-29 18:13:46.971614134,9833219,T,IEX,305.180000,100
2019-10-29 18:17:46.157434112,2019-10-29 18:17:46.157419194,9913803,T,IEX,305.180000,100
2019-10-29 18:21:43.741262080,2019-10-29 18:21:43.741241754,10000887,T,IEX,305.200000,100
2019-10-29 18:21:56.676882944,2019-10-29 18:21:56.676859632,10005321,T,IEX,305.205000,100
2019-10-29 18:23:10.782531072,2019-10-29 18:23:10.782511745,10026974,T,IEX,305.180000,100
2019-10-29 18:23:45.651923968,2019-10-29 18:23:45.651899105,10037397,T,IEX,305.125000,100
2019-10-29 18:23:50.285236992,2019-10-29 18:23:50.285217228,10039667,T,IEX,305.110000,100
2019-10-29 18:27:24.937687040,2019-10-29 18:27:24.937671700,10124330,T,IEX,305.100000,100
2019-10-29 18:27:30.443592960,2019-10-29 18:27:30.443572829,10126513,T,IEX,305.100000,100
2019-10-29 18:31:53.251158016,2019-10-29 18:31:53.251140083,10225934,T,IEX,305.165000,8
2019-10-29 18:32:48.882964992,2019-10-29 18:32:48.882946254,10246715,T,IEX,305.190000,300
2019-10-29 18:32:48.886704128,2019-10-29 18:32:48.886682663,10246716,T,IEX,305.190000,2400
2019-10-29 18:37:38.215282944,2019-10-29 18:37:38.215261907,10351112,T,IEX,305.140000,100
2019-10-29 18:40:35.988727040,2019-10-29 18:40:35.988703270,10412367,T,IEX,305.135000,10
2019-10-29 18:41:12.95810048,2019-10-29 18:41:12.95788978,10424664,T,IEX,305.110000,100
2019-10-29 18:41:12.95820032,2019-10-29 18:41:12.95802149,10424665,T,IEX,305.110000,400
2019-10-29 18:44:06.789225984,2019-10-29 18:44:06.789196883,10479051,T,IEX,305.040000,200
2019-10-29 18:46:44.677406976,2019-10-29 18:46:44.677391059,10542566,T,IEX,305.010000,100
2019-10-29 18:48:10.103162112,2019-10-29 18:48:10.103139526,10575474,T,IEX,305.015000,200
2019-10-29 18:48:10.104165120,2019-10-29 18:48:10.104147859,10575475,T,IEX,305.015000,500
2019-10-29 18:49:10.126439936,2019-10-29 18:49:10.126422932,10595841,T,IEX,305.035000,100
2019-10-29 18:51:02.256101888,2019-10-29 18:51:02.256080998,10637461,T,IEX,305.030000,300
2019-10-29 18:56:45.848108032,2019-10-29 18:56:45.848089420,10764336,T,IEX,304.960000,25
2019-10-29 18:58:35.524194048,2019-10-29 18:58:35.524176618,10814524,T,IEX,304.880000,100
2019-10-29 19:00:05.148307968,2019-10-29 19:00:05.148288625,10865982,T,IEX,304.840000,10
2019-10-29 19:00:27.505405952,2019-10-29 19:00:27.505388292,10877123,T,IEX,304.800000,65
2019-10-29 19:01:08.966494976,2019-10-29 19:01:08.966473754,10894479,T,IEX,304.835000,500
2019-10-29 19:04:09.33009920,2019-10-29 19:04:09.32992241,10963284,T,IEX,304.870000,100
2019-10-29 19:05:35.623823104,2019-10-29 19:05:35.623804170,10999535,T,IEX,304.945000,20
2019-10-29 19:10:26.548137984,2019-10-29 19:10:26.548117660,11108745,T,IEX,304.925000,100
2019-10-29 19:11:43.775332096,2019-10-29 19:11:43.775311290,11135285,T,IEX,304.945000,300
2019-10-29 19:14:10.196069888,2019-10-29 19:14:10.196050964,11186279,T,IEX,304.990000,100
2019-10-29 19:17:25.453256960,2019-10-29 19:17:25.453237530,11261571,T,IEX,304.920000,95
2019-10-29 19:22:31.239081984,2019-10-29 19:22:31.239063410,11389305,T,IEX,305.020000,100
2019-10-29 19:27:47.471565056,2019-10-29 19:27:47.471546247,11518698,T,IEX,305.020000,10
2019-10-29 19:27:51.610394880,2019-10-29 19:27:51.610375045,11520239,T,IEX,305.020000,15
2019-10-29 19:28:16.981782016,2019-10-29 19:28:16.981761973,11535341,T,IEX,304.930000,100
2019-10-29 19:29:36.111383040,2019-10-29 19:29:36.111365293,11568911,T,IEX,304.900000,100
2019-10-29 19:30:16.465402880,2019-10-29 19:30:16.465382804,11591630,T,IEX,304.960000,100
2019-10-29 19:30:48.85095936,2019-10-29 19:30:48.85074334,11607894,T,IEX,304.960000,10
2019-10-29 19:30:50.977051904,2019-10-29 19:30:50.977033973,11609142,T,IEX,304.975000,100
2019-10-29 19:33:10.522504960,2019-10-29 19:33:10.522485199,11687307,T,IEX,304.905000,100
2019-10-29 19:36:16.649767936,2019-10-29 19:36:16.649749141,11782912,T,IEX,304.825000,100
2019-10-29 19:36:21.286170112,2019-10-29 19:36:21.286148325,11785226,T,IEX,304.795000,100
2019-10-29 19:36:41.621338880,2019-10-29 19:36:41.621320533,11795885,T,IEX,304.780000,100
2019-10-29 19:37:37.734251008,2019-10-29 19:37:37.734235304,11826826,T,IEX,304.820000,100
2019-10-29 19:38:07.142774016,2019-10-29 19:38:07.142754263,11842540,T,IEX,304.770000,100
2019-10-29 19:40:00.96166912,2019-10-29 19:40:00.96132880,11895079,T,IEX,304.700000,500
2019-10-29 19:40:00.96249088,2019-10-29 19:40:00.96220194,11895090,T,IEX,304.700000,100
2019-10-29 19:40:01.292482048,2019-10-29 19:40:01.292464393,11897887,T,IEX,304.725000,100
2019-10-29 19:41:03.957765120,2019-10-29 19:41:03.957747233,11926937,T,IEX,304.700000,10
2019-10-29 19:42:01.377637120,2019-10-29 19:42:01.377617796,11960742,T,IEX,304.670000,38
2019-10-29 19:44:24.513445120,2019-10-29 19:44:24.513425721,12043601,T,IEX,304.775000,100
2019-10-29 19:44:32.529518080,2019-10-29 19:44:32.529501164,12052427,T,IEX,304.750000,100
2019-10-29 19:44:53.221627904,2019-10-29 19:44:53.221611056,12061404,T,IEX,304.770000,100
2019-10-29 19:49:38.710393088,2019-10-29 19:49:38.710372936,12246733,T,IEX,304.690000,2300
2019-10-29 19:50:01.302605056,2019-10-29 19:50:01.302582073,12271221,T,IEX,304.710000,100
2019-10-29 19:50:01.302657024,2019-10-29 19:50:01.302638049,12271226,T,IEX,304.710000,100
2019-10-29 19:54:00.863546112,2019-10-29 19:54:00.863511973,12498425,T,IEX,304.860000,2800
2019-10-29 19:56:27.710640896,2019-10-29 19:56:27.710621842,12664504,T,IEX,304.920000,100
2019-10-29 19:57:49.124640000,2019-10-29 19:57:49.124621032,12755194,T,IEX,304.930000,200
2019-10-29 19:58:46.989872128,2019-10-29 19:58:46.989852450,12827597,T,IEX,304.835000,100
2019-10-29 19:59:04.827564032,2019-10-29 19:59:04.827547229,12852679,T,IEX,304.790000,100
2019-10-29 19:59:06.875642880,2019-10-29 19:59:06.875627505,12856218,T,IEX,304.800000,100
2019-10-29 19:59:15.652453888,2019-10-29 19:59:15.652436539,12871529,T,IEX,304.830000,100
2019-10-29 19:59:23.982592000,2019-10-29 19:59:23.982576845,12883146,T,IEX,304.890000,200
2019-10-29 19:59:36.15126016,2019-10-29 19:59:36.15111230,12923808,T,IEX,304.945000,100
2019-10-29 19:59:36.15149056,2019-10-29 19:59:36.15130786,12923809,T,IEX,304.950000,100
2019-10-29 19:59:41.88599040,2019-10-29 19:59:41.88580559,12945023,T,IEX,304.960000,100
2019-10-29 19:59:41.88611072,2019-10-29 19:59:41.88594103,12945024,T,IEX,304.960000,100
2019-10-29 19:59:43.915943936,2019-10-29 19:59:43.915922096,12957678,T,IEX,304.960000,40
2019-10-29 19:59:45.611354880,2019-10-29 19:59:45.611336611,12967876,T,IEX,304.930000,89
