2019-10-29 13:59:11.590536960,2019-10-29 13:59:11.590519023,1659369,T,IEX,55.310000,1000
2019-10-29 14:20:10.188400896,2019-10-29 14:20:10.188383404,2596186,T,IEX,55.325000,100
2019-10-29 14:20:22.164790016,2019-10-29 14:20:22.164770205,2604881,T,IEX,55.325000,100
2019-10-29 14:29:42.165971968,2019-10-29 14:29:42.165954987,2962750,T,IEX,55.375000,100
2019-10-29 14:34:25.101991936,2019-10-29 14:34:25.101970430,3184770,T,IEX,55.480000,100
2019-10-29 14:36:06.595056896,2019-10-29 14:36:06.595038664,3255760,T,IEX,55.505000,25
2019-10-29 14:47:46.952918016,2019-10-29 14:47:46.952898468,3719667,T,IEX,55.770000,1000
2019-10-29 15:59:16.241701888,2019-10-29 15:59:16.241682935,6232335,T,IEX,55.290000,100
2019-10-29 17:35:06.173001984,2019-10-29 17:35:06.172986007,9075276,T,IEX,55.545000,100
2019-10-29 18:00:53.811641088,2019-10-29 18:00:53.811621964,9562101,T,IEX,55.490000,100
2019-10-29 19:23:40.569170944,2019-10-29 19:23:40.569152418,11415189,T,IEX,55.320000,100
2019-10-29 19:23:40.569295104,2019-10-29 19:23:40.569276441,11415194,T,IEX,55.320000,75
2019-10-29 19:23:40.569396992,2019-10-29 19:23:40.569378020,11415201,T,IEX,55.320000,625
2019-10-29 19:54:00.863404032,2019-10-29 19:54:00.863371951,12498411,T,IEX,55.210000,200
