2019-10-14 13:30:48.920467968,2019-10-14 13:30:48.920444175,133176,T,IEX,142.160000,100
2019-10-14 13:30:50.835546880,2019-10-14 13:30:50.835521894,135265,T,IEX,142.105000,100
2019-10-14 13:30:51.977723904,2019-10-14 13:30:51.977701694,136815,T,IEX,142.225000,100
2019-10-14 13:30:51.995833088,2019-10-14 13:30:51.995809832,136855,T,IEX,142.220000,100
2019-10-14 13:31:20.293475072,2019-10-14 13:31:20.293449482,174354,T,IEX,142.285000,100
2019-10-14 13:33:06.805274112,2019-10-14 13:33:06.805251274,284202,T,IEX,142.105000,100
2019-10-14 13:34:07.802224896,2019-10-14 13:34:07.802201417,345001,T,IEX,142.130000,100
2019-10-14 13:34:36.258989056,2019-10-14 13:34:36.258971791,373964,T,IEX,142.110000,100
2019-10-14 13:34:36.259045888,2019-10-14 13:34:36.259030395,373966,T,IEX,142.110000,100
2019-10-14 13:35:30.546341120,2019-10-14 13:35:30.546325006,420851,T,IEX,142.130000,100
2019-10-14 13:35:32.232723968,2019-10-14 13:35:32.232702701,422349,T,IEX,142.120000,100
2019-10-14 13:37:02.450150912,2019-10-14 13:37:02.450132715,498465,T,IEX,142.045000,200
2019-10-14 13:37:05.61353984,2019-10-14 13:37:05.61338642,501444,T,IEX,142.000000,35
2019-10-14 13:37:05.61518080,2019-10-14 13:37:05.61502196,501446,T,IEX,142.000000,65
2019-10-14 13:37:05.61701120,2019-10-14 13:37:05.61684158,501447,T,IEX,142.000000,100
2019-10-14 13:37:05.182861056,2019-10-14 13:37:05.182843680,501526,T,IEX,142.010000,100
2019-10-14 13:37:09.894019072,2019-10-14 13:37:09.894001001,509688,T,IEX,141.910000,300
2019-10-14 13:37:09.991358976,2019-10-14 13:37:09.991340937,509913,T,IEX,141.910000,100
2019-10-14 13:37:12.361374976,2019-10-14 13:37:12.361357394,513737,T,IEX,141.980000,100
2019-10-14 13:37:15.981819904,2019-10-14 13:37:15.981797264,517183,T,IEX,141.990000,100
2019-10-14 13:37:31.222108928,2019-10-14 13:37:31.222090198,530680,T,IEX,142.055000,100
2019-10-14 13:37:32.746617088,2019-10-14 13:37:32.746598232,531393,T,IEX,142.005000,100
2019-10-14 13:37:32.749841920,2019-10-14 13:37:32.749823722,531396,T,IEX,142.005000,100
2019-10-14 13:37:43.207265024,2019-10-14 13:37:43.207244672,541452,T,IEX,141.980000,100
2019-10-14 13:37:43.221089024,2019-10-14 13:37:43.221070584,541467,T,IEX,141.980000,100
2019-10-14 13:37:43.224404992,2019-10-14 13:37:43.224385857,541470,T,IEX,141.980000,100
2019-10-14 13:37:43.226488064,2019-10-14 13:37:43.226473413,541474,T,IEX,141.980000,100
2019-10-14 13:37:54.60443904,2019-10-14 13:37:54.60424226,549648,T,IEX,141.985000,100
2019-10-14 13:38:23.244975104,2019-10-14 13:38:23.244957797,579843,T,IEX,141.840000,100
2019-10-14 13:38:23.391706112,2019-10-14 13:38:23.391685983,579936,T,IEX,141.820000,100
2019-10-14 13:39:23.399549952,2019-10-14 13:39:23.399530544,630225,T,IEX,141.615000,1
2019-10-14 13:40:21.480592896,2019-10-14 13:40:21.480574132,676472,T,IEX,141.560000,100
2019-10-14 13:40:54.635062016,2019-10-14 13:40:54.635044429,706458,T,IEX,141.565000,100
2019-10-14 13:41:28.656122112,2019-10-14 13:41:28.656103684,740389,T,IEX,141.610000,100
2019-10-14 13:41:56.450575872,2019-10-14 13:41:56.450558049,761500,T,IEX,141.650000,100
2019-10-14 13:42:49.418009088,2019-10-14 13:42:49.417991642,801757,T,IEX,141.575000,100
2019-10-14 13:42:49.418053888,2019-10-14 13:42:49.418038197,801758,T,IEX,141.575000,100
2019-10-14 13:42:49.566673920,2019-10-14 13:42:49.566657980,802087,T,IEX,141.580000,100
2019-10-14 13:42:49.642240000,2019-10-14 13:42:49.642220725,802181,T,IEX,141.580000,100
2019-10-14 13:43:12.150363904,2019-10-14 13:43:12.150346351,819868,T,IEX,141.690000,74
2019-10-14 13:43:19.219723008,2019-10-14 13:43:19.219701894,829163,T,IEX,141.840000,100
2019-10-14 13:43:19.321652992,2019-10-14 13:43:19.321629741,829329,T,IEX,141.850000,100
2019-10-14 13:43:37.934969088,2019-10-14 13:43:37.934947965,845867,T,IEX,141.845000,100
2019-10-14 13:43:52.225004032,2019-10-14 13:43:52.224985627,855733,T,IEX,141.885000,1
2019-10-14 13:43:58.60270080,2019-10-14 13:43:58.60253492,860961,T,IEX,141.885000,100
2019-10-14 13:43:59.775842048,2019-10-14 13:43:59.775825378,862485,T,IEX,141.890000,100
2019-10-14 13:44:13.789966080,2019-10-14 13:44:13.789946172,878152,T,IEX,141.755000,100
2019-10-14 13:44:24.717914112,2019-10-14 13:44:24.717894752,887780,T,IEX,141.910000,100
2019-10-14 13:45:31.369224960,2019-10-14 13:45:31.369209001,952670,T,IEX,141.820000,1
2019-10-14 13:45:38.638501120,2019-10-14 13:45:38.638481724,962441,T,IEX,141.850000,100
2019-10-14 13:48:02.988495872,2019-10-14 13:48:02.988479578,1093187,T,IEX,141.775000,1
2019-10-14 13:48:05.410836992,2019-10-14 13:48:05.410818095,1095121,T,IEX,141.870000,100
2019-10-14 13:48:17.614084096,2019-10-14 13:48:17.614065893,1106203,T,IEX,141.830000,1
2019-10-14 13:49:01.384198912,2019-10-14 13:49:01.384181005,1140114,T,IEX,141.880000,100
2019-10-14 13:49:01.384538112,2019-10-14 13:49:01.384513465,1140132,T,IEX,141.880000,17
2019-10-14 13:49:01.384566016,2019-10-14 13:49:01.384548828,1140134,T,IEX,141.860000,83
2019-10-14 13:49:01.384849920,2019-10-14 13:49:01.384832234,1140148,T,IEX,141.860000,100
2019-10-14 13:49:07.540452096,2019-10-14 13:49:07.540434529,1144397,T,IEX,141.870000,28
2019-10-14 13:49:07.940143104,2019-10-14 13:49:07.940125428,1145030,T,IEX,141.870000,22
2019-10-14 13:49:07.940166912,2019-10-14 13:49:07.940151347,1145031,T,IEX,141.860000,37
2019-10-14 13:49:11.194775040,2019-10-14 13:49:11.194757209,1147680,T,IEX,141.890000,10
2019-10-14 13:50:09.219288064,2019-10-14 13:50:09.219268372,1195869,T,IEX,142.105000,100
2019-10-14 13:50:16.650288128,2019-10-14 13:50:16.650266502,1202092,T,IEX,142.195000,1
2019-10-14 13:51:50.673135104,2019-10-14 13:51:50.673117987,1281062,T,IEX,141.940000,50
2019-10-14 13:51:53.441121024,2019-10-14 13:51:53.441098837,1282915,T,IEX,142.010000,100
2019-10-14 13:53:48.320813056,2019-10-14 13:53:48.320793299,1385871,T,IEX,141.960000,100
2019-10-14 13:53:50.995852032,2019-10-14 13:53:50.995834064,1388119,T,IEX,141.995000,1
2019-10-14 13:53:50.995883008,2019-10-14 13:53:50.995866061,1388120,T,IEX,141.995000,100
2019-10-14 13:55:18.824174080,2019-10-14 13:55:18.824155818,1473784,T,IEX,142.155000,100
2019-10-14 13:55:44.480588032,2019-10-14 13:55:44.480569798,1499492,T,IEX,142.140000,100
2019-10-14 13:56:03.143212032,2019-10-14 13:56:03.143194443,1517576,T,IEX,142.095000,100
2019-10-14 13:56:16.759915008,2019-10-14 13:56:16.759894073,1531605,T,IEX,142.180000,30
2019-10-14 13:56:16.760344064,2019-10-14 13:56:16.760324910,1531628,T,IEX,142.180000,70
2019-10-14 13:56:42.285590016,2019-10-14 13:56:42.285570129,1556190,T,IEX,142.180000,24
2019-10-14 13:57:28.141040128,2019-10-14 13:57:28.141023112,1594891,T,IEX,142.075000,101
2019-10-14 13:59:19.755688960,2019-10-14 13:59:19.755672859,1686637,T,IEX,142.000000,100
2019-10-14 13:59:20.819360000,2019-10-14 13:59:20.819342589,1687716,T,IEX,142.000000,100
2019-10-14 14:00:06.164954880,2019-10-14 14:00:06.164934875,1716378,T,IEX,142.140000,1
2019-10-14 14:00:08.828570112,2019-10-14 14:00:08.828550524,1717441,T,IEX,142.165000,100
2019-10-14 14:00:57.928521984,2019-10-14 14:00:57.928504412,1756268,T,IEX,142.195000,121
2019-10-14 14:02:31.801869056,2019-10-14 14:02:31.801853210,1837438,T,IEX,142.060000,100
2019-10-14 14:03:03.840867072,2019-10-14 14:03:03.840848882,1858213,T,IEX,142.020000,100
2019-10-14 14:03:27.94635008,2019-10-14 14:03:27.94616028,1872708,T,IEX,142.045000,100
2019-10-14 14:04:08.325122048,2019-10-14 14:04:08.324750571,1910630,T,IEX,142.035000,100
2019-10-14 14:04:36.365657088,2019-10-14 14:04:36.365639851,1931705,T,IEX,142.070000,100
2019-10-14 14:04:47.64312064,2019-10-14 14:04:47.64294459,1938591,T,IEX,142.075000,100
2019-10-14 14:06:02.639480064,2019-10-14 14:06:02.639441322,1988786,T,IEX,141.960000,100
2019-10-14 14:07:51.935006976,2019-10-14 14:07:51.934986293,2075048,T,IEX,142.060000,100
2019-10-14 14:07:58.912136960,2019-10-14 14:07:58.912119249,2079019,T,IEX,142.060000,100
2019-10-14 14:09:10.730906112,2019-10-14 14:09:10.730889121,2144169,T,IEX,142.100000,200
2019-10-14 14:09:25.777517056,2019-10-14 14:09:25.777499490,2156358,T,IEX,142.105000,1
2019-10-14 14:09:40.769081088,2019-10-14 14:09:40.769063106,2165944,T,IEX,142.100000,1
2019-10-14 14:09:46.287963904,2019-10-14 14:09:46.287943586,2171673,T,IEX,142.070000,50
2019-10-14 14:09:56.468875008,2019-10-14 14:09:56.468852219,2180116,T,IEX,142.075000,1
2019-10-14 14:10:03.603821056,2019-10-14 14:10:03.603802437,2187907,T,IEX,142.025000,1
2019-10-14 14:10:04.587923968,2019-10-14 14:10:04.587903396,2189040,T,IEX,142.015000,1
2019-10-14 14:10:06.652471040,2019-10-14 14:10:06.652449879,2191068,T,IEX,142.000000,1
2019-10-14 14:10:12.485152000,2019-10-14 14:10:12.485131777,2194356,T,IEX,141.990000,1
2019-10-14 14:10:23.671587072,2019-10-14 14:10:23.671568135,2202759,T,IEX,142.010000,1
2019-10-14 14:10:30.72675072,2019-10-14 14:10:30.72653818,2207505,T,IEX,141.980000,1
2019-10-14 14:10:37.276233984,2019-10-14 14:10:37.276214792,2211858,T,IEX,141.960000,3
2019-10-14 14:10:40.275145984,2019-10-14 14:10:40.275130684,2213885,T,IEX,141.950000,1
2019-10-14 14:10:40.283067904,2019-10-14 14:10:40.283047568,2213888,T,IEX,141.950000,2
2019-10-14 14:10:52.320116992,2019-10-14 14:10:52.320099673,2222655,T,IEX,141.920000,1
2019-10-14 14:10:52.378850048,2019-10-14 14:10:52.378832956,2222671,T,IEX,141.920000,1
2019-10-14 14:11:16.478817024,2019-10-14 14:11:16.478795263,2240513,T,IEX,141.925000,1
2019-10-14 14:11:16.486505984,2019-10-14 14:11:16.486484235,2240515,T,IEX,141.925000,5
2019-10-14 14:11:22.578818048,2019-10-14 14:11:22.578796717,2244811,T,IEX,141.890000,1
2019-10-14 14:11:25.578811904,2019-10-14 14:11:25.578794317,2246897,T,IEX,141.880000,1
2019-10-14 14:11:30.706265088,2019-10-14 14:11:30.706243803,2249589,T,IEX,141.880000,44
2019-10-14 14:11:36.677911040,2019-10-14 14:11:36.677891606,2253010,T,IEX,141.900000,1
2019-10-14 14:11:50.481300992,2019-10-14 14:11:50.481283586,2261296,T,IEX,141.885000,1
2019-10-14 14:12:01.338862080,2019-10-14 14:12:01.338842948,2268144,T,IEX,141.885000,1
2019-10-14 14:12:06.842961920,2019-10-14 14:12:06.842942527,2271548,T,IEX,141.860000,100
2019-10-14 14:12:18.3816960,2019-10-14 14:12:18.3798802,2278709,T,IEX,141.865000,1
2019-10-14 14:12:19.214525952,2019-10-14 14:12:19.214511067,2279594,T,IEX,141.855000,78
2019-10-14 14:13:04.303874048,2019-10-14 14:13:04.303856070,2304718,T,IEX,141.860000,1
2019-10-14 14:13:04.312087040,2019-10-14 14:13:04.312066365,2304722,T,IEX,141.860000,2
2019-10-14 14:13:15.210665984,2019-10-14 14:13:15.210645131,2309504,T,IEX,141.890000,1
2019-10-14 14:13:15.522490112,2019-10-14 14:13:15.522470646,2309624,T,IEX,141.890000,99
2019-10-14 14:13:18.80332032,2019-10-14 14:13:18.80313950,2310798,T,IEX,141.920000,1
2019-10-14 14:13:23.857285888,2019-10-14 14:13:23.857265548,2313467,T,IEX,141.915000,1
2019-10-14 14:13:32.13671936,2019-10-14 14:13:32.13656072,2317472,T,IEX,141.920000,100
2019-10-14 14:13:35.65206016,2019-10-14 14:13:35.65184893,2319328,T,IEX,141.905000,1
2019-10-14 14:14:30.904076032,2019-10-14 14:14:30.904054913,2352919,T,IEX,142.020000,100
2019-10-14 14:14:30.911876096,2019-10-14 14:14:30.911857807,2352923,T,IEX,142.020000,100
2019-10-14 14:14:38.811779072,2019-10-14 14:14:38.811760371,2357375,T,IEX,142.010000,100
2019-10-14 14:14:56.222423040,2019-10-14 14:14:56.222397604,2370340,T,IEX,141.960000,100
2019-10-14 14:15:02.479048960,2019-10-14 14:15:02.479029558,2378041,T,IEX,141.950000,17
2019-10-14 14:15:02.479066112,2019-10-14 14:15:02.479049546,2378042,T,IEX,141.950000,17
2019-10-14 14:15:57.291547904,2019-10-14 14:15:57.291527992,2413462,T,IEX,141.950000,100
2019-10-14 14:18:24.23554048,2019-10-14 14:18:24.23533283,2513428,T,IEX,141.920000,1
2019-10-14 14:19:04.387033088,2019-10-14 14:19:04.387013403,2540413,T,IEX,141.880000,2
2019-10-14 14:19:04.479954944,2019-10-14 14:19:04.479934251,2540464,T,IEX,141.880000,4
2019-10-14 14:19:05.555728896,2019-10-14 14:19:05.555708762,2541600,T,IEX,141.865000,85
2019-10-14 14:19:29.920715008,2019-10-14 14:19:29.920694174,2559737,T,IEX,141.900000,100
2019-10-14 14:19:53.885968896,2019-10-14 14:19:53.885948602,2571681,T,IEX,141.955000,1
2019-10-14 14:20:00.91033088,2019-10-14 14:20:00.91015575,2574766,T,IEX,141.930000,100
2019-10-14 14:20:00.601498880,2019-10-14 14:20:00.601482426,2575394,T,IEX,141.890000,5
2019-10-14 14:20:00.601615872,2019-10-14 14:20:00.601599208,2575396,T,IEX,141.890000,100
2019-10-14 14:20:01.204967936,2019-10-14 14:20:01.204947328,2575882,T,IEX,141.870000,1
2019-10-14 14:20:02.25806080,2019-10-14 14:20:02.25786220,2576444,T,IEX,141.875000,1
2019-10-14 14:20:22.25816064,2019-10-14 14:20:22.25795364,2587960,T,IEX,141.835000,1
2019-10-14 14:20:22.173554944,2019-10-14 14:20:22.173535756,2588023,T,IEX,141.840000,10
2019-10-14 14:20:32.306983936,2019-10-14 14:20:32.306964275,2594212,T,IEX,141.815000,1
2019-10-14 14:21:07.640901888,2019-10-14 14:21:07.640880595,2616721,T,IEX,141.850000,1
2019-10-14 14:21:42.442245888,2019-10-14 14:21:42.442225635,2637539,T,IEX,141.900000,1
2019-10-14 14:21:45.175104000,2019-10-14 14:21:45.175085727,2639727,T,IEX,141.905000,100
2019-10-14 14:22:02.226255104,2019-10-14 14:22:02.226235159,2650532,T,IEX,141.870000,1
2019-10-14 14:22:39.579148032,2019-10-14 14:22:39.579125303,2669554,T,IEX,141.850000,1
2019-10-14 14:23:06.131753984,2019-10-14 14:23:06.131736196,2683426,T,IEX,141.870000,100
2019-10-14 14:23:06.251917056,2019-10-14 14:23:06.251899048,2683525,T,IEX,141.875000,1
2019-10-14 14:23:43.173801984,2019-10-14 14:23:43.173779716,2703027,T,IEX,141.870000,1
2019-10-14 14:23:49.736310016,2019-10-14 14:23:49.736293330,2705908,T,IEX,141.855000,1
2019-10-14 14:24:11.584915968,2019-10-14 14:24:11.584895086,2722545,T,IEX,141.795000,1
2019-10-14 14:24:45.193570048,2019-10-14 14:24:45.193554341,2746243,T,IEX,141.775000,1
2019-10-14 14:24:45.193590016,2019-10-14 14:24:45.193574126,2746244,T,IEX,141.775000,100
2019-10-14 14:24:51.798341888,2019-10-14 14:24:51.798326157,2749889,T,IEX,141.730000,2
2019-10-14 14:24:51.806185984,2019-10-14 14:24:51.806166077,2749892,T,IEX,141.730000,2
2019-10-14 14:24:51.954258944,2019-10-14 14:24:51.954237511,2749970,T,IEX,141.730000,1
2019-10-14 14:24:54.978945024,2019-10-14 14:24:54.978922383,2752313,T,IEX,141.715000,110
2019-10-14 14:24:54.980556032,2019-10-14 14:24:54.980537898,2752314,T,IEX,141.720000,100
2019-10-14 14:25:47.558871040,2019-10-14 14:25:47.558851019,2787714,T,IEX,141.750000,1
2019-10-14 14:25:51.522440960,2019-10-14 14:25:51.522426155,2791713,T,IEX,141.740000,1
2019-10-14 14:27:24.452370944,2019-10-14 14:27:24.452350725,2860440,T,IEX,141.740000,2
2019-10-14 14:27:24.452382976,2019-10-14 14:27:24.452366873,2860441,T,IEX,141.740000,100
2019-10-14 14:27:51.260737024,2019-10-14 14:27:51.260715454,2875414,T,IEX,141.790000,4
2019-10-14 14:27:52.258959104,2019-10-14 14:27:52.258941527,2876031,T,IEX,141.790000,1
2019-10-14 14:29:51.127200000,2019-10-14 14:29:51.127182509,2939717,T,IEX,141.730000,2
2019-10-14 14:29:51.168571904,2019-10-14 14:29:51.168549836,2939755,T,IEX,141.720000,1
2019-10-14 14:30:00.541935104,2019-10-14 14:30:00.541916757,2947032,T,IEX,141.710000,100
2019-10-14 14:30:19.511043072,2019-10-14 14:30:19.511024130,2959516,T,IEX,141.695000,1
2019-10-14 14:30:19.518905088,2019-10-14 14:30:19.518884355,2959519,T,IEX,141.695000,1
2019-10-14 14:30:21.693970944,2019-10-14 14:30:21.693953705,2960205,T,IEX,141.695000,1
2019-10-14 14:30:43.694582016,2019-10-14 14:30:43.694562194,2978844,T,IEX,141.720000,1
2019-10-14 14:30:46.11159040,2019-10-14 14:30:46.11142380,2980718,T,IEX,141.710000,100
2019-10-14 14:31:09.48781056,2019-10-14 14:31:09.48765020,2997840,T,IEX,141.720000,1
2019-10-14 14:31:25.456485120,2019-10-14 14:31:25.456465454,3007203,T,IEX,141.740000,1
2019-10-14 14:31:25.473481984,2019-10-14 14:31:25.473461493,3007220,T,IEX,141.740000,5
2019-10-14 14:31:32.711052032,2019-10-14 14:31:32.711030313,3011429,T,IEX,141.705000,1
2019-10-14 14:31:46.107653120,2019-10-14 14:31:46.107631866,3019882,T,IEX,141.710000,1
2019-10-14 14:32:02.693820928,2019-10-14 14:32:02.693802164,3032570,T,IEX,141.670000,1
2019-10-14 14:32:02.693886976,2019-10-14 14:32:02.693870400,3032572,T,IEX,141.670000,100
2019-10-14 14:32:02.702234112,2019-10-14 14:32:02.702211967,3032581,T,IEX,141.670000,3
2019-10-14 14:32:13.539582976,2019-10-14 14:32:13.539562952,3040443,T,IEX,141.675000,1
2019-10-14 14:32:20.311165952,2019-10-14 14:32:20.311148500,3044322,T,IEX,141.655000,1
2019-10-14 14:32:30.17548032,2019-10-14 14:32:30.17531952,3051057,T,IEX,141.655000,700
2019-10-14 14:32:30.22443008,2019-10-14 14:32:30.22422376,3051062,T,IEX,141.655000,1
2019-10-14 14:32:58.360367104,2019-10-14 14:32:58.360348028,3068065,T,IEX,141.690000,1
2019-10-14 14:32:58.442518016,2019-10-14 14:32:58.442497908,3068092,T,IEX,141.685000,1
2019-10-14 14:32:59.64942080,2019-10-14 14:32:59.64922516,3069209,T,IEX,141.685000,33
2019-10-14 14:33:33.396122112,2019-10-14 14:33:33.396103101,3092358,T,IEX,141.630000,1
2019-10-14 14:33:45.342669056,2019-10-14 14:33:45.342650399,3101025,T,IEX,141.645000,1
2019-10-14 14:33:47.310228992,2019-10-14 14:33:47.310207253,3102021,T,IEX,141.645000,99
2019-10-14 14:34:25.583951104,2019-10-14 14:34:25.583932187,3125530,T,IEX,141.665000,1
2019-10-14 14:34:25.845078016,2019-10-14 14:34:25.845058785,3126105,T,IEX,141.640000,1
2019-10-14 14:35:01.821750016,2019-10-14 14:35:01.821732210,3148781,T,IEX,141.670000,1
2019-10-14 14:35:01.846343936,2019-10-14 14:35:01.846322064,3149123,T,IEX,141.680000,100
2019-10-14 14:35:04.646383104,2019-10-14 14:35:04.646360640,3152487,T,IEX,141.695000,2
2019-10-14 14:35:09.483450880,2019-10-14 14:35:09.483431215,3156178,T,IEX,141.740000,1
2019-10-14 14:36:15.952078080,2019-10-14 14:36:15.952060166,3196678,T,IEX,141.735000,1
2019-10-14 14:36:17.160332032,2019-10-14 14:36:17.160313519,3198427,T,IEX,141.730000,3
2019-10-14 14:36:30.349597952,2019-10-14 14:36:30.349577553,3208334,T,IEX,141.700000,1
2019-10-14 14:36:43.119525888,2019-10-14 14:36:43.119508992,3215931,T,IEX,141.670000,1
2019-10-14 14:37:07.155226880,2019-10-14 14:37:07.155208892,3230049,T,IEX,141.670000,1
2019-10-14 14:37:08.244456960,2019-10-14 14:37:08.244440524,3230733,T,IEX,141.670000,100
2019-10-14 14:37:09.243008000,2019-10-14 14:37:09.242990189,3231360,T,IEX,141.665000,1
2019-10-14 14:38:07.242993920,2019-10-14 14:38:07.242976332,3266491,T,IEX,141.670000,1
2019-10-14 14:38:07.251271936,2019-10-14 14:38:07.251252653,3266495,T,IEX,141.670000,1
2019-10-14 14:38:24.505848064,2019-10-14 14:38:24.505830695,3274418,T,IEX,141.630000,1
2019-10-14 14:38:29.160322048,2019-10-14 14:38:29.160304135,3276213,T,IEX,141.630000,1
2019-10-14 14:38:32.662952960,2019-10-14 14:38:32.662932067,3279358,T,IEX,141.650000,100
2019-10-14 14:38:42.110412032,2019-10-14 14:38:42.110391756,3284654,T,IEX,141.635000,100
2019-10-14 14:38:43.142905088,2019-10-14 14:38:43.142888490,3285179,T,IEX,141.635000,1
2019-10-14 14:39:04.433065984,2019-10-14 14:39:04.433045198,3297914,T,IEX,141.660000,100
2019-10-14 14:39:24.567855104,2019-10-14 14:39:24.567835330,3310998,T,IEX,141.665000,1
2019-10-14 14:39:39.498859008,2019-10-14 14:39:39.498839310,3319438,T,IEX,141.710000,1
2019-10-14 14:39:40.608355072,2019-10-14 14:39:40.608335667,3319831,T,IEX,141.710000,1
2019-10-14 14:39:49.1434880,2019-10-14 14:39:49.1415518,3324620,T,IEX,141.685000,600
2019-10-14 14:39:49.3785984,2019-10-14 14:39:49.3768044,3324621,T,IEX,141.685000,700
2019-10-14 14:39:49.5505024,2019-10-14 14:39:49.5485605,3324624,T,IEX,141.685000,700
2019-10-14 14:39:49.7348992,2019-10-14 14:39:49.7330398,3324626,T,IEX,141.685000,600
2019-10-14 14:39:49.9160960,2019-10-14 14:39:49.9139987,3324627,T,IEX,141.685000,400
2019-10-14 14:39:49.10899968,2019-10-14 14:39:49.10879104,3324628,T,IEX,141.685000,400
2019-10-14 14:39:49.13115904,2019-10-14 14:39:49.13095583,3324629,T,IEX,141.685000,400
2019-10-14 14:39:51.402174976,2019-10-14 14:39:51.402152360,3327336,T,IEX,141.700000,800
2019-10-14 14:39:57.343090944,2019-10-14 14:39:57.343072381,3331665,T,IEX,141.705000,1
2019-10-14 14:39:57.350176000,2019-10-14 14:39:57.350154815,3331667,T,IEX,141.705000,7
2019-10-14 14:40:09.3420928,2019-10-14 14:40:09.3403697,3342414,T,IEX,141.730000,1
2019-10-14 14:40:26.760485888,2019-10-14 14:40:26.760471057,3355707,T,IEX,141.730000,1
2019-10-14 14:40:26.769127936,2019-10-14 14:40:26.769108031,3355713,T,IEX,141.730000,1
2019-10-14 14:40:27.625328896,2019-10-14 14:40:27.625311121,3356579,T,IEX,141.730000,1
2019-10-14 14:40:33.551826944,2019-10-14 14:40:33.551806703,3360679,T,IEX,141.740000,36
2019-10-14 14:40:41.303618048,2019-10-14 14:40:41.303597987,3368384,T,IEX,141.740000,1
2019-10-14 14:40:41.318340096,2019-10-14 14:40:41.318324389,3368391,T,IEX,141.740000,1
2019-10-14 14:40:42.866579968,2019-10-14 14:40:42.866558662,3369383,T,IEX,141.730000,100
2019-10-14 14:40:49.62351104,2019-10-14 14:40:49.62329848,3372642,T,IEX,141.735000,1
2019-10-14 14:41:01.280590080,2019-10-14 14:41:01.280572189,3378714,T,IEX,141.710000,400
2019-10-14 14:41:24.622341120,2019-10-14 14:41:24.622323289,3390197,T,IEX,141.740000,1
2019-10-14 14:41:55.541149952,2019-10-14 14:41:55.541127530,3404138,T,IEX,141.740000,3
2019-10-14 14:42:00.583785984,2019-10-14 14:42:00.583768281,3406770,T,IEX,141.750000,1
2019-10-14 14:42:02.205287936,2019-10-14 14:42:02.205272013,3407667,T,IEX,141.750000,100
2019-10-14 14:42:10.833027072,2019-10-14 14:42:10.833008262,3416977,T,IEX,141.840000,1
2019-10-14 14:42:10.843140096,2019-10-14 14:42:10.843121984,3417277,T,IEX,141.840000,1
2019-10-14 14:42:24.651092992,2019-10-14 14:42:24.651073314,3431171,T,IEX,141.755000,1
2019-10-14 14:42:32.343139072,2019-10-14 14:42:32.343117883,3436221,T,IEX,141.750000,100
2019-10-14 14:42:32.343154944,2019-10-14 14:42:32.343137925,3436222,T,IEX,141.750000,1
2019-10-14 14:43:35.161161984,2019-10-14 14:43:35.161142215,3466604,T,IEX,141.790000,1
2019-10-14 14:44:39.167224064,2019-10-14 14:44:39.167203038,3497456,T,IEX,141.850000,1
2019-10-14 14:44:46.41346048,2019-10-14 14:44:46.41327426,3502305,T,IEX,141.890000,100
2019-10-14 14:44:46.158326016,2019-10-14 14:44:46.158308332,3502332,T,IEX,141.870000,100
2019-10-14 14:44:47.767185920,2019-10-14 14:44:47.767168772,3502900,T,IEX,141.870000,100
2019-10-14 14:45:24.703030016,2019-10-14 14:45:24.703012143,3523252,T,IEX,141.865000,1
2019-10-14 14:46:20.244439040,2019-10-14 14:46:20.244423503,3563102,T,IEX,141.875000,1
2019-10-14 14:46:20.263685120,2019-10-14 14:46:20.263669788,3563129,T,IEX,141.875000,1
2019-10-14 14:46:20.860016128,2019-10-14 14:46:20.859996512,3563376,T,IEX,141.875000,10
2019-10-14 14:46:43.941850112,2019-10-14 14:46:43.941830563,3576823,T,IEX,141.840000,1
2019-10-14 14:46:46.597497088,2019-10-14 14:46:46.597478833,3578351,T,IEX,141.810000,4
2019-10-14 14:46:49.938471936,2019-10-14 14:46:49.938453265,3580891,T,IEX,141.800000,1
2019-10-14 14:47:03.243287040,2019-10-14 14:47:03.243271950,3590550,T,IEX,141.790000,1
2019-10-14 14:47:41.539034880,2019-10-14 14:47:41.539016736,3610362,T,IEX,141.790000,1
2019-10-14 14:48:16.818525952,2019-10-14 14:48:16.818504413,3627176,T,IEX,141.740000,100
2019-10-14 14:48:24.694312960,2019-10-14 14:48:24.694294174,3632364,T,IEX,141.735000,1
2019-10-14 14:49:12.399160064,2019-10-14 14:49:12.399138995,3655238,T,IEX,141.745000,1
2019-10-14 14:49:13.398703104,2019-10-14 14:49:13.398680943,3655590,T,IEX,141.745000,1
2019-10-14 14:49:33.228634880,2019-10-14 14:49:33.228613765,3662049,T,IEX,141.715000,1
2019-10-14 14:50:00.195524096,2019-10-14 14:50:00.195505872,3673632,T,IEX,141.730000,1
2019-10-14 14:50:10.507520000,2019-10-14 14:50:10.507500490,3679432,T,IEX,141.760000,1
2019-10-14 14:51:23.244271104,2019-10-14 14:51:23.244251922,3713601,T,IEX,141.765000,1
2019-10-14 14:51:24.289501952,2019-10-14 14:51:24.289482501,3714128,T,IEX,141.765000,1
2019-10-14 14:51:49.44295936,2019-10-14 14:51:49.44273868,3725649,T,IEX,141.770000,100
2019-10-14 14:52:24.112399104,2019-10-14 14:52:24.112380302,3745717,T,IEX,141.790000,2
2019-10-14 14:52:33.244733952,2019-10-14 14:52:33.244716408,3750168,T,IEX,141.800000,1
2019-10-14 14:52:40.689859072,2019-10-14 14:52:40.689839816,3753756,T,IEX,141.770000,100
2019-10-14 14:52:46.635926016,2019-10-14 14:52:46.635902548,3755691,T,IEX,141.770000,1
2019-10-14 14:52:47.661548032,2019-10-14 14:52:47.661529056,3756546,T,IEX,141.750000,100
2019-10-14 14:52:54.213271040,2019-10-14 14:52:54.213250552,3760475,T,IEX,141.735000,1
2019-10-14 14:52:56.799735040,2019-10-14 14:52:56.799715810,3761856,T,IEX,141.725000,1
2019-10-14 14:53:16.398661120,2019-10-14 14:53:16.398642475,3773286,T,IEX,141.785000,1
2019-10-14 14:53:24.841006080,2019-10-14 14:53:24.840985698,3777465,T,IEX,141.770000,1
2019-10-14 14:53:25.437722112,2019-10-14 14:53:25.437701181,3778537,T,IEX,141.750000,83
2019-10-14 14:53:31.610003968,2019-10-14 14:53:31.609985738,3781262,T,IEX,141.755000,100
2019-10-14 14:53:39.499136000,2019-10-14 14:53:39.499114611,3784461,T,IEX,141.755000,1
2019-10-14 14:54:24.847355904,2019-10-14 14:54:24.847336623,3806242,T,IEX,141.725000,1
2019-10-14 14:54:24.862959104,2019-10-14 14:54:24.862939750,3806253,T,IEX,141.710000,1
2019-10-14 14:54:59.831671040,2019-10-14 14:54:59.831651320,3822113,T,IEX,141.750000,1
2019-10-14 14:55:12.218360064,2019-10-14 14:55:12.218341107,3829341,T,IEX,141.745000,1
2019-10-14 14:55:24.927133952,2019-10-14 14:55:24.927116020,3836717,T,IEX,141.785000,1
2019-10-14 14:55:30.518408960,2019-10-14 14:55:30.518391770,3840522,T,IEX,141.780000,1
2019-10-14 14:55:49.957648896,2019-10-14 14:55:49.957628928,3849661,T,IEX,141.750000,100
2019-10-14 14:55:49.957666048,2019-10-14 14:55:49.957649070,3849662,T,IEX,141.750000,100
2019-10-14 14:55:49.958799104,2019-10-14 14:55:49.958778865,3849663,T,IEX,141.750000,100
2019-10-14 14:55:54.927648000,2019-10-14 14:55:54.927625849,3851760,T,IEX,141.735000,1
2019-10-14 14:56:14.44775936,2019-10-14 14:56:14.44757447,3861343,T,IEX,141.750000,1
2019-10-14 14:56:21.714330112,2019-10-14 14:56:21.714309931,3864849,T,IEX,141.720000,100
2019-10-14 14:56:26.594493952,2019-10-14 14:56:26.594473774,3866972,T,IEX,141.680000,100
2019-10-14 14:56:26.595691008,2019-10-14 14:56:26.595671205,3866973,T,IEX,141.680000,100
2019-10-14 14:56:26.644837120,2019-10-14 14:56:26.644817890,3866991,T,IEX,141.695000,100
2019-10-14 14:56:26.644854016,2019-10-14 14:56:26.644837297,3866992,T,IEX,141.695000,2
2019-10-14 14:56:27.144738048,2019-10-14 14:56:27.144719429,3867196,T,IEX,141.695000,1
2019-10-14 14:56:29.528230912,2019-10-14 14:56:29.528212528,3868019,T,IEX,141.665000,1
2019-10-14 14:56:29.541315072,2019-10-14 14:56:29.541295848,3868024,T,IEX,141.660000,100
2019-10-14 14:56:29.625961984,2019-10-14 14:56:29.625941813,3868088,T,IEX,141.670000,1
2019-10-14 14:56:56.615609088,2019-10-14 14:56:56.615590979,3878801,T,IEX,141.680000,100
2019-10-14 14:56:56.615628032,2019-10-14 14:56:56.615611264,3878802,T,IEX,141.680000,100
2019-10-14 14:56:57.596499968,2019-10-14 14:56:57.596480666,3879185,T,IEX,141.695000,1
2019-10-14 14:57:01.163440896,2019-10-14 14:57:01.163426135,3880463,T,IEX,141.695000,2
2019-10-14 14:57:01.344753920,2019-10-14 14:57:01.344735244,3880580,T,IEX,141.695000,1
2019-10-14 14:57:02.781233920,2019-10-14 14:57:02.781215041,3881303,T,IEX,141.695000,105
2019-10-14 14:57:02.783555072,2019-10-14 14:57:02.783535907,3881304,T,IEX,141.695000,95
2019-10-14 14:57:07.920165888,2019-10-14 14:57:07.920145577,3883320,T,IEX,141.660000,100
2019-10-14 14:57:09.63547904,2019-10-14 14:57:09.63526080,3883838,T,IEX,141.655000,1
2019-10-14 14:57:15.224953088,2019-10-14 14:57:15.224936185,3885664,T,IEX,141.650000,100
2019-10-14 14:57:15.224972032,2019-10-14 14:57:15.224955687,3885665,T,IEX,141.650000,100
2019-10-14 14:57:24.954411008,2019-10-14 14:57:24.954390065,3889812,T,IEX,141.620000,1
2019-10-14 14:57:43.6728960,2019-10-14 14:57:43.6708664,3900034,T,IEX,141.645000,1
2019-10-14 14:57:43.44743936,2019-10-14 14:57:43.44722755,3900045,T,IEX,141.645000,2
2019-10-14 14:57:59.263457024,2019-10-14 14:57:59.263438492,3907309,T,IEX,141.630000,1
2019-10-14 14:58:06.676646912,2019-10-14 14:58:06.676629130,3912120,T,IEX,141.620000,100
2019-10-14 14:58:24.989207040,2019-10-14 14:58:24.989189881,3922065,T,IEX,141.635000,1
2019-10-14 14:58:46.863525888,2019-10-14 14:58:46.863510126,3937234,T,IEX,141.670000,3
2019-10-14 14:58:59.63499008,2019-10-14 14:58:59.63481491,3947180,T,IEX,141.680000,2
2019-10-14 14:58:59.71282944,2019-10-14 14:58:59.71262498,3947188,T,IEX,141.680000,3
2019-10-14 14:59:25.77150976,2019-10-14 14:59:25.77130520,3963529,T,IEX,141.700000,1
2019-10-14 14:59:44.363589888,2019-10-14 14:59:44.363572116,3973935,T,IEX,141.695000,1
2019-10-14 14:59:49.729945088,2019-10-14 14:59:49.729926302,3976647,T,IEX,141.700000,1
2019-10-14 14:59:55.663682048,2019-10-14 14:59:55.663661609,3980165,T,IEX,141.685000,1
2019-10-14 15:00:00.63670016,2019-10-14 15:00:00.63649371,3982923,T,IEX,141.665000,1
2019-10-14 15:00:22.7632896,2019-10-14 15:00:22.7611306,3995390,T,IEX,141.660000,1
2019-10-14 15:00:26.444901120,2019-10-14 15:00:26.444881166,3998881,T,IEX,141.630000,100
2019-10-14 15:00:26.683578880,2019-10-14 15:00:26.683561635,3998952,T,IEX,141.620000,100
2019-10-14 15:00:29.976547072,2019-10-14 15:00:29.976525636,4001311,T,IEX,141.635000,1
2019-10-14 15:00:30.62729984,2019-10-14 15:00:30.62711902,4001958,T,IEX,141.645000,2
2019-10-14 15:00:30.994365952,2019-10-14 15:00:30.994350015,4002726,T,IEX,141.650000,1
2019-10-14 15:00:53.148965888,2019-10-14 15:00:53.148946913,4021265,T,IEX,141.635000,1
2019-10-14 15:00:56.910951936,2019-10-14 15:00:56.910931033,4023657,T,IEX,141.635000,2
2019-10-14 15:00:58.274310912,2019-10-14 15:00:58.274289428,4024314,T,IEX,141.615000,1
2019-10-14 15:01:05.766759936,2019-10-14 15:01:05.766741890,4031105,T,IEX,141.630000,1
2019-10-14 15:01:05.808538880,2019-10-14 15:01:05.808518164,4031166,T,IEX,141.625000,22
2019-10-14 15:01:08.732430080,2019-10-14 15:01:08.732408905,4032763,T,IEX,141.625000,1
2019-10-14 15:01:13.27131904,2019-10-14 15:01:13.27117136,4035350,T,IEX,141.590000,1
2019-10-14 15:01:13.639064064,2019-10-14 15:01:13.639046377,4035739,T,IEX,141.580000,1
2019-10-14 15:01:13.648660992,2019-10-14 15:01:13.648639961,4035748,T,IEX,141.580000,2
2019-10-14 15:01:18.756392960,2019-10-14 15:01:18.756372049,4040044,T,IEX,141.610000,1
2019-10-14 15:01:18.762419968,2019-10-14 15:01:18.762400132,4040047,T,IEX,141.610000,68
2019-10-14 15:01:27.817085952,2019-10-14 15:01:27.817066650,4045212,T,IEX,141.625000,1
2019-10-14 15:01:43.251141120,2019-10-14 15:01:43.251121730,4053821,T,IEX,141.590000,1
2019-10-14 15:02:25.210720000,2019-10-14 15:02:25.210699007,4078331,T,IEX,141.605000,1
2019-10-14 15:02:25.495096064,2019-10-14 15:02:25.495076850,4078506,T,IEX,141.585000,2
2019-10-14 15:02:36.89517056,2019-10-14 15:02:36.89496400,4086379,T,IEX,141.570000,1
2019-10-14 15:03:11.905472000,2019-10-14 15:03:11.905453274,4108662,T,IEX,141.555000,100
2019-10-14 15:03:25.219512064,2019-10-14 15:03:25.219490666,4115113,T,IEX,141.550000,1
2019-10-14 15:03:27.546798080,2019-10-14 15:03:27.546777878,4116109,T,IEX,141.535000,4
2019-10-14 15:04:00.374728960,2019-10-14 15:04:00.374710571,4136837,T,IEX,141.510000,1
2019-10-14 15:04:00.379255040,2019-10-14 15:04:00.379239408,4136852,T,IEX,141.500000,100
2019-10-14 15:04:12.298234112,2019-10-14 15:04:12.298213439,4143616,T,IEX,141.525000,2
2019-10-14 15:04:12.383934976,2019-10-14 15:04:12.383917132,4143656,T,IEX,141.525000,2
2019-10-14 15:04:24.484047104,2019-10-14 15:04:24.484026703,4148526,T,IEX,141.505000,1
2019-10-14 15:04:35.750638080,2019-10-14 15:04:35.750616970,4159517,T,IEX,141.440000,1
2019-10-14 15:04:39.483982080,2019-10-14 15:04:39.483962419,4163820,T,IEX,141.460000,1
2019-10-14 15:04:54.186117888,2019-10-14 15:04:54.186096830,4171322,T,IEX,141.460000,1
2019-10-14 15:05:58.732304896,2019-10-14 15:05:58.732285452,4207223,T,IEX,141.385000,1
2019-10-14 15:05:59.732376064,2019-10-14 15:05:59.732353854,4207768,T,IEX,141.385000,2
2019-10-14 15:06:19.624909056,2019-10-14 15:06:19.624888301,4221264,T,IEX,141.455000,1
2019-10-14 15:07:24.361516032,2019-10-14 15:07:24.361500570,4249267,T,IEX,141.430000,1
2019-10-14 15:07:26.732375040,2019-10-14 15:07:26.732356275,4250182,T,IEX,141.430000,1
2019-10-14 15:07:34.654176000,2019-10-14 15:07:34.654157406,4253820,T,IEX,141.430000,100
2019-10-14 15:07:34.659102976,2019-10-14 15:07:34.659083946,4253822,T,IEX,141.430000,1
2019-10-14 15:07:42.32538112,2019-10-14 15:07:42.32519393,4256987,T,IEX,141.420000,1
2019-10-14 15:08:25.425659904,2019-10-14 15:08:25.425637574,4276137,T,IEX,141.400000,1
2019-10-14 15:08:25.553833984,2019-10-14 15:08:25.553812494,4276291,T,IEX,141.395000,100
2019-10-14 15:08:58.705388032,2019-10-14 15:08:58.705370214,4290204,T,IEX,141.435000,100
2019-10-14 15:09:08.781063936,2019-10-14 15:09:08.781044102,4297587,T,IEX,141.460000,2
2019-10-14 15:09:09.136221952,2019-10-14 15:09:09.136205528,4297715,T,IEX,141.460000,1
2019-10-14 15:09:12.938424064,2019-10-14 15:09:12.938403718,4300465,T,IEX,141.485000,100
2019-10-14 15:09:19.130742016,2019-10-14 15:09:19.130723536,4303630,T,IEX,141.505000,12
2019-10-14 15:09:32.50829056,2019-10-14 15:09:32.50808451,4309739,T,IEX,141.495000,1
2019-10-14 15:09:47.346363904,2019-10-14 15:09:47.346347051,4317871,T,IEX,141.515000,1
2019-10-14 15:09:47.346381056,2019-10-14 15:09:47.346364542,4317872,T,IEX,141.515000,15
2019-10-14 15:09:56.435363072,2019-10-14 15:09:56.435340801,4323161,T,IEX,141.490000,1
2019-10-14 15:10:24.659053056,2019-10-14 15:10:24.659035435,4337242,T,IEX,141.505000,100
2019-10-14 15:10:26.127693056,2019-10-14 15:10:26.127671880,4337850,T,IEX,141.505000,1
2019-10-14 15:11:02.914962944,2019-10-14 15:11:02.914945679,4357321,T,IEX,141.520000,1
2019-10-14 15:11:11.396455936,2019-10-14 15:11:11.396437925,4362674,T,IEX,141.495000,1
2019-10-14 15:11:17.796235008,2019-10-14 15:11:17.796216144,4367318,T,IEX,141.505000,2
2019-10-14 15:11:26.696274944,2019-10-14 15:11:26.696254282,4372577,T,IEX,141.480000,1
2019-10-14 15:11:59.501806080,2019-10-14 15:11:59.501785946,4389602,T,IEX,141.500000,1
2019-10-14 15:12:19.158488064,2019-10-14 15:12:19.158472588,4398195,T,IEX,141.500000,1
2019-10-14 15:12:25.196229120,2019-10-14 15:12:25.196208628,4400678,T,IEX,141.475000,1
2019-10-14 15:12:29.96249088,2019-10-14 15:12:29.96229131,4402329,T,IEX,141.470000,100
2019-10-14 15:12:39.274720000,2019-10-14 15:12:39.274700910,4406718,T,IEX,141.435000,1
2019-10-14 15:12:57.332656896,2019-10-14 15:12:57.332640040,4416531,T,IEX,141.505000,31
2019-10-14 15:12:58.430500096,2019-10-14 15:12:58.430478409,4417701,T,IEX,141.505000,1
2019-10-14 15:13:07.9707008,2019-10-14 15:13:07.9690976,4423515,T,IEX,141.525000,1
2019-10-14 15:13:07.16962048,2019-10-14 15:13:07.16942560,4423520,T,IEX,141.525000,1
2019-10-14 15:14:25.236771072,2019-10-14 15:14:25.236753945,4458072,T,IEX,141.600000,1
2019-10-14 15:14:56.537324032,2019-10-14 15:14:56.537302658,4488180,T,IEX,141.670000,1
2019-10-14 15:15:26.553512960,2019-10-14 15:15:26.553492551,4506263,T,IEX,141.655000,6
2019-10-14 15:15:47.302832896,2019-10-14 15:15:47.302814721,4516363,T,IEX,141.620000,100
2019-10-14 15:15:47.302857984,2019-10-14 15:15:47.302841176,4516364,T,IEX,141.620000,200
2019-10-14 15:15:47.302874880,2019-10-14 15:15:47.302860378,4516365,T,IEX,141.620000,100
2019-10-14 15:15:47.446176000,2019-10-14 15:15:47.446155299,4516408,T,IEX,141.645000,2
2019-10-14 15:15:56.306481920,2019-10-14 15:15:56.306463368,4521167,T,IEX,141.645000,2
2019-10-14 15:15:56.332134912,2019-10-14 15:15:56.332117056,4521200,T,IEX,141.610000,100
2019-10-14 15:15:56.332146944,2019-10-14 15:15:56.332130180,4521201,T,IEX,141.610000,100
2019-10-14 15:15:56.336940032,2019-10-14 15:15:56.336920192,4521210,T,IEX,141.630000,2
2019-10-14 15:15:57.371755008,2019-10-14 15:15:57.371735639,4522044,T,IEX,141.600000,100
2019-10-14 15:15:57.392281088,2019-10-14 15:15:57.392260046,4522050,T,IEX,141.600000,100
2019-10-14 15:16:05.510483968,2019-10-14 15:16:05.510463139,4525157,T,IEX,141.620000,50
2019-10-14 15:16:10.961466880,2019-10-14 15:16:10.961446589,4527778,T,IEX,141.590000,100
2019-10-14 15:16:16.480115968,2019-10-14 15:16:16.480097125,4530951,T,IEX,141.570000,100
2019-10-14 15:16:16.480162048,2019-10-14 15:16:16.480144853,4530952,T,IEX,141.570000,100
2019-10-14 15:16:16.480210944,2019-10-14 15:16:16.480194682,4530953,T,IEX,141.570000,100
2019-10-14 15:16:19.196464896,2019-10-14 15:16:19.196449968,4531733,T,IEX,141.570000,1
2019-10-14 15:16:26.515460096,2019-10-14 15:16:26.515442751,4534221,T,IEX,141.555000,1
2019-10-14 15:16:31.828087040,2019-10-14 15:16:31.828068090,4537199,T,IEX,141.520000,50
2019-10-14 15:16:32.961306112,2019-10-14 15:16:32.961290508,4537793,T,IEX,141.525000,1
2019-10-14 15:16:33.847821056,2019-10-14 15:16:33.847798182,4538005,T,IEX,141.525000,1
2019-10-14 15:17:05.861145088,2019-10-14 15:17:05.861125293,4550259,T,IEX,141.535000,40
2019-10-14 15:17:07.115627008,2019-10-14 15:17:07.115606781,4551503,T,IEX,141.545000,1
2019-10-14 15:17:15.322585088,2019-10-14 15:17:15.322559098,4556800,T,IEX,141.560000,1
2019-10-14 15:17:15.395130112,2019-10-14 15:17:15.395111024,4556848,T,IEX,141.550000,1
2019-10-14 15:17:19.14418944,2019-10-14 15:17:19.14399804,4558942,T,IEX,141.520000,100
2019-10-14 15:17:19.14436096,2019-10-14 15:17:19.14419120,4558943,T,IEX,141.520000,100
2019-10-14 15:17:19.14456064,2019-10-14 15:17:19.14439015,4558944,T,IEX,141.520000,100
2019-10-14 15:17:20.590054912,2019-10-14 15:17:20.590033681,4559797,T,IEX,141.510000,100
2019-10-14 15:17:25.312147968,2019-10-14 15:17:25.312131058,4561628,T,IEX,141.510000,1
2019-10-14 15:17:25.496567040,2019-10-14 15:17:25.496546631,4561665,T,IEX,141.510000,1
2019-10-14 15:17:30.506032896,2019-10-14 15:17:30.506013416,4563440,T,IEX,141.510000,1
2019-10-14 15:17:35.596532992,2019-10-14 15:17:35.596515184,4566189,T,IEX,141.505000,1
2019-10-14 15:17:37.558895104,2019-10-14 15:17:37.558875382,4567054,T,IEX,141.520000,100
2019-10-14 15:17:46.364408064,2019-10-14 15:17:46.364386508,4572294,T,IEX,141.500000,100
2019-10-14 15:17:52.296500992,2019-10-14 15:17:52.296482125,4576110,T,IEX,141.500000,1
2019-10-14 15:17:55.196542976,2019-10-14 15:17:55.196523515,4577837,T,IEX,141.495000,1
2019-10-14 15:18:03.636977920,2019-10-14 15:18:03.636960861,4582414,T,IEX,141.500000,1
2019-10-14 15:18:03.656788992,2019-10-14 15:18:03.656769134,4582422,T,IEX,141.470000,100
2019-10-14 15:18:04.661908992,2019-10-14 15:18:04.661891781,4582818,T,IEX,141.495000,1
2019-10-14 15:18:12.838363904,2019-10-14 15:18:12.838349281,4586697,T,IEX,141.510000,46
2019-10-14 15:18:14.496745984,2019-10-14 15:18:14.496728190,4587527,T,IEX,141.500000,1
2019-10-14 15:18:26.127625984,2019-10-14 15:18:26.127607944,4591979,T,IEX,141.490000,1
2019-10-14 15:18:37.267650048,2019-10-14 15:18:37.267631154,4596210,T,IEX,141.485000,1
2019-10-14 15:18:40.655952896,2019-10-14 15:18:40.655935443,4598612,T,IEX,141.465000,1
2019-10-14 15:19:01.350505984,2019-10-14 15:19:01.350489732,4607623,T,IEX,141.495000,1
2019-10-14 15:19:01.823972096,2019-10-14 15:19:01.823954558,4607889,T,IEX,141.495000,1
2019-10-14 15:19:25.385989120,2019-10-14 15:19:25.385969377,4618086,T,IEX,141.485000,1
2019-10-14 15:19:25.897001984,2019-10-14 15:19:25.896980857,4618294,T,IEX,141.470000,38
2019-10-14 15:19:28.397534976,2019-10-14 15:19:28.397519366,4619163,T,IEX,141.475000,1
2019-10-14 15:19:31.693990912,2019-10-14 15:19:31.693971201,4620550,T,IEX,141.470000,33
2019-10-14 15:19:46.390226944,2019-10-14 15:19:46.390210188,4625825,T,IEX,141.480000,1
2019-10-14 15:19:59.197735936,2019-10-14 15:19:59.197715283,4630888,T,IEX,141.465000,1
2019-10-14 15:20:33.237748992,2019-10-14 15:20:33.237728757,4646109,T,IEX,141.450000,87
2019-10-14 15:20:34.659798016,2019-10-14 15:20:34.659780460,4646857,T,IEX,141.435000,1
2019-10-14 15:20:34.671070976,2019-10-14 15:20:34.671049021,4646860,T,IEX,141.430000,58
2019-10-14 15:20:37.274020096,2019-10-14 15:20:37.273999999,4647489,T,IEX,141.420000,42
2019-10-14 15:20:38.71112960,2019-10-14 15:20:38.71096120,4647718,T,IEX,141.390000,100
2019-10-14 15:20:38.71127040,2019-10-14 15:20:38.71112341,4647719,T,IEX,141.390000,1
2019-10-14 15:20:53.871169024,2019-10-14 15:20:53.871149411,4656146,T,IEX,141.415000,100
2019-10-14 15:20:53.872465920,2019-10-14 15:20:53.872445928,4656147,T,IEX,141.410000,1
2019-10-14 15:21:07.472084992,2019-10-14 15:21:07.472066311,4661189,T,IEX,141.425000,100
2019-10-14 15:21:07.474739968,2019-10-14 15:21:07.474721264,4661190,T,IEX,141.420000,1
2019-10-14 15:21:07.737671936,2019-10-14 15:21:07.737652685,4661299,T,IEX,141.425000,1
2019-10-14 15:21:07.878393088,2019-10-14 15:21:07.878374068,4661333,T,IEX,141.420000,1
2019-10-14 15:21:25.833611008,2019-10-14 15:21:25.833592478,4672646,T,IEX,141.385000,100
2019-10-14 15:21:32.241913088,2019-10-14 15:21:32.241889778,4676698,T,IEX,141.395000,1
2019-10-14 15:21:33.241979904,2019-10-14 15:21:33.241962650,4677677,T,IEX,141.395000,1
2019-10-14 15:21:34.95354880,2019-10-14 15:21:34.95332549,4677997,T,IEX,141.390000,1
2019-10-14 15:21:34.117171968,2019-10-14 15:21:34.117154270,4678003,T,IEX,141.370000,100
2019-10-14 15:21:39.828925952,2019-10-14 15:21:39.828907721,4680960,T,IEX,141.385000,1
2019-10-14 15:24:21.255300096,2019-10-14 15:24:21.255282482,4762140,T,IEX,141.500000,100
2019-10-14 15:26:41.367444992,2019-10-14 15:26:41.367428677,4829964,T,IEX,141.390000,1
2019-10-14 15:27:25.557694976,2019-10-14 15:27:25.557674230,4858287,T,IEX,141.365000,100
2019-10-14 15:28:13.555397888,2019-10-14 15:28:13.555378972,4886096,T,IEX,141.385000,200
2019-10-14 15:28:38.358341888,2019-10-14 15:28:38.358321731,4901001,T,IEX,141.370000,8
2019-10-14 15:28:41.627235072,2019-10-14 15:28:41.627215636,4903660,T,IEX,141.340000,100
2019-10-14 15:29:13.567484928,2019-10-14 15:29:13.567465503,4919070,T,IEX,141.330000,100
2019-10-14 15:29:37.201908992,2019-10-14 15:29:37.201891281,4929346,T,IEX,141.370000,100
2019-10-14 15:30:36.792704000,2019-10-14 15:30:36.792685807,4966769,T,IEX,141.380000,100
2019-10-14 15:33:02.61026048,2019-10-14 15:33:02.61008655,5034365,T,IEX,141.570000,1
2019-10-14 15:33:05.65882112,2019-10-14 15:33:05.65865214,5035384,T,IEX,141.580000,1
2019-10-14 15:33:08.728083968,2019-10-14 15:33:08.728062363,5036263,T,IEX,141.575000,1
2019-10-14 15:33:25.767906048,2019-10-14 15:33:25.767886719,5042275,T,IEX,141.610000,1
2019-10-14 15:33:31.461243904,2019-10-14 15:33:31.461226332,5043990,T,IEX,141.610000,1
2019-10-14 15:33:45.99933952,2019-10-14 15:33:45.99906322,5050636,T,IEX,141.650000,1
2019-10-14 15:34:09.268343040,2019-10-14 15:34:09.268320566,5060642,T,IEX,141.635000,1
2019-10-14 15:34:25.946755072,2019-10-14 15:34:25.946738172,5068727,T,IEX,141.625000,1
2019-10-14 15:34:47.942110976,2019-10-14 15:34:47.942090167,5077270,T,IEX,141.585000,1
2019-10-14 15:34:47.952293888,2019-10-14 15:34:47.952277960,5077274,T,IEX,141.585000,1
2019-10-14 15:35:11.244056064,2019-10-14 15:35:11.244035455,5089736,T,IEX,141.585000,1
2019-10-14 15:35:11.252209920,2019-10-14 15:35:11.252189520,5089737,T,IEX,141.585000,5
2019-10-14 15:35:24.281682944,2019-10-14 15:35:24.281663772,5096478,T,IEX,141.580000,1
2019-10-14 15:35:25.806560000,2019-10-14 15:35:25.806542715,5097346,T,IEX,141.580000,1
2019-10-14 15:35:37.980121088,2019-10-14 15:35:37.980100004,5102039,T,IEX,141.560000,1
2019-10-14 15:36:06.29850880,2019-10-14 15:36:06.29834860,5113851,T,IEX,141.540000,1
2019-10-14 15:36:12.415602944,2019-10-14 15:36:12.415583088,5116108,T,IEX,141.560000,100
2019-10-14 15:36:17.946594048,2019-10-14 15:36:17.946572575,5118305,T,IEX,141.575000,1
2019-10-14 15:36:41.101184000,2019-10-14 15:36:41.101163219,5125072,T,IEX,141.580000,1
2019-10-14 15:37:08.355468032,2019-10-14 15:37:08.355449488,5134986,T,IEX,141.580000,1
2019-10-14 15:37:08.363351040,2019-10-14 15:37:08.363334889,5134990,T,IEX,141.580000,1
2019-10-14 15:37:18.174144000,2019-10-14 15:37:18.174125152,5138129,T,IEX,141.595000,1
2019-10-14 15:37:28.362832896,2019-10-14 15:37:28.362817348,5140874,T,IEX,141.600000,1
2019-10-14 15:37:42.752476928,2019-10-14 15:37:42.752456435,5147207,T,IEX,141.680000,1
2019-10-14 15:37:42.761008128,2019-10-14 15:37:42.760988511,5147208,T,IEX,141.680000,1
2019-10-14 15:37:59.476348928,2019-10-14 15:37:59.476328458,5153070,T,IEX,141.690000,3
2019-10-14 15:38:14.82465024,2019-10-14 15:38:14.82445505,5160645,T,IEX,141.620000,100
2019-10-14 15:38:20.850624000,2019-10-14 15:38:20.850604737,5164116,T,IEX,141.615000,1
2019-10-14 15:38:20.858563072,2019-10-14 15:38:20.858541228,5164119,T,IEX,141.615000,2
2019-10-14 15:38:41.623409920,2019-10-14 15:38:41.623394860,5171775,T,IEX,141.605000,2
2019-10-14 15:38:42.623546880,2019-10-14 15:38:42.623529490,5171987,T,IEX,141.605000,2
2019-10-14 15:38:42.750979072,2019-10-14 15:38:42.750960508,5172343,T,IEX,141.605000,1
2019-10-14 15:39:03.51872000,2019-10-14 15:39:03.51850578,5181709,T,IEX,141.635000,1
2019-10-14 15:39:09.692239872,2019-10-14 15:39:09.692220336,5184145,T,IEX,141.645000,100
2019-10-14 15:39:17.518413056,2019-10-14 15:39:17.518393221,5186625,T,IEX,141.670000,1
2019-10-14 15:39:19.648993024,2019-10-14 15:39:19.648972808,5187189,T,IEX,141.660000,1
2019-10-14 15:39:19.675699968,2019-10-14 15:39:19.675678788,5187193,T,IEX,141.660000,99
2019-10-14 15:40:05.731740928,2019-10-14 15:40:05.731723255,5204727,T,IEX,141.645000,100
2019-10-14 15:40:25.495618048,2019-10-14 15:40:25.495600111,5213401,T,IEX,141.700000,1
2019-10-14 15:40:29.346127872,2019-10-14 15:40:29.346109835,5215062,T,IEX,141.700000,1
2019-10-14 15:40:42.472744960,2019-10-14 15:40:42.472726527,5223320,T,IEX,141.645000,200
2019-10-14 15:41:25.539224064,2019-10-14 15:41:25.539207568,5241276,T,IEX,141.700000,1
2019-10-14 15:41:25.673940992,2019-10-14 15:41:25.673921279,5241329,T,IEX,141.690000,5
2019-10-14 15:41:37.958342912,2019-10-14 15:41:37.958327347,5246971,T,IEX,141.680000,1
2019-10-14 15:41:58.307971072,2019-10-14 15:41:58.307951574,5254971,T,IEX,141.685000,100
2019-10-14 15:42:31.482548992,2019-10-14 15:42:31.482530916,5269213,T,IEX,141.710000,1
2019-10-14 15:42:31.489777920,2019-10-14 15:42:31.489757598,5269214,T,IEX,141.710000,6
2019-10-14 15:42:50.881946880,2019-10-14 15:42:50.881925781,5276307,T,IEX,141.790000,100
2019-10-14 15:43:06.793762048,2019-10-14 15:43:06.793743393,5281578,T,IEX,141.790000,100
2019-10-14 15:43:22.441073920,2019-10-14 15:43:22.441053730,5286825,T,IEX,141.830000,50
2019-10-14 15:43:26.572684032,2019-10-14 15:43:26.572668096,5288351,T,IEX,141.805000,1
2019-10-14 15:43:36.638166016,2019-10-14 15:43:36.638148800,5293397,T,IEX,141.750000,3
2019-10-14 15:43:55.94561024,2019-10-14 15:43:55.94540650,5302385,T,IEX,141.735000,1
2019-10-14 15:44:19.84477952,2019-10-14 15:44:19.84463354,5313272,T,IEX,141.720000,16
2019-10-14 15:44:25.653669120,2019-10-14 15:44:25.653646669,5315674,T,IEX,141.775000,1
2019-10-14 15:44:45.175138048,2019-10-14 15:44:45.175120384,5322237,T,IEX,141.760000,100
2019-10-14 15:44:52.229573888,2019-10-14 15:44:52.229556030,5324713,T,IEX,141.730000,1
2019-10-14 15:44:55.251112960,2019-10-14 15:44:55.251094120,5326412,T,IEX,141.740000,100
2019-10-14 15:45:05.256816896,2019-10-14 15:45:05.256796996,5331843,T,IEX,141.730000,91
2019-10-14 15:45:15.843748096,2019-10-14 15:45:15.843728183,5336110,T,IEX,141.740000,1
2019-10-14 15:46:25.746189056,2019-10-14 15:46:25.746169898,5360531,T,IEX,141.810000,100
2019-10-14 15:46:36.725556992,2019-10-14 15:46:36.725537464,5364916,T,IEX,141.810000,10
2019-10-14 15:47:25.723727104,2019-10-14 15:47:25.723711713,5381089,T,IEX,141.830000,6
2019-10-14 15:47:31.87991040,2019-10-14 15:47:31.87972243,5383026,T,IEX,141.810000,1
2019-10-14 15:48:15.564581120,2019-10-14 15:48:15.564559691,5398254,T,IEX,141.790000,100
2019-10-14 15:49:50.851580928,2019-10-14 15:49:50.851564876,5432029,T,IEX,141.760000,31
2019-10-14 15:50:21.878884096,2019-10-14 15:50:21.878868883,5439793,T,IEX,141.770000,100
2019-10-14 15:50:56.4730880,2019-10-14 15:50:56.4713546,5449540,T,IEX,141.750000,100
2019-10-14 15:52:26.928823040,2019-10-14 15:52:26.928803442,5482030,T,IEX,141.750000,100
2019-10-14 15:53:31.714206976,2019-10-14 15:53:31.714190005,5504567,T,IEX,141.810000,100
2019-10-14 15:56:16.210049024,2019-10-14 15:56:16.210028870,5567670,T,IEX,141.695000,100
2019-10-14 15:58:20.204899072,2019-10-14 15:58:20.204879086,5606213,T,IEX,141.735000,100
2019-10-14 15:59:38.73582080,2019-10-14 15:59:38.73566255,5639380,T,IEX,141.670000,200
2019-10-14 16:01:42.15297024,2019-10-14 16:01:42.15275099,5690812,T,IEX,141.650000,100
2019-10-14 16:04:05.283011072,2019-10-14 16:04:05.282989140,5749454,T,IEX,141.570000,7
2019-10-14 16:04:05.298019072,2019-10-14 16:04:05.297999799,5749460,T,IEX,141.570000,5
2019-10-14 16:04:48.697678080,2019-10-14 16:04:48.697659910,5769010,T,IEX,141.550000,300
2019-10-14 16:04:48.730181888,2019-10-14 16:04:48.730164851,5769114,T,IEX,141.550000,100
2019-10-14 16:04:50.483038976,2019-10-14 16:04:50.483022068,5770181,T,IEX,141.560000,12
2019-10-14 16:04:52.907874048,2019-10-14 16:04:52.907856799,5770955,T,IEX,141.560000,1
2019-10-14 16:06:39.412292096,2019-10-14 16:06:39.412273071,5815766,T,IEX,141.585000,150
2019-10-14 16:07:46.897114112,2019-10-14 16:07:46.897093534,5842027,T,IEX,141.570000,11
2019-10-14 16:07:46.897764096,2019-10-14 16:07:46.897746417,5842045,T,IEX,141.570000,164
2019-10-14 16:07:46.912557056,2019-10-14 16:07:46.912541283,5842242,T,IEX,141.580000,100
2019-10-14 16:07:47.909096960,2019-10-14 16:07:47.909077202,5842761,T,IEX,141.580000,100
2019-10-14 16:08:08.462870016,2019-10-14 16:08:08.462852268,5849803,T,IEX,141.585000,100
2019-10-14 16:08:08.464444928,2019-10-14 16:08:08.464425907,5849805,T,IEX,141.585000,200
2019-10-14 16:08:40.924101120,2019-10-14 16:08:40.924083318,5858762,T,IEX,141.590000,33
2019-10-14 16:08:41.113274112,2019-10-14 16:08:41.113253779,5858852,T,IEX,141.590000,200
2019-10-14 16:11:52.551310080,2019-10-14 16:11:52.551290109,5923404,T,IEX,141.560000,100
2019-10-14 16:13:35.882542080,2019-10-14 16:13:35.882522712,5957173,T,IEX,141.590000,100
2019-10-14 16:14:06.482490112,2019-10-14 16:14:06.482470628,5973607,T,IEX,141.640000,101
2019-10-14 16:14:38.285588992,2019-10-14 16:14:38.285569845,5983620,T,IEX,141.650000,100
2019-10-14 16:14:46.217995008,2019-10-14 16:14:46.217975019,5987473,T,IEX,141.650000,100
2019-10-14 16:18:40.483229952,2019-10-14 16:18:40.483214471,6060638,T,IEX,141.730000,200
2019-10-14 16:19:45.436770048,2019-10-14 16:19:45.436751902,6078790,T,IEX,141.820000,43
2019-10-14 16:20:28.528791040,2019-10-14 16:20:28.528771383,6097351,T,IEX,141.770000,100
2019-10-14 16:20:35.3964928,2019-10-14 16:20:35.3944096,6102870,T,IEX,141.735000,100
2019-10-14 16:20:35.4008960,2019-10-14 16:20:35.3991390,6102871,T,IEX,141.735000,100
2019-10-14 16:20:35.4058880,2019-10-14 16:20:35.4041709,6102872,T,IEX,141.735000,100
2019-10-14 16:20:38.348197120,2019-10-14 16:20:38.348178476,6107379,T,IEX,141.720000,100
2019-10-14 16:20:38.348237056,2019-10-14 16:20:38.348221459,6107380,T,IEX,141.720000,100
2019-10-14 16:20:38.348286976,2019-10-14 16:20:38.348270778,6107382,T,IEX,141.720000,100
2019-10-14 16:21:04.108413952,2019-10-14 16:21:04.108394946,6128592,T,IEX,141.740000,100
2019-10-14 16:21:04.108431104,2019-10-14 16:21:04.108413817,6128593,T,IEX,141.740000,100
2019-10-14 16:21:04.108452096,2019-10-14 16:21:04.108433855,6128594,T,IEX,141.740000,100
2019-10-14 16:21:04.541819904,2019-10-14 16:21:04.541802674,6131230,T,IEX,141.700000,100
2019-10-14 16:21:55.473641984,2019-10-14 16:21:55.473621588,6161940,T,IEX,141.740000,800
2019-10-14 16:23:50.24867072,2019-10-14 16:23:50.24848073,6207589,T,IEX,141.880000,100
2019-10-14 16:23:50.25562112,2019-10-14 16:23:50.25545917,6207590,T,IEX,141.880000,100
2019-10-14 16:24:21.782263040,2019-10-14 16:24:21.782243045,6219233,T,IEX,141.860000,100
2019-10-14 16:24:21.782310912,2019-10-14 16:24:21.782294611,6219234,T,IEX,141.860000,100
2019-10-14 16:24:21.782363904,2019-10-14 16:24:21.782347360,6219235,T,IEX,141.860000,100
2019-10-14 16:24:47.927508992,2019-10-14 16:24:47.927492897,6226877,T,IEX,141.890000,100
2019-10-14 16:24:59.480079872,2019-10-14 16:24:59.480060445,6229571,T,IEX,141.890000,100
2019-10-14 16:25:08.474827008,2019-10-14 16:25:08.474805127,6235189,T,IEX,141.845000,100
2019-10-14 16:25:08.474868992,2019-10-14 16:25:08.474852229,6235190,T,IEX,141.845000,100
2019-10-14 16:25:49.8337920,2019-10-14 16:25:49.8318194,6248233,T,IEX,141.805000,100
2019-10-14 16:26:50.726812928,2019-10-14 16:26:50.726794109,6272809,T,IEX,141.800000,100
2019-10-14 16:26:50.726836992,2019-10-14 16:26:50.726818699,6272810,T,IEX,141.800000,100
2019-10-14 16:27:13.978501888,2019-10-14 16:27:13.978481825,6284165,T,IEX,141.750000,100
2019-10-14 16:30:02.542956032,2019-10-14 16:30:02.542938108,6343199,T,IEX,141.715000,200
2019-10-14 16:30:12.569392128,2019-10-14 16:30:12.569371877,6346957,T,IEX,141.755000,200
2019-10-14 16:31:17.999649024,2019-10-14 16:31:17.999628796,6368740,T,IEX,141.780000,2400
2019-10-14 16:31:18.1581056,2019-10-14 16:31:18.1562315,6368741,T,IEX,141.780000,2600
2019-10-14 16:31:27.1483008,2019-10-14 16:31:27.1464731,6376258,T,IEX,141.780000,99
2019-10-14 16:31:27.1495040,2019-10-14 16:31:27.1477733,6376259,T,IEX,141.780000,47
2019-10-14 16:32:41.821953024,2019-10-14 16:32:41.821931393,6401775,T,IEX,141.760000,100
2019-10-14 16:32:41.821974016,2019-10-14 16:32:41.821957564,6401776,T,IEX,141.760000,100
2019-10-14 16:32:44.191729920,2019-10-14 16:32:44.191709220,6402460,T,IEX,141.750000,53
2019-10-14 16:32:44.409920000,2019-10-14 16:32:44.409898918,6402504,T,IEX,141.750000,17
2019-10-14 16:32:51.972349952,2019-10-14 16:32:51.972327298,6403865,T,IEX,141.740000,100
2019-10-14 16:32:53.609602048,2019-10-14 16:32:53.609583860,6404346,T,IEX,141.740000,100
2019-10-14 16:33:41.272605952,2019-10-14 16:33:41.272588156,6417293,T,IEX,141.770000,39
2019-10-14 16:33:41.277537024,2019-10-14 16:33:41.277518563,6417295,T,IEX,141.765000,100
2019-10-14 16:34:17.771539968,2019-10-14 16:34:17.771520889,6427473,T,IEX,141.730000,100
2019-10-14 16:34:17.791130112,2019-10-14 16:34:17.791111943,6427477,T,IEX,141.720000,100
2019-10-14 16:34:28.728506880,2019-10-14 16:34:28.728487377,6430512,T,IEX,141.730000,83
2019-10-14 16:35:18.54763008,2019-10-14 16:35:18.54743763,6443378,T,IEX,141.760000,100
2019-10-14 16:35:49.217019904,2019-10-14 16:35:49.217000837,6451312,T,IEX,141.760000,100
2019-10-14 16:37:18.496108032,2019-10-14 16:37:18.496090838,6481181,T,IEX,141.820000,100
2019-10-14 16:38:44.302987008,2019-10-14 16:38:44.302965550,6509421,T,IEX,141.770000,55
2019-10-14 16:39:17.373110016,2019-10-14 16:39:17.373087662,6517342,T,IEX,141.790000,45
2019-10-14 16:39:17.373125120,2019-10-14 16:39:17.373107444,6517343,T,IEX,141.790000,55
2019-10-14 16:39:59.81509120,2019-10-14 16:39:59.81485118,6529414,T,IEX,141.765000,100
2019-10-14 16:40:07.669330944,2019-10-14 16:40:07.669310132,6531648,T,IEX,141.775000,100
2019-10-14 16:40:26.934532096,2019-10-14 16:40:26.934512806,6538233,T,IEX,141.750000,45
2019-10-14 16:41:50.426295040,2019-10-14 16:41:50.426272311,6567910,T,IEX,141.760000,100
2019-10-14 16:42:21.982839040,2019-10-14 16:42:21.982817883,6576806,T,IEX,141.760000,100
2019-10-14 16:42:29.851229952,2019-10-14 16:42:29.851211214,6578736,T,IEX,141.770000,100
2019-10-14 16:43:34.855942912,2019-10-14 16:43:34.855925084,6595141,T,IEX,141.770000,300
2019-10-14 16:44:45.771463936,2019-10-14 16:44:45.771448970,6614238,T,IEX,141.770000,100
2019-10-14 16:45:02.21167104,2019-10-14 16:45:02.21150459,6619447,T,IEX,141.755000,1
2019-10-14 16:45:03.329232896,2019-10-14 16:45:03.329214901,6620792,T,IEX,141.740000,4
2019-10-14 16:45:03.329281024,2019-10-14 16:45:03.329264816,6620793,T,IEX,141.740000,29
2019-10-14 16:45:14.404237056,2019-10-14 16:45:14.404214253,6628059,T,IEX,141.785000,100
2019-10-14 16:45:21.31971072,2019-10-14 16:45:21.31953668,6631111,T,IEX,141.785000,2
2019-10-14 16:45:31.319493888,2019-10-14 16:45:31.319474390,6634299,T,IEX,141.785000,100
2019-10-14 16:45:40.36616960,2019-10-14 16:45:40.36596969,6636501,T,IEX,141.785000,2
2019-10-14 16:46:00.56737024,2019-10-14 16:46:00.56713564,6641735,T,IEX,141.785000,2
2019-10-14 16:46:20.175981056,2019-10-14 16:46:20.175963575,6647493,T,IEX,141.780000,1
2019-10-14 16:46:30.65275904,2019-10-14 16:46:30.65256891,6649878,T,IEX,141.795000,1
2019-10-14 16:46:55.252361984,2019-10-14 16:46:55.252344176,6654131,T,IEX,141.815000,2
2019-10-14 16:47:00.940375040,2019-10-14 16:47:00.940355775,6655214,T,IEX,141.815000,1
2019-10-14 16:47:03.69007104,2019-10-14 16:47:03.68985727,6655683,T,IEX,141.820000,1
2019-10-14 16:47:03.69018880,2019-10-14 16:47:03.69001764,6655684,T,IEX,141.820000,100
2019-10-14 16:47:05.257694976,2019-10-14 16:47:05.257677872,6656270,T,IEX,141.820000,100
2019-10-14 16:47:05.257713920,2019-10-14 16:47:05.257697795,6656271,T,IEX,141.820000,100
2019-10-14 16:47:48.934565888,2019-10-14 16:47:48.934547057,6666743,T,IEX,141.850000,1
2019-10-14 16:47:57.202812928,2019-10-14 16:47:57.202792169,6669602,T,IEX,141.850000,100
2019-10-14 16:47:57.246308096,2019-10-14 16:47:57.246289090,6669674,T,IEX,141.860000,67
2019-10-14 16:48:22.6755072,2019-10-14 16:48:22.6734945,6677533,T,IEX,141.840000,1
2019-10-14 16:50:03.82936064,2019-10-14 16:50:03.82918217,6705159,T,IEX,141.850000,100
2019-10-14 16:50:08.771996928,2019-10-14 16:50:08.771979122,6707698,T,IEX,141.865000,1
2019-10-14 16:50:14.315143936,2019-10-14 16:50:14.315123489,6709524,T,IEX,141.865000,1
2019-10-14 16:50:22.713078016,2019-10-14 16:50:22.713058843,6712136,T,IEX,141.875000,2
2019-10-14 16:50:33.715609088,2019-10-14 16:50:33.715588656,6714887,T,IEX,141.875000,1
2019-10-14 16:50:52.386067968,2019-10-14 16:50:52.386048791,6720665,T,IEX,141.835000,2
2019-10-14 16:51:06.880590080,2019-10-14 16:51:06.880569483,6724676,T,IEX,141.845000,100
2019-10-14 16:51:13.306458112,2019-10-14 16:51:13.306438232,6726812,T,IEX,141.845000,1
2019-10-14 16:52:16.313783040,2019-10-14 16:52:16.313763164,6746071,T,IEX,141.845000,1
2019-10-14 16:52:35.177403904,2019-10-14 16:52:35.177383969,6751397,T,IEX,141.815000,4
2019-10-14 16:52:35.177414912,2019-10-14 16:52:35.177396969,6751398,T,IEX,141.815000,1
2019-10-14 16:52:35.177437952,2019-10-14 16:52:35.177421011,6751399,T,IEX,141.815000,1
2019-10-14 16:52:43.187621120,2019-10-14 16:52:43.187601176,6753889,T,IEX,141.815000,100
2019-10-14 16:52:55.190021120,2019-10-14 16:52:55.190001694,6756715,T,IEX,141.815000,1
2019-10-14 16:53:03.192723968,2019-10-14 16:53:03.192698097,6758525,T,IEX,141.815000,2
2019-10-14 16:53:23.176137984,2019-10-14 16:53:23.176119380,6764492,T,IEX,141.830000,1
2019-10-14 16:53:34.177894912,2019-10-14 16:53:34.177875744,6767935,T,IEX,141.825000,2
2019-10-14 16:53:54.181852928,2019-10-14 16:53:54.181831251,6773609,T,IEX,141.835000,1
2019-10-14 16:55:28.262100992,2019-10-14 16:55:28.262082084,6802974,T,IEX,141.830000,2
2019-10-14 16:57:11.186603008,2019-10-14 16:57:11.186582731,6837748,T,IEX,141.800000,100
2019-10-14 16:57:40.687944960,2019-10-14 16:57:40.687925375,6844710,T,IEX,141.820000,100
2019-10-14 16:59:03.937191936,2019-10-14 16:59:03.937174340,6872347,T,IEX,141.825000,100
2019-10-14 16:59:08.312800000,2019-10-14 16:59:08.312780435,6874271,T,IEX,141.825000,100
2019-10-14 17:01:26.418974976,2019-10-14 17:01:26.418955518,6922080,T,IEX,141.905000,100
2019-10-14 17:02:28.24349952,2019-10-14 17:02:28.24333948,6939249,T,IEX,141.940000,100
2019-10-14 17:03:45.80955904,2019-10-14 17:03:45.80935991,6958885,T,IEX,141.890000,100
2019-10-14 17:04:12.84068096,2019-10-14 17:04:12.84050656,6967376,T,IEX,141.905000,100
2019-10-14 17:04:12.84087040,2019-10-14 17:04:12.84070743,6967377,T,IEX,141.905000,100
2019-10-14 17:08:12.821858048,2019-10-14 17:08:12.821837802,7046532,T,IEX,141.975000,100
2019-10-14 17:10:16.442652928,2019-10-14 17:10:16.442633901,7082973,T,IEX,141.975000,100
2019-10-14 17:12:05.508594944,2019-10-14 17:12:05.508575955,7113683,T,IEX,141.965000,100
2019-10-14 17:12:32.819532032,2019-10-14 17:12:32.819515864,7119050,T,IEX,141.960000,100
2019-10-14 17:12:44.212186112,2019-10-14 17:12:44.212167140,7120966,T,IEX,141.965000,100
2019-10-14 17:13:08.859286016,2019-10-14 17:13:08.859270691,7127731,T,IEX,141.960000,1
2019-10-14 17:15:06.760542976,2019-10-14 17:15:06.760525585,7154770,T,IEX,141.945000,100
2019-10-14 17:20:12.30243072,2019-10-14 17:20:12.30224280,7245358,T,IEX,141.920000,100
2019-10-14 17:21:52.691219968,2019-10-14 17:21:52.691196957,7271007,T,IEX,141.960000,100
2019-10-14 17:22:18.110132992,2019-10-14 17:22:18.110111368,7279531,T,IEX,141.915000,100
2019-10-14 17:24:06.565556992,2019-10-14 17:24:06.565537159,7308723,T,IEX,141.920000,100
2019-10-14 17:24:42.111043072,2019-10-14 17:24:42.111023471,7319382,T,IEX,141.885000,100
2019-10-14 17:24:44.477630976,2019-10-14 17:24:44.477611199,7319861,T,IEX,141.885000,100
2019-10-14 17:25:04.156920064,2019-10-14 17:25:04.156902122,7325126,T,IEX,141.880000,100
2019-10-14 17:25:05.161946112,2019-10-14 17:25:05.161925510,7325341,T,IEX,141.880000,100
2019-10-14 17:25:56.688836096,2019-10-14 17:25:56.688818107,7337795,T,IEX,141.915000,100
2019-10-14 17:26:12.79653888,2019-10-14 17:26:12.79634140,7342945,T,IEX,141.920000,100
2019-10-14 17:26:12.84017920,2019-10-14 17:26:12.84000410,7342947,T,IEX,141.920000,100
2019-10-14 17:26:20.294669056,2019-10-14 17:26:20.294651360,7346739,T,IEX,141.920000,100
2019-10-14 17:26:21.127834112,2019-10-14 17:26:21.127816204,7347086,T,IEX,141.900000,200
2019-10-14 17:27:41.981015040,2019-10-14 17:27:41.980997416,7367537,T,IEX,141.900000,100
2019-10-14 17:27:43.704549120,2019-10-14 17:27:43.704533138,7368018,T,IEX,141.900000,100
2019-10-14 17:27:44.527553024,2019-10-14 17:27:44.527537878,7368757,T,IEX,141.910000,100
2019-10-14 17:28:01.801295872,2019-10-14 17:28:01.801275637,7374529,T,IEX,141.930000,100
2019-10-14 17:29:51.811650048,2019-10-14 17:29:51.811627949,7403595,T,IEX,141.935000,100
2019-10-14 17:30:16.126507008,2019-10-14 17:30:16.126491276,7412146,T,IEX,141.920000,100
2019-10-14 17:32:42.233507072,2019-10-14 17:32:42.233488477,7450535,T,IEX,141.890000,200
2019-10-14 17:32:52.908646912,2019-10-14 17:32:52.908632092,7453176,T,IEX,141.885000,100
2019-10-14 17:34:31.267280896,2019-10-14 17:34:31.267259998,7479889,T,IEX,141.890000,2
2019-10-14 17:34:56.179284992,2019-10-14 17:34:56.179269429,7486038,T,IEX,141.885000,100
2019-10-14 17:35:03.333974016,2019-10-14 17:35:03.333954713,7488731,T,IEX,141.905000,1
2019-10-14 17:35:03.554091008,2019-10-14 17:35:03.554070311,7488854,T,IEX,141.895000,200
2019-10-14 17:35:52.695984896,2019-10-14 17:35:52.695963152,7502087,T,IEX,141.850000,100
2019-10-14 17:35:55.381882112,2019-10-14 17:35:55.381863681,7502600,T,IEX,141.850000,1
2019-10-14 17:35:58.42334976,2019-10-14 17:35:58.42314576,7503098,T,IEX,141.850000,2
2019-10-14 17:36:02.311037952,2019-10-14 17:36:02.311019371,7504605,T,IEX,141.850000,2
2019-10-14 17:36:06.672185088,2019-10-14 17:36:06.672166519,7506385,T,IEX,141.845000,1
2019-10-14 17:36:10.544197120,2019-10-14 17:36:10.544180342,7509756,T,IEX,141.845000,1
2019-10-14 17:36:16.550895104,2019-10-14 17:36:16.550877431,7511523,T,IEX,141.860000,1
2019-10-14 17:36:20.551822080,2019-10-14 17:36:20.551801900,7512792,T,IEX,141.855000,2
2019-10-14 17:36:26.555004928,2019-10-14 17:36:26.554987835,7513950,T,IEX,141.855000,1
2019-10-14 17:36:30.555641088,2019-10-14 17:36:30.555621025,7514908,T,IEX,141.855000,1
2019-10-14 17:36:35.897655040,2019-10-14 17:36:35.897635004,7516099,T,IEX,141.855000,2
2019-10-14 17:36:41.401209088,2019-10-14 17:36:41.401188122,7517253,T,IEX,141.855000,300
2019-10-14 17:36:41.557692928,2019-10-14 17:36:41.557673631,7517276,T,IEX,141.855000,1
2019-10-14 17:36:45.558295040,2019-10-14 17:36:45.558277322,7518623,T,IEX,141.855000,1
2019-10-14 17:36:50.559165952,2019-10-14 17:36:50.559148468,7519995,T,IEX,141.855000,2
2019-10-14 17:36:55.560122880,2019-10-14 17:36:55.560104074,7521152,T,IEX,141.855000,1
2019-10-14 17:37:28.979942912,2019-10-14 17:37:28.979923739,7529450,T,IEX,141.820000,100
2019-10-14 17:37:28.979960064,2019-10-14 17:37:28.979943548,7529451,T,IEX,141.820000,100
2019-10-14 17:37:36.490988032,2019-10-14 17:37:36.490968645,7531817,T,IEX,141.800000,9
2019-10-14 17:38:30.243575040,2019-10-14 17:38:30.243559248,7548543,T,IEX,141.820000,1
2019-10-14 17:38:44.649972992,2019-10-14 17:38:44.649955245,7554849,T,IEX,141.830000,34
2019-10-14 17:39:06.110184960,2019-10-14 17:39:06.110165673,7560368,T,IEX,141.840000,100
2019-10-14 17:39:47.364363008,2019-10-14 17:39:47.364346810,7570410,T,IEX,141.840000,100
2019-10-14 17:41:11.729210112,2019-10-14 17:41:11.729189207,7591483,T,IEX,141.880000,100
2019-10-14 17:41:53.825713920,2019-10-14 17:41:53.825691990,7605157,T,IEX,141.925000,100
2019-10-14 17:43:04.350212096,2019-10-14 17:43:04.350193708,7633594,T,IEX,141.980000,149
2019-10-14 17:43:04.351032064,2019-10-14 17:43:04.351014925,7633630,T,IEX,141.980000,100
2019-10-14 17:43:04.405946112,2019-10-14 17:43:04.405926552,7634070,T,IEX,141.980000,40
2019-10-14 17:43:27.6818048,2019-10-14 17:43:27.6798097,7641438,T,IEX,141.990000,100
2019-10-14 17:43:54.110128896,2019-10-14 17:43:54.110111363,7648108,T,IEX,141.985000,100
2019-10-14 17:46:12.29062912,2019-10-14 17:46:12.29042823,7689908,T,IEX,141.940000,100
2019-10-14 17:46:58.276941056,2019-10-14 17:46:58.276919185,7701260,T,IEX,141.910000,100
2019-10-14 17:47:54.125467904,2019-10-14 17:47:54.125449889,7714307,T,IEX,141.930000,100
2019-10-14 17:49:00.75619072,2019-10-14 17:49:00.75601047,7730037,T,IEX,141.940000,100
2019-10-14 17:49:50.998594048,2019-10-14 17:49:50.998572483,7743772,T,IEX,141.960000,100
2019-10-14 17:50:23.153873920,2019-10-14 17:50:23.153851324,7752719,T,IEX,141.960000,100
2019-10-14 17:52:42.110184960,2019-10-14 17:52:42.110166491,7790596,T,IEX,141.930000,100
2019-10-14 17:53:09.156785920,2019-10-14 17:53:09.156766141,7797091,T,IEX,141.910000,16
2019-10-14 17:53:09.156797952,2019-10-14 17:53:09.156781832,7797092,T,IEX,141.910000,84
2019-10-14 17:54:19.330171904,2019-10-14 17:54:19.330149768,7818541,T,IEX,141.975000,100
2019-10-14 17:54:24.126119936,2019-10-14 17:54:24.126102683,7821215,T,IEX,142.000000,100
2019-10-14 17:54:46.861146112,2019-10-14 17:54:46.861129991,7834174,T,IEX,142.035000,100
2019-10-14 17:56:57.103407104,2019-10-14 17:56:57.103389638,7874823,T,IEX,142.100000,100
2019-10-14 17:59:06.110205952,2019-10-14 17:59:06.110187685,7910911,T,IEX,142.070000,100
2019-10-14 17:59:40.48263936,2019-10-14 17:59:40.48246010,7920461,T,IEX,142.100000,100
2019-10-14 18:00:11.702487040,2019-10-14 18:00:11.702467269,7932184,T,IEX,142.145000,100
2019-10-14 18:00:50.841244928,2019-10-14 18:00:50.841225872,7959245,T,IEX,142.130000,100
2019-10-14 18:02:06.64120064,2019-10-14 18:02:06.64101683,7992325,T,IEX,142.110000,100
2019-10-14 18:02:25.828347904,2019-10-14 18:02:25.828325138,7999368,T,IEX,142.095000,100
2019-10-14 18:04:53.620012032,2019-10-14 18:04:53.619991695,8038588,T,IEX,142.085000,100
2019-10-14 18:06:25.427674112,2019-10-14 18:06:25.427654353,8065596,T,IEX,142.110000,100
2019-10-14 18:06:28.984525056,2019-10-14 18:06:28.984502263,8066377,T,IEX,142.115000,11
2019-10-14 18:06:52.776866048,2019-10-14 18:06:52.776848577,8073032,T,IEX,142.125000,27
2019-10-14 18:07:24.666952960,2019-10-14 18:07:24.666934130,8081999,T,IEX,142.130000,100
2019-10-14 18:08:42.286172928,2019-10-14 18:08:42.286152790,8105493,T,IEX,142.140000,100
2019-10-14 18:09:00.207329024,2019-10-14 18:09:00.207308093,8109928,T,IEX,142.170000,100
2019-10-14 18:09:10.147668992,2019-10-14 18:09:10.147652664,8111977,T,IEX,142.170000,100
2019-10-14 18:09:10.676936960,2019-10-14 18:09:10.676917718,8112172,T,IEX,142.175000,100
2019-10-14 18:09:11.503961088,2019-10-14 18:09:11.503943791,8112336,T,IEX,142.175000,20
2019-10-14 18:09:28.886558976,2019-10-14 18:09:28.886538904,8116453,T,IEX,142.180000,100
2019-10-14 18:09:56.626811904,2019-10-14 18:09:56.626793743,8122334,T,IEX,142.200000,25
2019-10-14 18:10:05.628380928,2019-10-14 18:10:05.628366696,8124459,T,IEX,142.205000,55
2019-10-14 18:10:18.110558976,2019-10-14 18:10:18.110543914,8127691,T,IEX,142.225000,100
2019-10-14 18:11:11.383681024,2019-10-14 18:11:11.383661471,8140497,T,IEX,142.230000,20
2019-10-14 18:13:44.749232128,2019-10-14 18:13:44.749211831,8180941,T,IEX,142.245000,100
2019-10-14 18:13:44.944791040,2019-10-14 18:13:44.944773476,8181025,T,IEX,142.240000,23
2019-10-14 18:13:59.941775104,2019-10-14 18:13:59.941757437,8184765,T,IEX,142.220000,100
2019-10-14 18:15:03.4572928,2019-10-14 18:15:03.4552947,8205408,T,IEX,142.255000,100
2019-10-14 18:15:06.110663936,2019-10-14 18:15:06.110642611,8206410,T,IEX,142.255000,100
2019-10-14 18:15:08.208803072,2019-10-14 18:15:08.208783713,8207495,T,IEX,142.255000,200
2019-10-14 18:16:42.110813952,2019-10-14 18:16:42.110793388,8237738,T,IEX,142.235000,100
2019-10-14 18:17:18.998663936,2019-10-14 18:17:18.998647688,8250315,T,IEX,142.190000,200
2019-10-14 18:17:24.906636032,2019-10-14 18:17:24.906619780,8252504,T,IEX,142.190000,100
2019-10-14 18:17:24.906681088,2019-10-14 18:17:24.906665051,8252505,T,IEX,142.190000,100
2019-10-14 18:17:45.183247872,2019-10-14 18:17:45.183228039,8257336,T,IEX,142.190000,100
2019-10-14 18:18:01.65392128,2019-10-14 18:18:01.65371414,8260299,T,IEX,142.185000,100
2019-10-14 18:20:22.376645888,2019-10-14 18:20:22.376628255,8299099,T,IEX,142.220000,100
2019-10-14 18:21:00.344187904,2019-10-14 18:21:00.344170880,8307415,T,IEX,142.215000,100
2019-10-14 18:21:33.567499008,2019-10-14 18:21:33.567478479,8315931,T,IEX,142.215000,100
2019-10-14 18:22:35.469074944,2019-10-14 18:22:35.469055452,8332275,T,IEX,142.185000,100
2019-10-14 18:22:40.802725120,2019-10-14 18:22:40.802705239,8334403,T,IEX,142.180000,100
2019-10-14 18:22:47.597572096,2019-10-14 18:22:47.597554275,8336354,T,IEX,142.170000,100
2019-10-14 18:23:55.708939008,2019-10-14 18:23:55.708921359,8354232,T,IEX,142.200000,100
2019-10-14 18:23:58.182292992,2019-10-14 18:23:58.182277524,8356319,T,IEX,142.195000,100
2019-10-14 18:29:19.779461888,2019-10-14 18:29:19.779446397,8452579,T,IEX,142.105000,100
2019-10-14 18:31:43.275687936,2019-10-14 18:31:43.275671080,8488112,T,IEX,142.110000,85
2019-10-14 18:31:43.275912960,2019-10-14 18:31:43.275896517,8488117,T,IEX,142.110000,10
2019-10-14 18:33:00.404930048,2019-10-14 18:33:00.404910992,8505922,T,IEX,142.100000,100
2019-10-14 18:33:44.607310080,2019-10-14 18:33:44.607290646,8518257,T,IEX,142.110000,100
2019-10-14 18:33:50.88726016,2019-10-14 18:33:50.88699038,8519885,T,IEX,142.110000,100
2019-10-14 18:39:46.66660096,2019-10-14 18:39:46.66640316,8624849,T,IEX,142.050000,8
2019-10-14 18:40:24.292317952,2019-10-14 18:40:24.292301857,8638214,T,IEX,142.080000,100
2019-10-14 18:47:46.378583040,2019-10-14 18:47:46.378564060,8762524,T,IEX,142.020000,4
2019-10-14 18:50:01.73555968,2019-10-14 18:50:01.73535946,8799311,T,IEX,142.010000,100
2019-10-14 18:50:17.239695104,2019-10-14 18:50:17.239675894,8808201,T,IEX,142.010000,100
2019-10-14 18:59:36.664613120,2019-10-14 18:59:36.664592538,8976025,T,IEX,142.010000,100
2019-10-14 19:00:01.218057984,2019-10-14 19:00:01.218042279,8986799,T,IEX,141.990000,4
2019-10-14 19:01:12.751046912,2019-10-14 19:01:12.751028943,9010070,T,IEX,141.985000,100
2019-10-14 19:01:14.832731904,2019-10-14 19:01:14.832710080,9010890,T,IEX,141.995000,100
2019-10-14 19:01:40.753861120,2019-10-14 19:01:40.753843632,9020889,T,IEX,141.995000,100
2019-10-14 19:03:24.557347072,2019-10-14 19:03:24.557329813,9051173,T,IEX,141.960000,100
2019-10-14 19:04:27.234076928,2019-10-14 19:04:27.234057257,9070709,T,IEX,141.980000,100
2019-10-14 19:07:09.140512000,2019-10-14 19:07:09.140492937,9118336,T,IEX,141.930000,100
2019-10-14 19:07:10.27569920,2019-10-14 19:07:10.27551604,9118671,T,IEX,141.930000,100
2019-10-14 19:07:48.246501888,2019-10-14 19:07:48.246486819,9127568,T,IEX,141.920000,13
2019-10-14 19:09:12.29719040,2019-10-14 19:09:12.29697926,9149885,T,IEX,141.925000,100
2019-10-14 19:10:39.920350976,2019-10-14 19:10:39.920332054,9173129,T,IEX,141.930000,100
2019-10-14 19:11:58.782563072,2019-10-14 19:11:58.782543197,9193132,T,IEX,141.935000,100
2019-10-14 19:14:05.778716928,2019-10-14 19:14:05.778696910,9227375,T,IEX,141.945000,100
2019-10-14 19:15:19.270525952,2019-10-14 19:15:19.270504728,9248093,T,IEX,141.935000,100
2019-10-14 19:16:44.906191872,2019-10-14 19:16:44.906175092,9269029,T,IEX,141.950000,100
2019-10-14 19:19:14.250438912,2019-10-14 19:19:14.250418981,9312771,T,IEX,142.030000,100
2019-10-14 19:20:14.682125056,2019-10-14 19:20:14.682107478,9329953,T,IEX,142.000000,100
2019-10-14 19:20:28.257242880,2019-10-14 19:20:28.257223006,9333736,T,IEX,141.990000,100
2019-10-14 19:22:10.308039936,2019-10-14 19:22:10.308019491,9366422,T,IEX,142.010000,15
2019-10-14 19:22:10.308261888,2019-10-14 19:22:10.308246091,9366424,T,IEX,142.010000,37
2019-10-14 19:23:20.650533888,2019-10-14 19:23:20.650515045,9384138,T,IEX,142.025000,60
2019-10-14 19:23:34.948948992,2019-10-14 19:23:34.948931434,9388765,T,IEX,142.000000,8
2019-10-14 19:24:06.134846976,2019-10-14 19:24:06.134826668,9398876,T,IEX,142.005000,30
2019-10-14 19:24:23.901037056,2019-10-14 19:24:23.901017033,9405974,T,IEX,142.010000,2
2019-10-14 19:24:39.388318976,2019-10-14 19:24:39.388296069,9410258,T,IEX,142.020000,2
2019-10-14 19:25:06.312325888,2019-10-14 19:25:06.312309619,9417017,T,IEX,142.005000,80
2019-10-14 19:25:37.28758016,2019-10-14 19:25:37.28737038,9427084,T,IEX,142.010000,20
2019-10-14 19:26:29.110145024,2019-10-14 19:26:29.110122630,9442912,T,IEX,142.050000,100
2019-10-14 19:26:37.384182016,2019-10-14 19:26:37.384163983,9444641,T,IEX,142.050000,100
2019-10-14 19:32:06.282098944,2019-10-14 19:32:06.282082018,9564571,T,IEX,142.040000,100
2019-10-14 19:33:27.778832896,2019-10-14 19:33:27.778809635,9611502,T,IEX,141.995000,24
2019-10-14 19:34:26.383933952,2019-10-14 19:34:26.383915623,9637181,T,IEX,142.020000,2
2019-10-14 19:35:14.84358912,2019-10-14 19:35:14.84339522,9656678,T,IEX,141.980000,22
2019-10-14 19:35:36.13465088,2019-10-14 19:35:36.13449472,9664037,T,IEX,141.955000,100
2019-10-14 19:37:02.907305984,2019-10-14 19:37:02.907285831,9696240,T,IEX,141.980000,100
2019-10-14 19:37:02.908525056,2019-10-14 19:37:02.908505152,9696299,T,IEX,141.980000,100
2019-10-14 19:38:16.414811904,2019-10-14 19:38:16.414795449,9727084,T,IEX,142.040000,100
2019-10-14 19:38:44.57583104,2019-10-14 19:38:44.57562655,9736483,T,IEX,142.020000,22
2019-10-14 19:39:48.208701952,2019-10-14 19:39:48.208682381,9762666,T,IEX,142.040000,22
2019-10-14 19:40:19.439889920,2019-10-14 19:40:19.439873235,9780761,T,IEX,141.975000,22
2019-10-14 19:42:45.498065920,2019-10-14 19:42:45.498047227,9846167,T,IEX,141.955000,100
2019-10-14 19:45:16.630072064,2019-10-14 19:45:16.630054371,9906146,T,IEX,141.980000,100
2019-10-14 19:45:16.630648064,2019-10-14 19:45:16.630629806,9906151,T,IEX,141.980000,100
2019-10-14 19:45:17.27656960,2019-10-14 19:45:17.27635386,9906762,T,IEX,141.970000,2
2019-10-14 19:45:24.651362048,2019-10-14 19:45:24.651341818,9910277,T,IEX,141.965000,100
2019-10-14 19:45:48.270908928,2019-10-14 19:45:48.270889108,9920008,T,IEX,141.965000,100
2019-10-14 19:47:06.114455040,2019-10-14 19:47:06.114437970,9952208,T,IEX,141.960000,3
2019-10-14 19:47:12.51578880,2019-10-14 19:47:12.51562679,9954762,T,IEX,141.960000,108
2019-10-14 19:47:14.962002944,2019-10-14 19:47:14.961986147,9956100,T,IEX,141.960000,100
2019-10-14 19:49:06.613085952,2019-10-14 19:49:06.613069114,10010552,T,IEX,142.015000,154
2019-10-14 19:49:38.774906880,2019-10-14 19:49:38.774888808,10025280,T,IEX,142.040000,4
2019-10-14 19:49:38.832892928,2019-10-14 19:49:38.832875233,10025324,T,IEX,142.035000,1
2019-10-14 19:49:47.519336960,2019-10-14 19:49:47.519321413,10030333,T,IEX,142.045000,1
2019-10-14 19:49:47.996045056,2019-10-14 19:49:47.996023260,10030753,T,IEX,142.045000,1
2019-10-14 19:49:54.14384896,2019-10-14 19:49:54.14368986,10034401,T,IEX,142.050000,1
2019-10-14 19:49:56.188072960,2019-10-14 19:49:56.188053378,10036725,T,IEX,142.010000,1
2019-10-14 19:50:00.363476992,2019-10-14 19:50:00.363458603,10041935,T,IEX,142.000000,1
2019-10-14 19:50:02.483694080,2019-10-14 19:50:02.483675585,10047628,T,IEX,141.980000,2
2019-10-14 19:50:04.999664128,2019-10-14 19:50:04.999646048,10051577,T,IEX,141.960000,1
2019-10-14 19:50:23.952048128,2019-10-14 19:50:23.952026878,10070039,T,IEX,142.000000,100
2019-10-14 19:51:49.282860032,2019-10-14 19:51:49.282842541,10130554,T,IEX,141.950000,100
2019-10-14 19:51:49.282878976,2019-10-14 19:51:49.282862471,10130555,T,IEX,141.950000,200
2019-10-14 19:52:10.968988928,2019-10-14 19:52:10.968969360,10141963,T,IEX,141.940000,29
2019-10-14 19:52:22.649097984,2019-10-14 19:52:22.649081007,10150408,T,IEX,141.940000,100
2019-10-14 19:52:23.169297920,2019-10-14 19:52:23.169278609,10150629,T,IEX,141.940000,3
2019-10-14 19:52:25.534863872,2019-10-14 19:52:25.534844220,10152285,T,IEX,141.940000,50
2019-10-14 19:53:21.38984960,2019-10-14 19:53:21.38965352,10184890,T,IEX,142.005000,5
2019-10-14 19:53:28.46746880,2019-10-14 19:53:28.46726898,10187579,T,IEX,142.005000,3
2019-10-14 19:53:40.334278912,2019-10-14 19:53:40.334262058,10198618,T,IEX,142.025000,20
2019-10-14 19:54:02.332832000,2019-10-14 19:54:02.332813424,10215219,T,IEX,142.055000,77
2019-10-14 19:54:02.332856064,2019-10-14 19:54:02.332839556,10215220,T,IEX,142.055000,100
2019-10-14 19:54:42.459412992,2019-10-14 19:54:42.459395687,10241595,T,IEX,142.080000,2
2019-10-14 19:54:43.650629120,2019-10-14 19:54:43.650611350,10242441,T,IEX,142.080000,500
2019-10-14 19:54:43.650653952,2019-10-14 19:54:43.650637802,10242442,T,IEX,142.080000,100
2019-10-14 19:55:30.407409920,2019-10-14 19:55:30.407391302,10318006,T,IEX,142.030000,100
2019-10-14 19:55:34.72332032,2019-10-14 19:55:34.72314299,10321002,T,IEX,142.030000,100
2019-10-14 19:55:38.437341952,2019-10-14 19:55:38.437326520,10323455,T,IEX,142.025000,100
2019-10-14 19:55:48.262729984,2019-10-14 19:55:48.262711831,10330293,T,IEX,142.020000,1
2019-10-14 19:55:58.39951104,2019-10-14 19:55:58.39932541,10337991,T,IEX,142.000000,100
2019-10-14 19:56:19.839065088,2019-10-14 19:56:19.839049449,10357561,T,IEX,141.990000,2
2019-10-14 19:56:19.839394048,2019-10-14 19:56:19.839378622,10357562,T,IEX,141.990000,4
2019-10-14 19:56:25.135601920,2019-10-14 19:56:25.135580017,10361725,T,IEX,141.980000,2
2019-10-14 19:56:31.134118912,2019-10-14 19:56:31.134099541,10365994,T,IEX,141.965000,100
2019-10-14 19:56:40.946234880,2019-10-14 19:56:40.946215236,10375565,T,IEX,141.970000,51
2019-10-14 19:56:55.595994880,2019-10-14 19:56:55.595972921,10386200,T,IEX,141.935000,100
2019-10-14 19:56:57.395888128,2019-10-14 19:56:57.395869877,10387346,T,IEX,141.935000,100
2019-10-14 19:57:22.528333056,2019-10-14 19:57:22.528314228,10409550,T,IEX,141.955000,100
2019-10-14 19:57:33.190950912,2019-10-14 19:57:33.190932163,10421928,T,IEX,141.970000,8
2019-10-14 19:57:53.520078080,2019-10-14 19:57:53.520057840,10438218,T,IEX,141.955000,100
2019-10-14 19:57:57.185308928,2019-10-14 19:57:57.185289191,10440849,T,IEX,141.955000,100
2019-10-14 19:58:11.23002880,2019-10-14 19:58:11.22985347,10459385,T,IEX,141.970000,100
2019-10-14 19:58:38.457760000,2019-10-14 19:58:38.457739895,10483954,T,IEX,141.920000,100
2019-10-14 19:58:38.458515968,2019-10-14 19:58:38.458497238,10483956,T,IEX,141.930000,2
2019-10-14 19:59:05.9445888,2019-10-14 19:59:05.9419538,10509730,T,IEX,141.930000,100
2019-10-14 19:59:05.9556992,2019-10-14 19:59:05.9537693,10509732,T,IEX,141.930000,100
2019-10-14 19:59:15.784888064,2019-10-14 19:59:15.784870908,10524902,T,IEX,141.960000,200
2019-10-14 19:59:20.791536128,2019-10-14 19:59:20.791515234,10530713,T,IEX,141.990000,5
2019-10-14 19:59:25.805251072,2019-10-14 19:59:25.805231206,10538713,T,IEX,142.065000,100
2019-10-14 19:59:27.588146944,2019-10-14 19:59:27.588129080,10541500,T,IEX,142.085000,100
2019-10-14 19:59:28.28659968,2019-10-14 19:59:28.28642129,10542000,T,IEX,142.100000,42
2019-10-14 19:59:29.352432128,2019-10-14 19:59:29.352415059,10543591,T,IEX,142.065000,100
2019-10-14 19:59:31.818679040,2019-10-14 19:59:31.818660590,10556103,T,IEX,142.040000,100
2019-10-14 19:59:32.450003968,2019-10-14 19:59:32.449987180,10559577,T,IEX,142.070000,100
2019-10-14 19:59:34.32035072,2019-10-14 19:59:34.32016700,10569737,T,IEX,142.070000,100
2019-10-14 19:59:38.475166976,2019-10-14 19:59:38.475148051,10593475,T,IEX,142.030000,100
2019-10-14 19:59:40.125086976,2019-10-14 19:59:40.125064484,10601180,T,IEX,142.045000,200
2019-10-14 19:59:40.841876992,2019-10-14 19:59:40.841858128,10607611,T,IEX,142.050000,100
2019-10-14 19:59:40.841893888,2019-10-14 19:59:40.841875908,10607612,T,IEX,142.060000,390
2019-10-14 19:59:41.263624960,2019-10-14 19:59:41.263599054,10610568,T,IEX,142.060000,100
2019-10-14 19:59:42.219002112,2019-10-14 19:59:42.218982273,10619812,T,IEX,142.070000,100
2019-10-14 19:59:50.48418048,2019-10-14 19:59:50.48393792,10665150,T,IEX,141.990000,100
2019-10-14 19:59:55.862297088,2019-10-14 19:59:55.862279973,10699003,T,IEX,141.910000,2
2019-10-14 19:59:55.862323968,2019-10-14 19:59:55.862306929,10699004,T,IEX,141.900000,33
2019-10-14 19:59:58.893892096,2019-10-14 19:59:58.893870342,10722144,T,IEX,141.920000,100
2019-10-14 19:59:59.193692928,2019-10-14 19:59:59.193675013,10727699,T,IEX,141.970000,100
