2019-10-22 13:35:06.667284992,2019-10-22 13:35:06.667268002,415850,T,IEX,87.125000,200
2019-10-22 13:35:07.292591104,2019-10-22 13:35:07.292572966,417499,T,IEX,87.125000,200
2019-10-22 13:35:12.234633984,2019-10-22 13:35:12.234616607,424353,T,IEX,87.125000,200
2019-10-22 13:35:12.236475904,2019-10-22 13:35:12.236455779,424354,T,IEX,87.125000,500
2019-10-22 13:35:29.333797120,2019-10-22 13:35:29.333779894,445975,T,IEX,87.120000,200
2019-10-22 13:35:29.544026880,2019-10-22 13:35:29.544008368,446134,T,IEX,87.115000,100
2019-10-22 13:35:32.759339008,2019-10-22 13:35:32.759323529,449806,T,IEX,87.115000,800
2019-10-22 13:35:33.38329088,2019-10-22 13:35:33.38308728,450079,T,IEX,87.115000,800
2019-10-22 13:35:51.798724096,2019-10-22 13:35:51.798705265,467948,T,IEX,87.115000,600
2019-10-22 13:36:02.770246912,2019-10-22 13:36:02.770230790,480638,T,IEX,87.115000,700
2019-10-22 13:36:13.378016000,2019-10-22 13:36:13.377994798,495597,T,IEX,87.110000,1
2019-10-22 13:36:30.230918912,2019-10-22 13:36:30.230901123,513310,T,IEX,87.125000,100
2019-10-22 13:36:35.682629888,2019-10-22 13:36:35.682613745,518460,T,IEX,87.125000,700
2019-10-22 13:36:43.117423104,2019-10-22 13:36:43.117406541,526208,T,IEX,87.125000,100
2019-10-22 13:36:54.829484032,2019-10-22 13:36:54.829463497,536409,T,IEX,87.125000,200
2019-10-22 13:37:21.740811008,2019-10-22 13:37:21.740793267,561518,T,IEX,87.125000,600
2019-10-22 13:37:41.535456000,2019-10-22 13:37:41.535436135,579236,T,IEX,87.125000,100
2019-10-22 13:38:26.557510912,2019-10-22 13:38:26.557491913,618242,T,IEX,87.125000,3
2019-10-22 13:41:00.5517056,2019-10-22 13:41:00.5499081,751227,T,IEX,87.115000,50
2019-10-22 13:41:04.174098944,2019-10-22 13:41:04.174081456,755670,T,IEX,87.115000,200
2019-10-22 13:41:04.174296064,2019-10-22 13:41:04.174278615,755675,T,IEX,87.115000,200
2019-10-22 13:41:04.174450944,2019-10-22 13:41:04.174433149,755683,T,IEX,87.115000,100
2019-10-22 13:41:04.174644992,2019-10-22 13:41:04.174628177,755685,T,IEX,87.115000,100
2019-10-22 13:41:04.175621888,2019-10-22 13:41:04.175604643,755697,T,IEX,87.115000,100
2019-10-22 13:41:04.175929088,2019-10-22 13:41:04.175912933,755707,T,IEX,87.115000,100
2019-10-22 13:41:22.353178112,2019-10-22 13:41:22.353158044,773439,T,IEX,87.120000,300
2019-10-22 13:42:50.904090880,2019-10-22 13:42:50.904073662,840548,T,IEX,87.125000,218
2019-10-22 13:42:50.904122880,2019-10-22 13:42:50.904106133,840549,T,IEX,87.125000,1800
2019-10-22 13:42:50.918916096,2019-10-22 13:42:50.918896493,840551,T,IEX,87.125000,300
2019-10-22 13:43:09.392931072,2019-10-22 13:43:09.392913172,854082,T,IEX,87.125000,100
2019-10-22 13:43:55.665509120,2019-10-22 13:43:55.665489915,887477,T,IEX,87.120000,200
2019-10-22 13:43:55.665541120,2019-10-22 13:43:55.665524698,887478,T,IEX,87.120000,2000
2019-10-22 13:43:55.669296128,2019-10-22 13:43:55.669277368,887483,T,IEX,87.120000,200
2019-10-22 13:44:26.35623936,2019-10-22 13:44:26.35607987,909806,T,IEX,87.120000,1700
2019-10-22 13:44:26.35953920,2019-10-22 13:44:26.35937162,909810,T,IEX,87.120000,100
2019-10-22 13:44:26.35975936,2019-10-22 13:44:26.35958041,909812,T,IEX,87.120000,100
2019-10-22 13:44:26.71504896,2019-10-22 13:44:26.71487883,909842,T,IEX,87.120000,1
2019-10-22 13:44:28.852231936,2019-10-22 13:44:28.852211983,911542,T,IEX,87.120000,1999
2019-10-22 13:44:28.852261120,2019-10-22 13:44:28.852244084,911543,T,IEX,87.120000,4800
2019-10-22 13:45:16.123236096,2019-10-22 13:45:16.123220651,958203,T,IEX,87.125000,1
2019-10-22 13:45:58.731599872,2019-10-22 13:45:58.731577325,1000360,T,IEX,87.120000,200
2019-10-22 13:46:03.622702080,2019-10-22 13:46:03.622681152,1006665,T,IEX,87.120000,200
2019-10-22 13:47:38.122227968,2019-10-22 13:47:38.122211317,1086913,T,IEX,87.105000,300
2019-10-22 13:47:48.915161088,2019-10-22 13:47:48.915143666,1095920,T,IEX,87.105000,1
2019-10-22 13:48:02.223066880,2019-10-22 13:48:02.223045560,1110569,T,IEX,87.110000,200
2019-10-22 13:48:15.971586048,2019-10-22 13:48:15.971570388,1125990,T,IEX,87.105000,256
2019-10-22 13:48:38.321332992,2019-10-22 13:48:38.321313121,1151419,T,IEX,87.100000,200
2019-10-22 13:48:57.602861056,2019-10-22 13:48:57.602839395,1168899,T,IEX,87.110000,200
2019-10-22 13:48:57.627462912,2019-10-22 13:48:57.627442395,1168903,T,IEX,87.110000,100
2019-10-22 13:50:40.270629888,2019-10-22 13:50:40.270602987,1257386,T,IEX,87.105000,100
2019-10-22 13:50:52.926653952,2019-10-22 13:50:52.926632158,1267156,T,IEX,87.105000,100
2019-10-22 13:52:11.415005952,2019-10-22 13:52:11.414989016,1332430,T,IEX,87.105000,1
2019-10-22 13:52:23.164328960,2019-10-22 13:52:23.164311317,1341352,T,IEX,87.105000,100
2019-10-22 13:52:37.381853952,2019-10-22 13:52:37.381836794,1352653,T,IEX,87.105000,100
2019-10-22 13:53:06.374868992,2019-10-22 13:53:06.374845547,1372746,T,IEX,87.115000,250
2019-10-22 13:53:06.374881024,2019-10-22 13:53:06.374863786,1372747,T,IEX,87.115000,200
2019-10-22 13:53:06.374896128,2019-10-22 13:53:06.374878095,1372748,T,IEX,87.115000,750
2019-10-22 13:53:06.377600000,2019-10-22 13:53:06.377583206,1372752,T,IEX,87.115000,450
2019-10-22 13:53:29.613669888,2019-10-22 13:53:29.613648678,1391446,T,IEX,87.115000,100
2019-10-22 13:53:52.120486912,2019-10-22 13:53:52.120467663,1408733,T,IEX,87.120000,100
2019-10-22 13:54:19.961776128,2019-10-22 13:54:19.961756494,1432271,T,IEX,87.115000,100
2019-10-22 13:54:24.313656064,2019-10-22 13:54:24.313636849,1436787,T,IEX,87.115000,600
2019-10-22 13:54:40.95745024,2019-10-22 13:54:40.95724451,1448244,T,IEX,87.115000,400
2019-10-22 13:54:40.98742016,2019-10-22 13:54:40.98717798,1448246,T,IEX,87.115000,100
2019-10-22 13:54:40.98754048,2019-10-22 13:54:40.98737196,1448247,T,IEX,87.115000,100
2019-10-22 13:55:29.117840896,2019-10-22 13:55:29.117822639,1486270,T,IEX,87.105000,1
2019-10-22 13:55:29.118544896,2019-10-22 13:55:29.118529149,1486271,T,IEX,87.105000,1
2019-10-22 13:55:58.491254016,2019-10-22 13:55:58.491234866,1507024,T,IEX,87.105000,100
2019-10-22 13:56:27.836263936,2019-10-22 13:56:27.836248715,1532336,T,IEX,87.105000,100
2019-10-22 13:57:01.798031104,2019-10-22 13:57:01.798012854,1552769,T,IEX,87.105000,100
2019-10-22 13:57:04.385328128,2019-10-22 13:57:04.385308708,1554416,T,IEX,87.105000,800
2019-10-22 13:58:05.95545088,2019-10-22 13:58:05.95525046,1595567,T,IEX,87.105000,600
2019-10-22 13:58:25.2238976,2019-10-22 13:58:25.2219100,1605973,T,IEX,87.105000,800
2019-10-22 13:58:30.3726080,2019-10-22 13:58:30.3704530,1608751,T,IEX,87.105000,800
2019-10-22 13:58:43.524645120,2019-10-22 13:58:43.524625461,1615802,T,IEX,87.105000,700
2019-10-22 13:59:24.244862976,2019-10-22 13:59:24.244844424,1642083,T,IEX,87.105000,600
2019-10-22 13:59:32.114064896,2019-10-22 13:59:32.114045233,1648404,T,IEX,87.110000,200
2019-10-22 13:59:32.114270976,2019-10-22 13:59:32.114255187,1648406,T,IEX,87.105000,100
2019-10-22 14:00:36.879217920,2019-10-22 14:00:36.879203046,1695287,T,IEX,87.115000,200
2019-10-22 14:00:36.892265984,2019-10-22 14:00:36.892250832,1695306,T,IEX,87.115000,200
2019-10-22 14:00:37.417911040,2019-10-22 14:00:37.417891629,1695632,T,IEX,87.115000,200
2019-10-22 14:01:19.218607104,2019-10-22 14:01:19.218591565,1743900,T,IEX,87.105000,300
2019-10-22 14:01:19.218625024,2019-10-22 14:01:19.218607725,1743901,T,IEX,87.105000,300
2019-10-22 14:02:01.192151040,2019-10-22 14:02:01.192134914,1776612,T,IEX,87.120000,100
2019-10-22 14:02:41.625689088,2019-10-22 14:02:41.625671571,1813293,T,IEX,87.115000,700
2019-10-22 14:03:34.314284032,2019-10-22 14:03:34.314264136,1855852,T,IEX,87.115000,800
2019-10-22 14:03:34.315515904,2019-10-22 14:03:34.315499114,1855854,T,IEX,87.115000,800
2019-10-22 14:03:38.299374080,2019-10-22 14:03:38.299353424,1857723,T,IEX,87.115000,800
2019-10-22 14:03:56.855256064,2019-10-22 14:03:56.855236598,1869020,T,IEX,87.115000,800
2019-10-22 14:03:56.857623040,2019-10-22 14:03:56.857602930,1869021,T,IEX,87.115000,800
2019-10-22 14:03:56.858861056,2019-10-22 14:03:56.858842176,1869022,T,IEX,87.115000,800
2019-10-22 14:03:57.10622976,2019-10-22 14:03:57.10603123,1869067,T,IEX,87.115000,1400
2019-10-22 14:03:57.10693120,2019-10-22 14:03:57.10675998,1869068,T,IEX,87.115000,700
2019-10-22 14:04:06.624829952,2019-10-22 14:04:06.624812309,1877039,T,IEX,87.105000,600
2019-10-22 14:04:24.97356032,2019-10-22 14:04:24.97336579,1891096,T,IEX,87.105000,700
2019-10-22 14:04:28.643954944,2019-10-22 14:04:28.643936350,1896308,T,IEX,87.105000,800
2019-10-22 14:04:32.107266048,2019-10-22 14:04:32.107251335,1901435,T,IEX,87.105000,800
2019-10-22 14:04:32.615834880,2019-10-22 14:04:32.615817224,1902700,T,IEX,87.105000,800
2019-10-22 14:04:33.983618048,2019-10-22 14:04:33.983601259,1904968,T,IEX,87.105000,700
2019-10-22 14:04:36.838558976,2019-10-22 14:04:36.838539865,1909149,T,IEX,87.105000,600
2019-10-22 14:04:37.924966912,2019-10-22 14:04:37.924948743,1910129,T,IEX,87.105000,600
2019-10-22 14:04:39.314806016,2019-10-22 14:04:39.314789332,1911570,T,IEX,87.105000,600
2019-10-22 14:04:39.804559872,2019-10-22 14:04:39.804542389,1912033,T,IEX,87.105000,700
2019-10-22 14:04:40.801767936,2019-10-22 14:04:40.801750913,1913182,T,IEX,87.105000,800
2019-10-22 14:04:42.289657088,2019-10-22 14:04:42.289635924,1914457,T,IEX,87.105000,600
2019-10-22 14:04:43.299394048,2019-10-22 14:04:43.299376117,1915358,T,IEX,87.105000,800
2019-10-22 14:05:29.983228928,2019-10-22 14:05:29.983213049,1955299,T,IEX,87.100000,517
2019-10-22 14:05:29.984310016,2019-10-22 14:05:29.984291064,1955302,T,IEX,87.100000,340
2019-10-22 14:05:30.29349888,2019-10-22 14:05:30.29331646,1955740,T,IEX,87.100000,1
2019-10-22 14:05:34.952580096,2019-10-22 14:05:34.952563220,1961373,T,IEX,87.100000,1200
2019-10-22 14:06:11.6000128,2019-10-22 14:06:11.5979771,1991820,T,IEX,87.105000,300
2019-10-22 14:06:11.6039040,2019-10-22 14:06:11.6023444,1991821,T,IEX,87.105000,500
2019-10-22 14:06:11.6100992,2019-10-22 14:06:11.6083721,1991822,T,IEX,87.105000,100
2019-10-22 14:06:11.119491072,2019-10-22 14:06:11.119473645,1991929,T,IEX,87.110000,200
2019-10-22 14:06:27.529487872,2019-10-22 14:06:27.529472202,2006049,T,IEX,87.115000,100
2019-10-22 14:06:27.529501952,2019-10-22 14:06:27.529485092,2006050,T,IEX,87.115000,600
2019-10-22 14:06:27.529515008,2019-10-22 14:06:27.529498573,2006051,T,IEX,87.115000,100
2019-10-22 14:06:27.529530112,2019-10-22 14:06:27.529514145,2006052,T,IEX,87.115000,100
2019-10-22 14:06:27.529545984,2019-10-22 14:06:27.529528197,2006053,T,IEX,87.120000,100
2019-10-22 14:06:31.756172032,2019-10-22 14:06:31.756152829,2009588,T,IEX,87.120000,400
2019-10-22 14:06:31.756196096,2019-10-22 14:06:31.756180130,2009589,T,IEX,87.120000,200
2019-10-22 14:08:07.436879104,2019-10-22 14:08:07.436858770,2097714,T,IEX,87.115000,200
2019-10-22 14:10:13.895207936,2019-10-22 14:10:13.895191250,2193552,T,IEX,87.105000,100
2019-10-22 14:10:13.895553024,2019-10-22 14:10:13.895534934,2193554,T,IEX,87.105000,100
2019-10-22 14:10:13.895589120,2019-10-22 14:10:13.895571117,2193555,T,IEX,87.105000,300
2019-10-22 14:10:13.895630080,2019-10-22 14:10:13.895612375,2193556,T,IEX,87.105000,200
2019-10-22 14:10:13.895649024,2019-10-22 14:10:13.895630891,2193557,T,IEX,87.105000,100
2019-10-22 14:10:41.812944896,2019-10-22 14:10:41.812927377,2214646,T,IEX,87.105000,100
2019-10-22 14:10:41.813925120,2019-10-22 14:10:41.813906796,2214647,T,IEX,87.105000,437
2019-10-22 14:12:06.567941888,2019-10-22 14:12:06.567922789,2276802,T,IEX,87.100000,21
2019-10-22 14:12:52.897267968,2019-10-22 14:12:52.897249984,2308215,T,IEX,87.100000,300
2019-10-22 14:13:01.302479872,2019-10-22 14:13:01.302452409,2315395,T,IEX,87.100000,300
2019-10-22 14:13:02.829556992,2019-10-22 14:13:02.829540629,2317305,T,IEX,87.100000,22
2019-10-22 14:13:05.29905920,2019-10-22 14:13:05.29884871,2319693,T,IEX,87.100000,200
2019-10-22 14:13:05.32271872,2019-10-22 14:13:05.32250088,2319702,T,IEX,87.100000,100
2019-10-22 14:13:05.130822912,2019-10-22 14:13:05.130801900,2319762,T,IEX,87.100000,200
2019-10-22 14:13:05.232240128,2019-10-22 14:13:05.232224073,2319931,T,IEX,87.100000,200
2019-10-22 14:17:03.214159104,2019-10-22 14:17:03.214139380,2480805,T,IEX,87.105000,100
2019-10-22 14:17:18.314977024,2019-10-22 14:17:18.314958053,2491407,T,IEX,87.100000,8
2019-10-22 14:17:18.369545984,2019-10-22 14:17:18.369527909,2491422,T,IEX,87.100000,100
2019-10-22 14:18:05.23333888,2019-10-22 14:18:05.23317954,2527138,T,IEX,87.105000,33
2019-10-22 14:21:05.111493888,2019-10-22 14:21:05.111474705,2641366,T,IEX,87.105000,300
2019-10-22 14:21:05.111778048,2019-10-22 14:21:05.111759092,2641386,T,IEX,87.105000,100
2019-10-22 14:21:07.557747968,2019-10-22 14:21:07.557730263,2643240,T,IEX,87.105000,200
2019-10-22 14:22:31.117042944,2019-10-22 14:22:31.117025213,2695449,T,IEX,87.105000,50
2019-10-22 14:23:19.5658880,2019-10-22 14:23:19.5641324,2722894,T,IEX,87.105000,750
2019-10-22 14:23:19.5682944,2019-10-22 14:23:19.5665450,2722895,T,IEX,87.105000,300
2019-10-22 14:23:19.7026944,2019-10-22 14:23:19.7008803,2722898,T,IEX,87.105000,600
2019-10-22 14:23:24.37352960,2019-10-22 14:23:24.37334869,2725412,T,IEX,87.105000,700
2019-10-22 14:23:24.413616128,2019-10-22 14:23:24.413595544,2725903,T,IEX,87.105000,700
2019-10-22 14:23:28.796540928,2019-10-22 14:23:28.796523864,2727678,T,IEX,87.105000,800
2019-10-22 14:23:29.384483072,2019-10-22 14:23:29.384462081,2728014,T,IEX,87.105000,300
2019-10-22 14:23:29.389936896,2019-10-22 14:23:29.389915915,2728016,T,IEX,87.105000,200
2019-10-22 14:23:30.554160128,2019-10-22 14:23:30.554143398,2728688,T,IEX,87.105000,800
2019-10-22 14:23:35.694609920,2019-10-22 14:23:35.694591841,2730487,T,IEX,87.105000,800
2019-10-22 14:23:39.922107904,2019-10-22 14:23:39.922090305,2732138,T,IEX,87.105000,800
2019-10-22 14:23:43.407197952,2019-10-22 14:23:43.407180278,2733396,T,IEX,87.105000,700
2019-10-22 14:23:43.560348928,2019-10-22 14:23:43.560330243,2733615,T,IEX,87.105000,300
2019-10-22 14:23:45.694210048,2019-10-22 14:23:45.694189969,2735132,T,IEX,87.105000,600
2019-10-22 14:23:46.821169920,2019-10-22 14:23:46.821152853,2735648,T,IEX,87.105000,800
2019-10-22 14:23:49.198414080,2019-10-22 14:23:49.198394304,2737102,T,IEX,87.105000,800
2019-10-22 14:23:55.264465920,2019-10-22 14:23:55.264450685,2739926,T,IEX,87.105000,700
2019-10-22 14:23:55.265797120,2019-10-22 14:23:55.265777201,2739928,T,IEX,87.105000,600
2019-10-22 14:24:05.315502080,2019-10-22 14:24:05.315483873,2745807,T,IEX,87.105000,700
2019-10-22 14:24:06.991130880,2019-10-22 14:24:06.991109217,2746842,T,IEX,87.105000,600
2019-10-22 14:24:07.828884992,2019-10-22 14:24:07.828867125,2747379,T,IEX,87.105000,700
2019-10-22 14:24:10.524307968,2019-10-22 14:24:10.524288289,2748534,T,IEX,87.105000,700
2019-10-22 14:24:12.166490112,2019-10-22 14:24:12.166471868,2749646,T,IEX,87.105000,800
2019-10-22 14:24:14.621569024,2019-10-22 14:24:14.621550771,2750978,T,IEX,87.105000,200
2019-10-22 14:24:14.621729024,2019-10-22 14:24:14.621709095,2750979,T,IEX,87.105000,200
2019-10-22 14:24:14.623411968,2019-10-22 14:24:14.623392392,2750980,T,IEX,87.105000,600
2019-10-22 14:24:25.694263040,2019-10-22 14:24:25.694244173,2756110,T,IEX,87.105000,600
2019-10-22 14:24:46.50780928,2019-10-22 14:24:46.50763194,2768123,T,IEX,87.105000,600
2019-10-22 14:24:46.453324032,2019-10-22 14:24:46.453306023,2768418,T,IEX,87.105000,100
2019-10-22 14:25:01.810054912,2019-10-22 14:25:01.810035886,2778116,T,IEX,87.105000,300
2019-10-22 14:26:13.159314944,2019-10-22 14:26:13.159293851,2832642,T,IEX,87.110000,200
2019-10-22 14:26:20.228556032,2019-10-22 14:26:20.228535660,2837764,T,IEX,87.105000,100
2019-10-22 14:26:20.228750080,2019-10-22 14:26:20.228732038,2837765,T,IEX,87.105000,300
2019-10-22 14:26:20.961103872,2019-10-22 14:26:20.961086206,2838074,T,IEX,87.120000,200
2019-10-22 14:26:21.805423104,2019-10-22 14:26:21.805404873,2838837,T,IEX,87.115000,700
2019-10-22 14:26:23.801046016,2019-10-22 14:26:23.801028944,2840402,T,IEX,87.115000,700
2019-10-22 14:26:28.822189056,2019-10-22 14:26:28.822170179,2844281,T,IEX,87.115000,600
2019-10-22 14:26:28.822204928,2019-10-22 14:26:28.822188418,2844282,T,IEX,87.115000,400
2019-10-22 14:26:37.883147008,2019-10-22 14:26:37.883130946,2849813,T,IEX,87.115000,700
2019-10-22 14:26:43.779032064,2019-10-22 14:26:43.779014481,2854461,T,IEX,87.120000,100
2019-10-22 14:26:43.981897984,2019-10-22 14:26:43.981876923,2854577,T,IEX,87.130000,2200
2019-10-22 14:26:51.91407872,2019-10-22 14:26:51.91390062,2858566,T,IEX,87.125000,300
2019-10-22 14:28:40.16826880,2019-10-22 14:28:40.16806713,2925276,T,IEX,87.115000,100
2019-10-22 14:28:40.18461952,2019-10-22 14:28:40.18444755,2925304,T,IEX,87.120000,100
2019-10-22 14:28:40.29705984,2019-10-22 14:28:40.29687160,2925380,T,IEX,87.115000,300
2019-10-22 14:28:40.29723904,2019-10-22 14:28:40.29706772,2925381,T,IEX,87.115000,300
2019-10-22 14:28:40.541420032,2019-10-22 14:28:40.541400555,2925952,T,IEX,87.115000,100
2019-10-22 14:28:40.541433088,2019-10-22 14:28:40.541414374,2925953,T,IEX,87.115000,100
2019-10-22 14:29:43.486032896,2019-10-22 14:29:43.486015756,2961219,T,IEX,87.115000,300
2019-10-22 14:29:53.403847936,2019-10-22 14:29:53.403828795,2966389,T,IEX,87.115000,200
2019-10-22 14:30:06.99241984,2019-10-22 14:30:06.99227141,2978488,T,IEX,87.120000,100
2019-10-22 14:30:21.171610880,2019-10-22 14:30:21.171593479,2992711,T,IEX,87.130000,200
2019-10-22 14:33:05.272301056,2019-10-22 14:33:05.272274241,3103141,T,IEX,87.125000,200
2019-10-22 14:33:06.68090112,2019-10-22 14:33:06.68072920,3104326,T,IEX,87.125000,100
2019-10-22 14:33:27.348265984,2019-10-22 14:33:27.348250746,3120338,T,IEX,87.125000,100
2019-10-22 14:33:27.348288000,2019-10-22 14:33:27.348270349,3120339,T,IEX,87.125000,200
2019-10-22 14:33:35.455233024,2019-10-22 14:33:35.455216353,3139859,T,IEX,87.120000,200
2019-10-22 14:33:50.773846016,2019-10-22 14:33:50.773828109,3156712,T,IEX,87.115000,200
2019-10-22 14:33:50.773891072,2019-10-22 14:33:50.773874156,3156713,T,IEX,87.115000,300
2019-10-22 14:33:50.773934080,2019-10-22 14:33:50.773917136,3156715,T,IEX,87.115000,100
2019-10-22 14:33:51.367516928,2019-10-22 14:33:51.367497128,3158404,T,IEX,87.125000,200
2019-10-22 14:34:25.513543936,2019-10-22 14:34:25.513526148,3183783,T,IEX,87.120000,1
2019-10-22 14:39:14.726752000,2019-10-22 14:39:14.726735035,3356671,T,IEX,87.125000,100
2019-10-22 14:39:56.928027904,2019-10-22 14:39:56.928010050,3385225,T,IEX,87.120000,100
2019-10-22 14:39:56.928047104,2019-10-22 14:39:56.928028645,3385226,T,IEX,87.120000,200
2019-10-22 14:39:56.930953984,2019-10-22 14:39:56.930933712,3385238,T,IEX,87.120000,100
2019-10-22 14:39:56.932204032,2019-10-22 14:39:56.932185343,3385239,T,IEX,87.120000,100
2019-10-22 14:39:56.933462016,2019-10-22 14:39:56.933445922,3385241,T,IEX,87.120000,100
2019-10-22 14:40:33.632466944,2019-10-22 14:40:33.632449016,3410170,T,IEX,87.125000,300
2019-10-22 14:40:50.497913088,2019-10-22 14:40:50.497895823,3420237,T,IEX,87.125000,200
2019-10-22 14:40:50.500435968,2019-10-22 14:40:50.500418291,3420238,T,IEX,87.125000,700
2019-10-22 14:41:01.473942016,2019-10-22 14:41:01.473926083,3428137,T,IEX,87.125000,100
2019-10-22 14:41:01.473960960,2019-10-22 14:41:01.473944498,3428138,T,IEX,87.125000,100
2019-10-22 14:41:01.473976064,2019-10-22 14:41:01.473958816,3428139,T,IEX,87.125000,600
2019-10-22 14:41:11.692369920,2019-10-22 14:41:11.692352562,3435361,T,IEX,87.125000,100
2019-10-22 14:41:11.692391936,2019-10-22 14:41:11.692374322,3435362,T,IEX,87.125000,600
2019-10-22 14:41:13.175132928,2019-10-22 14:41:13.175116857,3436326,T,IEX,87.125000,100
2019-10-22 14:41:13.175155968,2019-10-22 14:41:13.175139120,3436327,T,IEX,87.125000,500
2019-10-22 14:41:16.692371968,2019-10-22 14:41:16.692350545,3438183,T,IEX,87.125000,100
2019-10-22 14:41:16.692389120,2019-10-22 14:41:16.692371502,3438184,T,IEX,87.125000,500
2019-10-22 14:41:19.431740928,2019-10-22 14:41:19.431722751,3439451,T,IEX,87.125000,700
2019-10-22 14:41:21.594767872,2019-10-22 14:41:21.594750309,3440584,T,IEX,87.125000,800
2019-10-22 14:41:22.942523904,2019-10-22 14:41:22.942508331,3441538,T,IEX,87.125000,500
2019-10-22 14:41:22.942543872,2019-10-22 14:41:22.942526555,3441539,T,IEX,87.125000,300
2019-10-22 14:41:25.873261056,2019-10-22 14:41:25.873239514,3443248,T,IEX,87.125000,800
2019-10-22 14:41:27.411803904,2019-10-22 14:41:27.411786316,3444346,T,IEX,87.125000,800
2019-10-22 14:41:30.7233024,2019-10-22 14:41:30.7214570,3445120,T,IEX,87.125000,800
2019-10-22 14:41:32.411855872,2019-10-22 14:41:32.411835841,3446212,T,IEX,87.125000,700
2019-10-22 14:41:34.712583936,2019-10-22 14:41:34.712566563,3447361,T,IEX,87.125000,700
2019-10-22 14:41:37.411802112,2019-10-22 14:41:37.411784785,3448734,T,IEX,87.125000,800
2019-10-22 14:41:40.188043008,2019-10-22 14:41:40.188022912,3449797,T,IEX,87.125000,800
2019-10-22 14:41:42.324513024,2019-10-22 14:41:42.324493140,3450585,T,IEX,87.125000,700
2019-10-22 14:41:43.61559040,2019-10-22 14:41:43.61538657,3451280,T,IEX,87.125000,700
2019-10-22 14:41:44.720685056,2019-10-22 14:41:44.720666407,3452845,T,IEX,87.125000,700
2019-10-22 14:41:46.271257088,2019-10-22 14:41:46.271241604,3453799,T,IEX,87.125000,600
2019-10-22 14:41:50.389755904,2019-10-22 14:41:50.389737442,3455977,T,IEX,87.125000,600
2019-10-22 14:41:55.110619904,2019-10-22 14:41:55.110600854,3458419,T,IEX,87.125000,800
2019-10-22 14:41:57.411820032,2019-10-22 14:41:57.411802746,3459490,T,IEX,87.125000,700
2019-10-22 14:42:00.5920000,2019-10-22 14:42:00.5901700,3460446,T,IEX,87.125000,600
2019-10-22 14:42:00.977366016,2019-10-22 14:42:00.977350343,3461438,T,IEX,87.125000,700
2019-10-22 14:42:04.483969024,2019-10-22 14:42:04.483951706,3464038,T,IEX,87.125000,800
2019-10-22 14:42:04.689583104,2019-10-22 14:42:04.689564913,3464410,T,IEX,87.125000,800
2019-10-22 14:42:07.411793920,2019-10-22 14:42:07.411775421,3466223,T,IEX,87.125000,700
2019-10-22 14:42:11.693122048,2019-10-22 14:42:11.693102636,3468085,T,IEX,87.125000,600
2019-10-22 14:42:11.695083008,2019-10-22 14:42:11.695063150,3468086,T,IEX,87.125000,700
2019-10-22 14:42:12.499212032,2019-10-22 14:42:12.499196903,3468859,T,IEX,87.125000,600
2019-10-22 14:42:14.900306944,2019-10-22 14:42:14.900291443,3470570,T,IEX,87.125000,800
2019-10-22 14:42:17.411691008,2019-10-22 14:42:17.411676050,3471868,T,IEX,87.125000,600
2019-10-22 14:42:18.267808000,2019-10-22 14:42:18.267789154,3472588,T,IEX,87.125000,600
2019-10-22 14:42:18.477272064,2019-10-22 14:42:18.477256715,3472809,T,IEX,87.125000,200
2019-10-22 14:42:18.477312000,2019-10-22 14:42:18.477294652,3472810,T,IEX,87.125000,300
2019-10-22 14:42:18.477352960,2019-10-22 14:42:18.477335776,3472811,T,IEX,87.125000,200
2019-10-22 14:42:18.478129920,2019-10-22 14:42:18.478113779,3472813,T,IEX,87.125000,300
2019-10-22 14:42:18.582545920,2019-10-22 14:42:18.582528565,3472915,T,IEX,87.125000,200
2019-10-22 14:42:19.471267072,2019-10-22 14:42:19.471251467,3473572,T,IEX,87.125000,600
2019-10-22 14:42:19.563208960,2019-10-22 14:42:19.563188518,3473626,T,IEX,87.125000,2000
2019-10-22 14:42:21.302245888,2019-10-22 14:42:21.302230979,3474683,T,IEX,87.125000,800
2019-10-22 14:42:23.450112000,2019-10-22 14:42:23.450092276,3475615,T,IEX,87.125000,600
2019-10-22 14:42:25.618959104,2019-10-22 14:42:25.618939860,3476439,T,IEX,87.125000,600
2019-10-22 14:42:27.411689984,2019-10-22 14:42:27.411673445,3477090,T,IEX,87.125000,700
2019-10-22 14:42:28.994013952,2019-10-22 14:42:28.993991465,3477655,T,IEX,87.125000,600
2019-10-22 14:42:30.699949056,2019-10-22 14:42:30.699931457,3478253,T,IEX,87.125000,600
2019-10-22 14:42:33.792044032,2019-10-22 14:42:33.792019199,3480143,T,IEX,87.125000,800
2019-10-22 14:42:36.8271104,2019-10-22 14:42:36.8255342,3481495,T,IEX,87.125000,700
2019-10-22 14:42:38.473364992,2019-10-22 14:42:38.473349428,3482684,T,IEX,87.125000,700
2019-10-22 14:42:41.692284928,2019-10-22 14:42:41.692266529,3483709,T,IEX,87.125000,700
2019-10-22 14:42:44.459502080,2019-10-22 14:42:44.459481424,3485260,T,IEX,87.125000,700
2019-10-22 14:42:47.411698944,2019-10-22 14:42:47.411679145,3486624,T,IEX,87.125000,200
2019-10-22 14:42:47.419728896,2019-10-22 14:42:47.419707488,3486625,T,IEX,87.125000,600
2019-10-22 14:42:53.265538048,2019-10-22 14:42:53.265522774,3490195,T,IEX,87.125000,700
2019-10-22 14:43:00.5565952,2019-10-22 14:43:00.5549760,3494233,T,IEX,87.125000,700
2019-10-22 14:43:06.475169024,2019-10-22 14:43:06.475151966,3498191,T,IEX,87.125000,800
2019-10-22 14:43:08.253061888,2019-10-22 14:43:08.253044577,3500164,T,IEX,87.125000,800
2019-10-22 14:43:20.853617920,2019-10-22 14:43:20.853599968,3507365,T,IEX,87.125000,600
2019-10-22 14:43:24.340869120,2019-10-22 14:43:24.340849674,3508994,T,IEX,87.125000,800
2019-10-22 14:43:30.5484032,2019-10-22 14:43:30.5466140,3511435,T,IEX,87.125000,800
2019-10-22 14:43:36.282665984,2019-10-22 14:43:36.282648551,3514213,T,IEX,87.125000,600
2019-10-22 14:43:40.881666048,2019-10-22 14:43:40.881649650,3516431,T,IEX,87.125000,600
2019-10-22 14:43:43.132082944,2019-10-22 14:43:43.132063402,3517582,T,IEX,87.125000,700
2019-10-22 14:43:47.386958080,2019-10-22 14:43:47.386939105,3519481,T,IEX,87.125000,700
2019-10-22 14:43:51.287325952,2019-10-22 14:43:51.287307472,3521088,T,IEX,87.125000,700
2019-10-22 14:44:00.6944000,2019-10-22 14:44:00.6924197,3525857,T,IEX,87.125000,800
2019-10-22 14:44:04.501786112,2019-10-22 14:44:04.501769580,3527970,T,IEX,87.125000,600
2019-10-22 14:44:08.418392064,2019-10-22 14:44:08.418376399,3529506,T,IEX,87.125000,700
2019-10-22 14:44:12.926379008,2019-10-22 14:44:12.926358957,3531960,T,IEX,87.125000,700
2019-10-22 14:44:19.692103936,2019-10-22 14:44:19.692084505,3535185,T,IEX,87.125000,600
2019-10-22 14:44:23.674593024,2019-10-22 14:44:23.674577024,3536840,T,IEX,87.125000,600
2019-10-22 14:44:25.436758016,2019-10-22 14:44:25.436739172,3538080,T,IEX,87.125000,700
2019-10-22 14:44:30.5265920,2019-10-22 14:44:30.5245190,3540698,T,IEX,87.125000,500
2019-10-22 14:44:43.357892096,2019-10-22 14:44:43.357874359,3548072,T,IEX,87.125000,100
2019-10-22 14:45:05.545367040,2019-10-22 14:45:05.545350989,3564209,T,IEX,87.115000,100
2019-10-22 14:45:06.96164096,2019-10-22 14:45:06.96145972,3564704,T,IEX,87.115000,100
2019-10-22 14:45:37.940903936,2019-10-22 14:45:37.940882816,3585085,T,IEX,87.115000,1
2019-10-22 14:46:01.228464896,2019-10-22 14:46:01.228446749,3599761,T,IEX,87.115000,1
2019-10-22 14:46:50.110811904,2019-10-22 14:46:50.110793277,3628266,T,IEX,87.115000,100
2019-10-22 14:47:14.957726976,2019-10-22 14:47:14.957709127,3641404,T,IEX,87.115000,100
2019-10-22 14:47:26.903486976,2019-10-22 14:47:26.903467643,3648073,T,IEX,87.120000,200
2019-10-22 14:47:26.903499008,2019-10-22 14:47:26.903480387,3648074,T,IEX,87.120000,500
2019-10-22 14:48:26.895324928,2019-10-22 14:48:26.895305897,3682256,T,IEX,87.115000,100
2019-10-22 14:49:10.729690880,2019-10-22 14:49:10.729671512,3705898,T,IEX,87.115000,100
2019-10-22 14:49:10.830955008,2019-10-22 14:49:10.830937561,3705955,T,IEX,87.115000,100
2019-10-22 14:49:10.932186112,2019-10-22 14:49:10.932167967,3706007,T,IEX,87.115000,100
2019-10-22 14:49:16.278350080,2019-10-22 14:49:16.278334061,3709449,T,IEX,87.115000,100
2019-10-22 14:49:16.379586048,2019-10-22 14:49:16.379567561,3709486,T,IEX,87.115000,100
2019-10-22 14:49:16.480788992,2019-10-22 14:49:16.480770498,3709512,T,IEX,87.115000,100
2019-10-22 14:49:16.581984000,2019-10-22 14:49:16.581965153,3709540,T,IEX,87.115000,100
2019-10-22 14:50:33.301618944,2019-10-22 14:50:33.301601131,3749040,T,IEX,87.115000,100
2019-10-22 14:51:46.400322048,2019-10-22 14:51:46.400303495,3787404,T,IEX,87.115000,100
2019-10-22 14:52:55.434192896,2019-10-22 14:52:55.434175739,3823428,T,IEX,87.115000,100
2019-10-22 14:53:17.412154112,2019-10-22 14:53:17.412135554,3839308,T,IEX,87.115000,100
2019-10-22 14:55:23.453369088,2019-10-22 14:55:23.453349491,3905284,T,IEX,87.115000,100
2019-10-22 14:56:31.166895104,2019-10-22 14:56:31.166877401,3941064,T,IEX,87.105000,100
2019-10-22 14:56:56.784314112,2019-10-22 14:56:56.784292201,3954496,T,IEX,87.105000,100
2019-10-22 14:56:59.861221120,2019-10-22 14:56:59.861202916,3961910,T,IEX,87.110000,100
2019-10-22 14:57:15.257379072,2019-10-22 14:57:15.257359834,3992357,T,IEX,87.125000,100
2019-10-22 14:57:15.257637120,2019-10-22 14:57:15.257619179,3992359,T,IEX,87.125000,100
2019-10-22 14:57:15.257721088,2019-10-22 14:57:15.257699078,3992362,T,IEX,87.125000,100
2019-10-22 14:57:15.258202112,2019-10-22 14:57:15.258186356,3992363,T,IEX,87.125000,100
2019-10-22 14:57:15.259030016,2019-10-22 14:57:15.259012470,3992365,T,IEX,87.125000,100
2019-10-22 14:57:15.259838976,2019-10-22 14:57:15.259820207,3992366,T,IEX,87.125000,100
2019-10-22 14:57:15.260645888,2019-10-22 14:57:15.260630217,3992367,T,IEX,87.125000,100
2019-10-22 14:57:15.261462016,2019-10-22 14:57:15.261447139,3992369,T,IEX,87.125000,100
2019-10-22 14:58:54.398031872,2019-10-22 14:58:54.398013627,4075332,T,IEX,87.130000,1
2019-10-22 14:58:56.176062976,2019-10-22 14:58:56.176043936,4077089,T,IEX,87.130000,136
2019-10-22 14:58:56.769643008,2019-10-22 14:58:56.769623907,4077553,T,IEX,87.130000,72
2019-10-22 15:01:00.434579968,2019-10-22 15:01:00.434561298,4170379,T,IEX,87.125000,100
2019-10-22 15:01:18.40054016,2019-10-22 15:01:18.40035773,4188399,T,IEX,87.125000,100
2019-10-22 15:01:18.40070912,2019-10-22 15:01:18.40053241,4188400,T,IEX,87.125000,100
2019-10-22 15:03:28.288038912,2019-10-22 15:03:28.288021753,4266667,T,IEX,87.120000,200
2019-10-22 15:03:28.289350912,2019-10-22 15:03:28.289333869,4266672,T,IEX,87.120000,29
2019-10-22 15:03:28.296889088,2019-10-22 15:03:28.296871956,4266704,T,IEX,87.115000,100
2019-10-22 15:08:29.902424064,2019-10-22 15:08:29.902408014,4462883,T,IEX,87.135000,200
2019-10-22 15:08:40.495912960,2019-10-22 15:08:40.495895210,4469797,T,IEX,87.135000,800
2019-10-22 15:08:40.495926016,2019-10-22 15:08:40.495908161,4469798,T,IEX,87.135000,100
2019-10-22 15:08:40.495940096,2019-10-22 15:08:40.495922000,4469799,T,IEX,87.135000,100
2019-10-22 15:08:40.496753920,2019-10-22 15:08:40.496735543,4469805,T,IEX,87.135000,100
2019-10-22 15:08:40.496798976,2019-10-22 15:08:40.496782223,4469806,T,IEX,87.135000,100
2019-10-22 15:08:40.497572096,2019-10-22 15:08:40.497556637,4469807,T,IEX,87.135000,100
2019-10-22 15:08:55.719546112,2019-10-22 15:08:55.719527125,4476768,T,IEX,87.135000,100
2019-10-22 15:08:55.719789056,2019-10-22 15:08:55.719769577,4476785,T,IEX,87.135000,100
2019-10-22 15:08:56.855960064,2019-10-22 15:08:56.855940595,4477377,T,IEX,87.135000,100
2019-10-22 15:08:56.856816128,2019-10-22 15:08:56.856797072,4477414,T,IEX,87.135000,100
2019-10-22 15:08:57.223174912,2019-10-22 15:08:57.223156109,4477700,T,IEX,87.135000,100
2019-10-22 15:08:57.224002048,2019-10-22 15:08:57.223983081,4477701,T,IEX,87.135000,100
2019-10-22 15:08:57.236054016,2019-10-22 15:08:57.236037769,4477713,T,IEX,87.135000,100
2019-10-22 15:08:57.236881920,2019-10-22 15:08:57.236862756,4477717,T,IEX,87.135000,100
2019-10-22 15:08:57.237689088,2019-10-22 15:08:57.237672892,4477719,T,IEX,87.135000,100
2019-10-22 15:08:57.238498048,2019-10-22 15:08:57.238482221,4477722,T,IEX,87.135000,100
2019-10-22 15:08:57.346260992,2019-10-22 15:08:57.346242818,4477779,T,IEX,87.135000,100
2019-10-22 15:08:57.348060928,2019-10-22 15:08:57.348043198,4477823,T,IEX,87.135000,100
2019-10-22 15:08:57.348968960,2019-10-22 15:08:57.348952945,4477840,T,IEX,87.135000,100
2019-10-22 15:08:57.349779968,2019-10-22 15:08:57.349762008,4477844,T,IEX,87.135000,100
2019-10-22 15:08:57.350587904,2019-10-22 15:08:57.350571195,4477848,T,IEX,87.135000,100
2019-10-22 15:08:57.351398912,2019-10-22 15:08:57.351382734,4477854,T,IEX,87.135000,100
2019-10-22 15:08:57.352205056,2019-10-22 15:08:57.352189458,4477858,T,IEX,87.135000,100
2019-10-22 15:08:58.705095936,2019-10-22 15:08:58.705081001,4478562,T,IEX,87.135000,700
2019-10-22 15:09:02.726487040,2019-10-22 15:09:02.726468901,4481629,T,IEX,87.135000,300
2019-10-22 15:09:02.726582016,2019-10-22 15:09:02.726563517,4481634,T,IEX,87.135000,300
2019-10-22 15:09:02.726617088,2019-10-22 15:09:02.726600883,4481635,T,IEX,87.135000,300
2019-10-22 15:09:02.726746880,2019-10-22 15:09:02.726728711,4481639,T,IEX,87.135000,200
2019-10-22 15:09:02.727358976,2019-10-22 15:09:02.727341224,4481656,T,IEX,87.135000,100
2019-10-22 15:09:02.727565056,2019-10-22 15:09:02.727543112,4481666,T,IEX,87.135000,100
2019-10-22 15:09:02.728140032,2019-10-22 15:09:02.728122672,4481688,T,IEX,87.135000,157
2019-10-22 15:09:02.729585920,2019-10-22 15:09:02.729568355,4481728,T,IEX,87.135000,700
2019-10-22 15:09:02.729742080,2019-10-22 15:09:02.729724366,4481732,T,IEX,87.135000,100
2019-10-22 15:09:03.228072960,2019-10-22 15:09:03.228054190,4482274,T,IEX,87.135000,300
2019-10-22 15:09:03.765133056,2019-10-22 15:09:03.765115649,4482671,T,IEX,87.135000,300
2019-10-22 15:09:04.148858112,2019-10-22 15:09:04.148840436,4483084,T,IEX,87.135000,163
2019-10-22 15:09:04.149219072,2019-10-22 15:09:04.149202708,4483085,T,IEX,87.135000,100
2019-10-22 15:09:04.150337024,2019-10-22 15:09:04.150320703,4483090,T,IEX,87.135000,700
2019-10-22 15:09:04.464066048,2019-10-22 15:09:04.464049012,4483396,T,IEX,87.135000,100
2019-10-22 15:09:04.465560064,2019-10-22 15:09:04.465537210,4483406,T,IEX,87.135000,100
2019-10-22 15:09:04.467044096,2019-10-22 15:09:04.467024512,4483414,T,IEX,87.135000,100
2019-10-22 15:09:04.468573952,2019-10-22 15:09:04.468557198,4483416,T,IEX,87.135000,100
2019-10-22 15:09:04.470064896,2019-10-22 15:09:04.470047434,4483419,T,IEX,87.135000,100
2019-10-22 15:09:04.471539968,2019-10-22 15:09:04.471520933,4483420,T,IEX,87.135000,100
2019-10-22 15:09:04.473026048,2019-10-22 15:09:04.473009135,4483422,T,IEX,87.135000,100
2019-10-22 15:09:07.223256064,2019-10-22 15:09:07.223238303,4485114,T,IEX,87.135000,800
2019-10-22 15:09:10.668503040,2019-10-22 15:09:10.668483323,4487577,T,IEX,87.135000,700
2019-10-22 15:09:12.51831040,2019-10-22 15:09:12.51813088,4488404,T,IEX,87.135000,700
2019-10-22 15:09:17.223191040,2019-10-22 15:09:17.223170435,4491008,T,IEX,87.135000,600
2019-10-22 15:09:17.640240128,2019-10-22 15:09:17.640223039,4491381,T,IEX,87.135000,100
2019-10-22 15:09:17.640445952,2019-10-22 15:09:17.640427914,4491388,T,IEX,87.135000,200
2019-10-22 15:09:17.640709120,2019-10-22 15:09:17.640689582,4491398,T,IEX,87.135000,100
2019-10-22 15:09:17.641527040,2019-10-22 15:09:17.641508649,4491414,T,IEX,87.135000,240
2019-10-22 15:09:17.649965056,2019-10-22 15:09:17.649948085,4491483,T,IEX,87.135000,600
2019-10-22 15:09:21.55558912,2019-10-22 15:09:21.55541341,4493924,T,IEX,87.135000,100
2019-10-22 15:09:21.134896128,2019-10-22 15:09:21.134869809,4494337,T,IEX,87.135000,600
2019-10-22 15:09:21.162183936,2019-10-22 15:09:21.162165326,4494437,T,IEX,87.135000,100
2019-10-22 15:09:21.162344960,2019-10-22 15:09:21.162329062,4494438,T,IEX,87.135000,299
2019-10-22 15:09:21.162383872,2019-10-22 15:09:21.162366992,4494439,T,IEX,87.135000,200
2019-10-22 15:09:21.162674944,2019-10-22 15:09:21.162658664,4494440,T,IEX,87.135000,100
2019-10-22 15:09:21.163308032,2019-10-22 15:09:21.163288530,4494441,T,IEX,87.135000,100
2019-10-22 15:09:21.416016896,2019-10-22 15:09:21.415998700,4494704,T,IEX,87.135000,100
2019-10-22 15:09:21.425729024,2019-10-22 15:09:21.425706700,4494708,T,IEX,87.135000,100
2019-10-22 15:09:21.711920896,2019-10-22 15:09:21.711899949,4494897,T,IEX,87.135000,100
2019-10-22 15:09:21.712061952,2019-10-22 15:09:21.712044366,4494898,T,IEX,87.135000,100
2019-10-22 15:09:21.831209984,2019-10-22 15:09:21.831190323,4494987,T,IEX,87.135000,100
2019-10-22 15:09:21.832849920,2019-10-22 15:09:21.832832950,4495014,T,IEX,87.135000,100
2019-10-22 15:09:21.832974080,2019-10-22 15:09:21.832956799,4495018,T,IEX,87.135000,160
2019-10-22 15:09:21.833014016,2019-10-22 15:09:21.832997105,4495020,T,IEX,87.135000,120
2019-10-22 15:09:21.835118080,2019-10-22 15:09:21.835100855,4495040,T,IEX,87.135000,100
2019-10-22 15:09:22.200136960,2019-10-22 15:09:22.200120056,4495298,T,IEX,87.135000,100
2019-10-22 15:09:23.368659968,2019-10-22 15:09:23.368642200,4496364,T,IEX,87.135000,800
2019-10-22 15:09:23.588410112,2019-10-22 15:09:23.588392587,4496643,T,IEX,87.135000,100
2019-10-22 15:09:25.286616064,2019-10-22 15:09:25.286599714,4497878,T,IEX,87.135000,800
2019-10-22 15:09:25.287414016,2019-10-22 15:09:25.287394080,4497879,T,IEX,87.135000,300
2019-10-22 15:09:25.287450112,2019-10-22 15:09:25.287431565,4497880,T,IEX,87.135000,100
2019-10-22 15:09:25.287582976,2019-10-22 15:09:25.287566464,4497882,T,IEX,87.135000,100
2019-10-22 15:09:25.287894016,2019-10-22 15:09:25.287875382,4497884,T,IEX,87.135000,120
2019-10-22 15:09:25.288285952,2019-10-22 15:09:25.288269527,4497885,T,IEX,87.135000,100
2019-10-22 15:09:27.907353088,2019-10-22 15:09:27.907333205,4500836,T,IEX,87.135000,100
2019-10-22 15:09:27.909754880,2019-10-22 15:09:27.909734427,4500838,T,IEX,87.135000,600
2019-10-22 15:09:32.592590080,2019-10-22 15:09:32.592572978,4503989,T,IEX,87.135000,700
2019-10-22 15:09:37.223152896,2019-10-22 15:09:37.223129849,4506324,T,IEX,87.135000,600
2019-10-22 15:09:39.525458944,2019-10-22 15:09:39.525438591,4507952,T,IEX,87.135000,700
2019-10-22 15:09:42.590353920,2019-10-22 15:09:42.590336496,4511182,T,IEX,87.135000,700
2019-10-22 15:09:47.223239936,2019-10-22 15:09:47.223224438,4513565,T,IEX,87.135000,600
2019-10-22 15:09:50.498793984,2019-10-22 15:09:50.498777056,4515009,T,IEX,87.135000,800
2019-10-22 15:09:52.136432896,2019-10-22 15:09:52.136416472,4516423,T,IEX,87.135000,600
2019-10-22 15:09:54.951610112,2019-10-22 15:09:54.951587054,4517898,T,IEX,87.135000,800
2019-10-22 15:09:57.223182080,2019-10-22 15:09:57.223163547,4519488,T,IEX,87.135000,800
2019-10-22 15:09:59.800710912,2019-10-22 15:09:59.800690554,4521087,T,IEX,87.135000,800
2019-10-22 15:10:02.507885056,2019-10-22 15:10:02.507866695,4523681,T,IEX,87.135000,600
2019-10-22 15:10:07.641999872,2019-10-22 15:10:07.641981089,4528382,T,IEX,87.135000,700
2019-10-22 15:10:11.541212928,2019-10-22 15:10:11.541192799,4530352,T,IEX,87.135000,800
2019-10-22 15:10:16.220785920,2019-10-22 15:10:16.220765966,4532814,T,IEX,87.135000,700
2019-10-22 15:10:17.24888064,2019-10-22 15:10:17.24869635,4533270,T,IEX,87.135000,700
2019-10-22 15:10:20.619740928,2019-10-22 15:10:20.619718868,4535444,T,IEX,87.135000,100
2019-10-22 15:10:20.623680000,2019-10-22 15:10:20.623660892,4535609,T,IEX,87.135000,800
2019-10-22 15:10:20.850674944,2019-10-22 15:10:20.850657685,4536006,T,IEX,87.135000,100
2019-10-22 15:10:21.298148096,2019-10-22 15:10:21.298127583,4536432,T,IEX,87.135000,600
2019-10-22 15:10:21.664826880,2019-10-22 15:10:21.664808085,4536594,T,IEX,87.135000,283
2019-10-22 15:10:21.665299968,2019-10-22 15:10:21.665282201,4536596,T,IEX,87.135000,100
2019-10-22 15:10:22.120931072,2019-10-22 15:10:22.120911366,4536961,T,IEX,87.135000,100
2019-10-22 15:10:22.951815936,2019-10-22 15:10:22.951794740,4537317,T,IEX,87.135000,100
2019-10-22 15:10:22.951855104,2019-10-22 15:10:22.951837002,4537318,T,IEX,87.135000,200
2019-10-22 15:10:22.952250112,2019-10-22 15:10:22.952231276,4537323,T,IEX,87.135000,100
2019-10-22 15:10:22.952289024,2019-10-22 15:10:22.952271992,4537324,T,IEX,87.135000,100
2019-10-22 15:10:22.953421056,2019-10-22 15:10:22.953403219,4537334,T,IEX,87.135000,700
2019-10-22 15:10:23.13703936,2019-10-22 15:10:23.13681746,4537375,T,IEX,87.135000,100
2019-10-22 15:10:25.351766016,2019-10-22 15:10:25.351748402,4538572,T,IEX,87.135000,100
2019-10-22 15:10:25.352560896,2019-10-22 15:10:25.352543190,4538574,T,IEX,87.135000,700
2019-10-22 15:10:27.606435072,2019-10-22 15:10:27.606417411,4539614,T,IEX,87.135000,600
2019-10-22 15:10:29.217442048,2019-10-22 15:10:29.217421335,4541691,T,IEX,87.135000,600
2019-10-22 15:10:30.378365952,2019-10-22 15:10:30.378351570,4542944,T,IEX,87.135000,100
2019-10-22 15:10:30.378745088,2019-10-22 15:10:30.378727105,4542946,T,IEX,87.135000,100
2019-10-22 15:10:30.380065024,2019-10-22 15:10:30.380045052,4542957,T,IEX,87.135000,700
2019-10-22 15:10:30.683870976,2019-10-22 15:10:30.683851648,4543992,T,IEX,87.135000,100
2019-10-22 15:10:30.684119040,2019-10-22 15:10:30.684101660,4543998,T,IEX,87.135000,121
2019-10-22 15:10:30.684155904,2019-10-22 15:10:30.684138386,4543999,T,IEX,87.135000,100
2019-10-22 15:10:30.684215040,2019-10-22 15:10:30.684196532,4544002,T,IEX,87.135000,156
2019-10-22 15:10:30.684279040,2019-10-22 15:10:30.684259525,4544005,T,IEX,87.135000,200
2019-10-22 15:10:30.684941056,2019-10-22 15:10:30.684922491,4544013,T,IEX,87.135000,100
2019-10-22 15:10:30.685786112,2019-10-22 15:10:30.685768979,4544022,T,IEX,87.135000,100
2019-10-22 15:10:30.687433984,2019-10-22 15:10:30.687413901,4544027,T,IEX,87.135000,100
2019-10-22 15:10:30.689061888,2019-10-22 15:10:30.689041747,4544028,T,IEX,87.135000,100
2019-10-22 15:10:30.690681088,2019-10-22 15:10:30.690664392,4544031,T,IEX,87.135000,100
2019-10-22 15:10:30.692318976,2019-10-22 15:10:30.692301798,4544037,T,IEX,87.135000,100
2019-10-22 15:10:30.753634048,2019-10-22 15:10:30.753617324,4544142,T,IEX,87.135000,100
2019-10-22 15:10:30.787770880,2019-10-22 15:10:30.787749904,4544172,T,IEX,87.135000,100
2019-10-22 15:10:30.789402112,2019-10-22 15:10:30.789382062,4544175,T,IEX,87.135000,100
2019-10-22 15:10:30.836044032,2019-10-22 15:10:30.836025390,4544209,T,IEX,87.135000,100
2019-10-22 15:10:30.890121984,2019-10-22 15:10:30.890100689,4544256,T,IEX,87.135000,100
2019-10-22 15:10:30.891734016,2019-10-22 15:10:30.891715800,4544262,T,IEX,87.135000,100
2019-10-22 15:10:30.973953024,2019-10-22 15:10:30.973931770,4544414,T,IEX,87.135000,100
2019-10-22 15:10:31.36780032,2019-10-22 15:10:31.36758421,4544504,T,IEX,87.135000,600
2019-10-22 15:10:31.38409984,2019-10-22 15:10:31.38393979,4544507,T,IEX,87.135000,100
2019-10-22 15:10:31.169331968,2019-10-22 15:10:31.169316307,4544712,T,IEX,87.135000,100
2019-10-22 15:10:31.424357888,2019-10-22 15:10:31.424337208,4545106,T,IEX,87.130000,10
2019-10-22 15:10:31.426031104,2019-10-22 15:10:31.426014082,4545116,T,IEX,87.135000,100
2019-10-22 15:10:31.684904960,2019-10-22 15:10:31.684885524,4545388,T,IEX,87.135000,100
2019-10-22 15:10:32.30348032,2019-10-22 15:10:32.30330517,4545694,T,IEX,87.135000,100
2019-10-22 15:10:32.35906048,2019-10-22 15:10:32.35888129,4545710,T,IEX,87.135000,102
2019-10-22 15:10:32.35944960,2019-10-22 15:10:32.35928304,4545712,T,IEX,87.135000,100
2019-10-22 15:10:32.36455936,2019-10-22 15:10:32.36439160,4545721,T,IEX,87.135000,100
2019-10-22 15:10:32.36762880,2019-10-22 15:10:32.36746818,4545726,T,IEX,87.135000,300
2019-10-22 15:10:32.463194112,2019-10-22 15:10:32.463178242,4546002,T,IEX,87.135000,100
2019-10-22 15:10:32.463591936,2019-10-22 15:10:32.463574192,4546003,T,IEX,87.135000,240
2019-10-22 15:10:32.463630080,2019-10-22 15:10:32.463611741,4546004,T,IEX,87.135000,136
2019-10-22 15:10:32.463731968,2019-10-22 15:10:32.463712939,4546007,T,IEX,87.135000,200
2019-10-22 15:10:32.534934016,2019-10-22 15:10:32.534917185,4546075,T,IEX,87.135000,50
2019-10-22 15:10:32.534953984,2019-10-22 15:10:32.534936915,4546076,T,IEX,87.135000,800
2019-10-22 15:10:37.223194880,2019-10-22 15:10:37.223172660,4549977,T,IEX,87.135000,600
2019-10-22 15:10:37.224546048,2019-10-22 15:10:37.224525780,4549978,T,IEX,87.135000,700
2019-10-22 15:10:39.285545984,2019-10-22 15:10:39.285530429,4550943,T,IEX,87.135000,600
2019-10-22 15:10:41.370961920,2019-10-22 15:10:41.370944802,4552199,T,IEX,87.135000,800
2019-10-22 15:10:44.78813952,2019-10-22 15:10:44.78796208,4554035,T,IEX,87.135000,600
2019-10-22 15:10:46.367766016,2019-10-22 15:10:46.367748367,4555173,T,IEX,87.135000,800
2019-10-22 15:10:48.890750976,2019-10-22 15:10:48.890733630,4556765,T,IEX,87.135000,800
2019-10-22 15:10:50.623970048,2019-10-22 15:10:50.623950613,4557625,T,IEX,87.135000,800
2019-10-22 15:10:52.608449024,2019-10-22 15:10:52.608431062,4558567,T,IEX,87.135000,700
2019-10-22 15:10:55.243461120,2019-10-22 15:10:55.243446061,4560813,T,IEX,87.135000,600
2019-10-22 15:10:57.223287040,2019-10-22 15:10:57.223266969,4561765,T,IEX,87.135000,700
2019-10-22 15:10:58.909579008,2019-10-22 15:10:58.909557430,4563302,T,IEX,87.135000,800
2019-10-22 15:11:03.6838016,2019-10-22 15:11:03.6820147,4566300,T,IEX,87.135000,700
2019-10-22 15:11:04.236230912,2019-10-22 15:11:04.236214044,4567355,T,IEX,87.135000,22563
2019-10-22 15:11:04.335079936,2019-10-22 15:11:04.335060468,4567391,T,IEX,87.130000,1
2019-10-22 15:11:04.338637056,2019-10-22 15:11:04.338616668,4567393,T,IEX,87.135000,100
2019-10-22 15:11:04.338650112,2019-10-22 15:11:04.338632687,4567394,T,IEX,87.135000,200
2019-10-22 15:11:04.338664960,2019-10-22 15:11:04.338648014,4567395,T,IEX,87.135000,100
2019-10-22 15:11:04.339480064,2019-10-22 15:11:04.339461372,4567396,T,IEX,87.135000,300
2019-10-22 15:11:04.340303872,2019-10-22 15:11:04.340283971,4567397,T,IEX,87.135000,300
2019-10-22 15:11:04.341325056,2019-10-22 15:11:04.341305842,4567398,T,IEX,87.135000,300
2019-10-22 15:11:04.345188096,2019-10-22 15:11:04.345168251,4567399,T,IEX,87.135000,100
2019-10-22 15:11:04.345251072,2019-10-22 15:11:04.345231817,4567400,T,IEX,87.135000,200
2019-10-22 15:11:04.348643072,2019-10-22 15:11:04.348623011,4567401,T,IEX,87.135000,100
2019-10-22 15:11:04.350298112,2019-10-22 15:11:04.350277875,4567402,T,IEX,87.135000,100
2019-10-22 15:11:04.360779008,2019-10-22 15:11:04.360758198,4567404,T,IEX,87.135000,100
2019-10-22 15:11:04.371845888,2019-10-22 15:11:04.371825463,4567409,T,IEX,87.135000,100
2019-10-22 15:11:04.382732032,2019-10-22 15:11:04.382711540,4567412,T,IEX,87.135000,100
2019-10-22 15:11:04.393387008,2019-10-22 15:11:04.393366734,4567415,T,IEX,87.135000,100
2019-10-22 15:11:04.404632064,2019-10-22 15:11:04.404614831,4567417,T,IEX,87.135000,100
2019-10-22 15:11:04.415079936,2019-10-22 15:11:04.415061839,4567420,T,IEX,87.135000,100
2019-10-22 15:11:04.458288896,2019-10-22 15:11:04.458269395,4567427,T,IEX,87.135000,100
2019-10-22 15:11:04.485374976,2019-10-22 15:11:04.485354531,4567433,T,IEX,87.135000,100
2019-10-22 15:11:04.486863872,2019-10-22 15:11:04.486845938,4567440,T,IEX,87.135000,100
2019-10-22 15:11:04.486942976,2019-10-22 15:11:04.486924768,4567441,T,IEX,87.135000,100
2019-10-22 15:11:04.488862976,2019-10-22 15:11:04.488842807,4567443,T,IEX,87.135000,100
2019-10-22 15:11:04.492357120,2019-10-22 15:11:04.492337778,4567447,T,IEX,87.135000,100
2019-10-22 15:11:04.506125056,2019-10-22 15:11:04.506105461,4567456,T,IEX,87.135000,100
2019-10-22 15:11:05.751300096,2019-10-22 15:11:05.751284820,4568307,T,IEX,87.135000,700
2019-10-22 15:11:06.149840896,2019-10-22 15:11:06.149821493,4568734,T,IEX,87.135000,300
2019-10-22 15:11:12.223160064,2019-10-22 15:11:12.223144185,4572399,T,IEX,87.135000,600
2019-10-22 15:11:14.768058880,2019-10-22 15:11:14.768040327,4573622,T,IEX,87.135000,800
2019-10-22 15:11:15.814166016,2019-10-22 15:11:15.814148668,4574075,T,IEX,87.135000,300
2019-10-22 15:11:15.847695872,2019-10-22 15:11:15.847678685,4574119,T,IEX,87.135000,100
2019-10-22 15:11:16.948802048,2019-10-22 15:11:16.948782672,4574916,T,IEX,87.135000,157
2019-10-22 15:11:18.561329920,2019-10-22 15:11:18.561314662,4575699,T,IEX,87.135000,700
2019-10-22 15:11:20.221715968,2019-10-22 15:11:20.221694783,4576652,T,IEX,87.135000,600
2019-10-22 15:11:22.223136000,2019-10-22 15:11:22.223117842,4577811,T,IEX,87.135000,600
2019-10-22 15:11:23.703289088,2019-10-22 15:11:23.703271266,4578501,T,IEX,87.135000,600
2019-10-22 15:11:25.30646016,2019-10-22 15:11:25.30628895,4579699,T,IEX,87.135000,800
2019-10-22 15:11:28.512716032,2019-10-22 15:11:28.512696112,4581786,T,IEX,87.135000,800
2019-10-22 15:11:30.5455104,2019-10-22 15:11:30.5435054,4582700,T,IEX,87.135000,700
2019-10-22 15:11:33.422874880,2019-10-22 15:11:33.422855235,4584590,T,IEX,87.135000,700
2019-10-22 15:11:34.463748096,2019-10-22 15:11:34.463729236,4585169,T,IEX,87.135000,700
2019-10-22 15:11:35.226430976,2019-10-22 15:11:35.226410705,4585500,T,IEX,87.135000,100
2019-10-22 15:11:35.367398912,2019-10-22 15:11:35.367379665,4585601,T,IEX,87.135000,100
2019-10-22 15:11:36.406727936,2019-10-22 15:11:36.406708359,4586058,T,IEX,87.135000,100
2019-10-22 15:11:37.257946112,2019-10-22 15:11:37.257929114,4586385,T,IEX,87.135000,800
2019-10-22 15:11:37.280815104,2019-10-22 15:11:37.280796615,4586417,T,IEX,87.135000,100
2019-10-22 15:11:37.281271040,2019-10-22 15:11:37.281255688,4586418,T,IEX,87.135000,100
2019-10-22 15:11:41.149381888,2019-10-22 15:11:41.149364353,4588465,T,IEX,87.135000,700
2019-10-22 15:11:48.891363072,2019-10-22 15:11:48.891340524,4592486,T,IEX,87.135000,143
2019-10-22 15:12:40.154792960,2019-10-22 15:12:40.154776621,4619922,T,IEX,87.125000,90
2019-10-22 15:12:40.154810112,2019-10-22 15:12:40.154793639,4619923,T,IEX,87.125000,99
2019-10-22 15:12:56.498157056,2019-10-22 15:12:56.498137094,4626688,T,IEX,87.125000,300
2019-10-22 15:12:56.498255872,2019-10-22 15:12:56.498235600,4626691,T,IEX,87.125000,200
2019-10-22 15:17:33.158212096,2019-10-22 15:17:33.158195915,4803053,T,IEX,87.115000,300
2019-10-22 15:17:41.32902912,2019-10-22 15:17:41.32884999,4806814,T,IEX,87.115000,800
2019-10-22 15:17:41.34242048,2019-10-22 15:17:41.34225522,4806817,T,IEX,87.115000,600
2019-10-22 15:17:41.35525120,2019-10-22 15:17:41.35509594,4806821,T,IEX,87.115000,300
2019-10-22 15:17:56.593579008,2019-10-22 15:17:56.593559577,4815087,T,IEX,87.115000,1
2019-10-22 15:17:56.917940992,2019-10-22 15:17:56.917921177,4815313,T,IEX,87.120000,682
2019-10-22 15:18:49.158370048,2019-10-22 15:18:49.158354821,4846806,T,IEX,87.120000,100
2019-10-22 15:18:49.158391040,2019-10-22 15:18:49.158373322,4846807,T,IEX,87.120000,400
2019-10-22 15:18:49.159554048,2019-10-22 15:18:49.159535268,4846809,T,IEX,87.120000,400
2019-10-22 15:22:05.584066048,2019-10-22 15:22:05.584047488,4961134,T,IEX,87.125000,8
2019-10-22 15:22:17.891617024,2019-10-22 15:22:17.891597391,4969979,T,IEX,87.125000,36
2019-10-22 15:22:41.61488128,2019-10-22 15:22:41.61470424,4986560,T,IEX,87.125000,38
2019-10-22 15:22:45.264407040,2019-10-22 15:22:45.264386279,4989789,T,IEX,87.125000,82
2019-10-22 15:24:12.51366912,2019-10-22 15:24:12.51348716,5043509,T,IEX,87.125000,600
2019-10-22 15:24:12.60836096,2019-10-22 15:24:12.60818088,5043516,T,IEX,87.125000,121
2019-10-22 15:25:42.47418880,2019-10-22 15:25:42.47400133,5095418,T,IEX,87.120000,100
2019-10-22 15:25:42.47431936,2019-10-22 15:25:42.47415312,5095419,T,IEX,87.120000,200
2019-10-22 15:30:33.681635072,2019-10-22 15:30:33.681615953,5257540,T,IEX,87.120000,59
2019-10-22 15:30:35.338319104,2019-10-22 15:30:35.338302733,5258761,T,IEX,87.120000,600
2019-10-22 15:30:35.338398976,2019-10-22 15:30:35.338381249,5258764,T,IEX,87.120000,2841
2019-10-22 15:30:35.345231872,2019-10-22 15:30:35.345212754,5258773,T,IEX,87.115000,100
2019-10-22 15:31:13.883833088,2019-10-22 15:31:13.883813004,5282503,T,IEX,87.115000,100
2019-10-22 15:31:13.884379904,2019-10-22 15:31:13.884363638,5282505,T,IEX,87.115000,100
2019-10-22 15:31:20.825378048,2019-10-22 15:31:20.825360400,5286835,T,IEX,87.115000,100
2019-10-22 15:31:24.672443904,2019-10-22 15:31:24.672426583,5288440,T,IEX,87.115000,700
2019-10-22 15:32:03.582583040,2019-10-22 15:32:03.582563760,5305852,T,IEX,87.115000,100
2019-10-22 15:32:03.683726080,2019-10-22 15:32:03.683702114,5305888,T,IEX,87.115000,100
2019-10-22 15:32:08.581020928,2019-10-22 15:32:08.581000515,5308415,T,IEX,87.115000,100
2019-10-22 15:32:08.581300992,2019-10-22 15:32:08.581283721,5308423,T,IEX,87.115000,200
2019-10-22 15:32:29.977635072,2019-10-22 15:32:29.977614225,5322254,T,IEX,87.115000,300
2019-10-22 15:32:29.978073088,2019-10-22 15:32:29.978055184,5322272,T,IEX,87.115000,100
2019-10-22 15:32:29.982320128,2019-10-22 15:32:29.982301797,5322357,T,IEX,87.115000,100
2019-10-22 15:35:35.58390016,2019-10-22 15:35:35.58366442,5413961,T,IEX,87.110000,7000
2019-10-22 15:35:35.58405888,2019-10-22 15:35:35.58387535,5413962,T,IEX,87.110000,743
2019-10-22 15:35:35.58419968,2019-10-22 15:35:35.58401000,5413963,T,IEX,87.110000,200
2019-10-22 15:35:35.58432000,2019-10-22 15:35:35.58413896,5413964,T,IEX,87.110000,4957
2019-10-22 15:36:11.268662016,2019-10-22 15:36:11.268643783,5429019,T,IEX,87.115000,200
2019-10-22 15:36:11.269690880,2019-10-22 15:36:11.269673595,5429021,T,IEX,87.115000,400
2019-10-22 15:36:11.271712000,2019-10-22 15:36:11.271692549,5429024,T,IEX,87.115000,500
2019-10-22 15:36:11.272771072,2019-10-22 15:36:11.272753973,5429026,T,IEX,87.115000,100
2019-10-22 15:36:11.274583040,2019-10-22 15:36:11.274563401,5429027,T,IEX,87.115000,100
2019-10-22 15:36:11.276724992,2019-10-22 15:36:11.276704012,5429028,T,IEX,87.115000,600
2019-10-22 15:36:11.283834112,2019-10-22 15:36:11.283684100,5429032,T,IEX,87.115000,67
2019-10-22 15:36:14.484022016,2019-10-22 15:36:14.484000666,5429986,T,IEX,87.110000,7000
2019-10-22 15:36:14.484041984,2019-10-22 15:36:14.484024904,5429987,T,IEX,87.110000,745
2019-10-22 15:36:14.484056064,2019-10-22 15:36:14.484039223,5429988,T,IEX,87.110000,4755
2019-10-22 15:36:14.484551936,2019-10-22 15:36:14.484534442,5429993,T,IEX,87.110000,200
2019-10-22 15:36:41.503025920,2019-10-22 15:36:41.503006675,5440530,T,IEX,87.115000,300
2019-10-22 15:36:41.504218112,2019-10-22 15:36:41.504194162,5440571,T,IEX,87.115000,100
2019-10-22 15:38:07.355598080,2019-10-22 15:38:07.355580660,5477376,T,IEX,87.115000,600
2019-10-22 15:38:07.355621120,2019-10-22 15:38:07.355600867,5477377,T,IEX,87.115000,7700
2019-10-22 15:38:07.373453056,2019-10-22 15:38:07.373436846,5477381,T,IEX,87.115000,10000
2019-10-22 15:38:07.374556928,2019-10-22 15:38:07.374536322,5477382,T,IEX,87.115000,1900
2019-10-22 15:38:07.375636992,2019-10-22 15:38:07.375615408,5477383,T,IEX,87.115000,300
2019-10-22 15:38:07.742398976,2019-10-22 15:38:07.742381616,5477564,T,IEX,87.115000,29
2019-10-22 15:38:07.743945984,2019-10-22 15:38:07.743924798,5477568,T,IEX,87.110000,200
2019-10-22 15:38:23.854374912,2019-10-22 15:38:23.854359376,5486091,T,IEX,87.115000,1
2019-10-22 15:38:38.74199040,2019-10-22 15:38:38.74181534,5493324,T,IEX,87.115000,100
2019-10-22 15:38:58.593072128,2019-10-22 15:38:58.593052754,5500432,T,IEX,87.115000,800
2019-10-22 15:39:17.90884096,2019-10-22 15:39:17.90865220,5509034,T,IEX,87.115000,132
2019-10-22 15:39:17.92036096,2019-10-22 15:39:17.92014678,5509035,T,IEX,87.115000,100
2019-10-22 15:39:17.93318912,2019-10-22 15:39:17.93296590,5509036,T,IEX,87.115000,100
2019-10-22 15:39:17.94539008,2019-10-22 15:39:17.94517678,5509037,T,IEX,87.115000,100
2019-10-22 15:47:11.61870080,2019-10-22 15:47:11.61850054,5705239,T,IEX,87.110000,100
2019-10-22 15:47:31.255729920,2019-10-22 15:47:31.255710308,5714663,T,IEX,87.110000,100
2019-10-22 15:52:09.992236032,2019-10-22 15:52:09.992218411,5833415,T,IEX,87.115000,22
2019-10-22 15:54:47.395702016,2019-10-22 15:54:47.395681848,5899927,T,IEX,87.110000,100
2019-10-22 15:54:49.294969088,2019-10-22 15:54:49.294948709,5900548,T,IEX,87.110000,100
2019-10-22 15:54:57.362063104,2019-10-22 15:54:57.362045212,5904384,T,IEX,87.105000,100
2019-10-22 15:54:57.463192064,2019-10-22 15:54:57.463175036,5904440,T,IEX,87.105000,100
2019-10-22 15:55:02.697369088,2019-10-22 15:55:02.697347432,5907874,T,IEX,87.100000,100
2019-10-22 15:55:22.311819008,2019-10-22 15:55:22.311796022,5917812,T,IEX,87.095000,300
2019-10-22 15:59:06.852955904,2019-10-22 15:59:06.852936956,6038480,T,IEX,87.085000,100
2019-10-22 15:59:06.853248000,2019-10-22 15:59:06.853228522,6038494,T,IEX,87.085000,100
2019-10-22 15:59:06.854099968,2019-10-22 15:59:06.854077777,6038519,T,IEX,87.085000,100
2019-10-22 15:59:35.300891904,2019-10-22 15:59:35.300872273,6053344,T,IEX,87.095000,400
2019-10-22 15:59:44.332593920,2019-10-22 15:59:44.332577832,6057261,T,IEX,87.095000,38
2019-10-22 15:59:46.727196928,2019-10-22 15:59:46.727176515,6057977,T,IEX,87.095000,200
2019-10-22 15:59:53.854528000,2019-10-22 15:59:53.854509154,6061719,T,IEX,87.095000,400
2019-10-22 15:59:54.48638976,2019-10-22 15:59:54.48621364,6061872,T,IEX,87.105000,100
2019-10-22 16:01:05.825208064,2019-10-22 16:01:05.825189236,6103150,T,IEX,87.095000,9
2019-10-22 16:01:21.768098048,2019-10-22 16:01:21.768081547,6110150,T,IEX,87.095000,4
2019-10-22 16:01:37.509017088,2019-10-22 16:01:37.508996733,6117772,T,IEX,87.095000,26
2019-10-22 16:01:44.292201984,2019-10-22 16:01:44.292180378,6122023,T,IEX,87.095000,100
2019-10-22 16:01:44.292624896,2019-10-22 16:01:44.292607439,6122024,T,IEX,87.095000,200
2019-10-22 16:01:44.292777984,2019-10-22 16:01:44.292759885,6122025,T,IEX,87.095000,100
2019-10-22 16:01:44.293104128,2019-10-22 16:01:44.293087130,6122026,T,IEX,87.095000,170
2019-10-22 16:02:08.498577920,2019-10-22 16:02:08.498561225,6134381,T,IEX,87.095000,100
2019-10-22 16:02:08.498594048,2019-10-22 16:02:08.498577153,6134382,T,IEX,87.095000,130
2019-10-22 16:02:08.498610944,2019-10-22 16:02:08.498594619,6134383,T,IEX,87.095000,200
2019-10-22 16:02:20.59171072,2019-10-22 16:02:20.59152346,6138989,T,IEX,87.095000,800
2019-10-22 16:02:23.159394048,2019-10-22 16:02:23.159373020,6140423,T,IEX,87.095000,600
2019-10-22 16:02:30.4224000,2019-10-22 16:02:30.4205088,6144143,T,IEX,87.095000,700
2019-10-22 16:02:30.16942080,2019-10-22 16:02:30.16923270,6144149,T,IEX,87.095000,1
2019-10-22 16:02:36.680500992,2019-10-22 16:02:36.680485222,6147628,T,IEX,87.095000,399
2019-10-22 16:02:48.365724928,2019-10-22 16:02:48.365707595,6152158,T,IEX,87.095000,1
2019-10-22 16:02:50.358863104,2019-10-22 16:02:50.358842834,6152774,T,IEX,87.095000,100
2019-10-22 16:02:50.366053120,2019-10-22 16:02:50.366032561,6152782,T,IEX,87.095000,100
2019-10-22 16:02:55.449871872,2019-10-22 16:02:55.449853245,6154823,T,IEX,87.095000,800
2019-10-22 16:03:12.754955008,2019-10-22 16:03:12.754934837,6162140,T,IEX,87.095000,100
2019-10-22 16:03:12.755805952,2019-10-22 16:03:12.755786355,6162141,T,IEX,87.095000,100
2019-10-22 16:03:12.756621056,2019-10-22 16:03:12.756604604,6162142,T,IEX,87.095000,100
2019-10-22 16:03:13.92051968,2019-10-22 16:03:13.92030591,6162266,T,IEX,87.095000,100
2019-10-22 16:03:13.92872960,2019-10-22 16:03:13.92854571,6162268,T,IEX,87.095000,100
2019-10-22 16:03:13.93682944,2019-10-22 16:03:13.93666271,6162269,T,IEX,87.095000,100
2019-10-22 16:03:13.106631936,2019-10-22 16:03:13.106611764,6162274,T,IEX,87.095000,1
2019-10-22 16:03:13.137155072,2019-10-22 16:03:13.137136050,6162294,T,IEX,87.095000,100
2019-10-22 16:03:13.137965056,2019-10-22 16:03:13.137945847,6162295,T,IEX,87.095000,100
2019-10-22 16:03:13.138776064,2019-10-22 16:03:13.138757994,6162297,T,IEX,87.095000,100
2019-10-22 16:03:13.139580928,2019-10-22 16:03:13.139565303,6162299,T,IEX,87.095000,100
2019-10-22 16:03:13.140389888,2019-10-22 16:03:13.140374201,6162301,T,IEX,87.095000,100
2019-10-22 16:04:19.658758912,2019-10-22 16:04:19.658740418,6192737,T,IEX,87.090000,2
2019-10-22 16:04:49.646758912,2019-10-22 16:04:49.646736968,6205472,T,IEX,87.085000,1
2019-10-22 16:05:32.354612992,2019-10-22 16:05:32.354594463,6226404,T,IEX,87.085000,100
2019-10-22 16:05:32.354626048,2019-10-22 16:05:32.354608223,6226405,T,IEX,87.085000,240
2019-10-22 16:05:32.354639104,2019-10-22 16:05:32.354622235,6226406,T,IEX,87.085000,2560
2019-10-22 16:05:32.356409088,2019-10-22 16:05:32.356390512,6226407,T,IEX,87.085000,9339
2019-10-22 16:05:39.249464064,2019-10-22 16:05:39.249445152,6229009,T,IEX,87.085000,100
2019-10-22 16:05:39.250311936,2019-10-22 16:05:39.250294454,6229010,T,IEX,87.085000,100
2019-10-22 16:05:46.848948992,2019-10-22 16:05:46.848929855,6232238,T,IEX,87.085000,200
2019-10-22 16:05:46.849044992,2019-10-22 16:05:46.849026759,6232239,T,IEX,87.085000,100
2019-10-22 16:06:25.218228992,2019-10-22 16:06:25.218209945,6248992,T,IEX,87.095000,200
2019-10-22 16:06:30.234168064,2019-10-22 16:06:30.234150570,6251779,T,IEX,87.095000,200
2019-10-22 16:06:34.388301056,2019-10-22 16:06:34.388282992,6253506,T,IEX,87.095000,100
2019-10-22 16:06:34.828175872,2019-10-22 16:06:34.828159085,6253690,T,IEX,87.095000,402
2019-10-22 16:06:35.234168064,2019-10-22 16:06:35.234147847,6253886,T,IEX,87.095000,296
2019-10-22 16:06:35.235820032,2019-10-22 16:06:35.235799410,6253887,T,IEX,87.095000,100
2019-10-22 16:06:35.237238016,2019-10-22 16:06:35.237218652,6253889,T,IEX,87.095000,100
2019-10-22 16:06:40.234588928,2019-10-22 16:06:40.234569625,6256506,T,IEX,87.095000,296
2019-10-22 16:06:40.236389120,2019-10-22 16:06:40.236371482,6256510,T,IEX,87.095000,100
2019-10-22 16:06:40.237593088,2019-10-22 16:06:40.237573691,6256511,T,IEX,87.095000,100
2019-10-22 16:06:40.238590976,2019-10-22 16:06:40.238571687,6256514,T,IEX,87.095000,100
2019-10-22 16:09:21.175412992,2019-10-22 16:09:21.175394571,6320611,T,IEX,87.105000,21
2019-10-22 16:09:49.682534912,2019-10-22 16:09:49.682516255,6333409,T,IEX,87.105000,300
2019-10-22 16:11:20.664418048,2019-10-22 16:11:20.664398798,6372312,T,IEX,87.105000,300
2019-10-22 16:12:06.441296896,2019-10-22 16:12:06.441276965,6389667,T,IEX,87.110000,925
2019-10-22 16:19:01.712930048,2019-10-22 16:19:01.712907429,6553918,T,IEX,87.115000,100
2019-10-22 16:19:01.726878976,2019-10-22 16:19:01.726861328,6554338,T,IEX,87.115000,100
2019-10-22 16:19:36.139307008,2019-10-22 16:19:36.139290443,6569862,T,IEX,87.115000,200
2019-10-22 16:19:36.140292096,2019-10-22 16:19:36.140272515,6569864,T,IEX,87.115000,29
2019-10-22 16:19:38.330750976,2019-10-22 16:19:38.330731298,6571027,T,IEX,87.115000,39
2019-10-22 16:19:45.146191872,2019-10-22 16:19:45.146174159,6574276,T,IEX,87.115000,57
2019-10-22 16:20:01.18134016,2019-10-22 16:20:01.18114070,6580831,T,IEX,87.115000,100
2019-10-22 16:20:01.18770944,2019-10-22 16:20:01.18752840,6580833,T,IEX,87.115000,100
2019-10-22 16:20:12.24416000,2019-10-22 16:20:12.24396450,6585850,T,IEX,87.120000,100
2019-10-22 16:22:12.931250944,2019-10-22 16:22:12.931232466,6633040,T,IEX,87.115000,4
2019-10-22 16:24:18.33776896,2019-10-22 16:24:18.33756313,6686615,T,IEX,87.115000,50
2019-10-22 16:29:15.503561984,2019-10-22 16:29:15.503540483,6800162,T,IEX,87.120000,50
2019-10-22 16:29:15.515075072,2019-10-22 16:29:15.515054877,6800173,T,IEX,87.125000,1
2019-10-22 16:31:36.626801920,2019-10-22 16:31:36.626781232,6854667,T,IEX,87.125000,20
2019-10-22 16:31:50.132983040,2019-10-22 16:31:50.132965354,6859423,T,IEX,87.125000,7
2019-10-22 16:36:03.169114112,2019-10-22 16:36:03.169095412,6962729,T,IEX,87.120000,100
2019-10-22 16:39:53.824545024,2019-10-22 16:39:53.824529071,7041364,T,IEX,87.120000,2
2019-10-22 16:39:53.846939904,2019-10-22 16:39:53.846919293,7041370,T,IEX,87.120000,100
2019-10-22 16:47:54.181497088,2019-10-22 16:47:54.181475832,7214279,T,IEX,87.115000,100
2019-10-22 16:48:36.117165056,2019-10-22 16:48:36.117145399,7228552,T,IEX,87.115000,1
2019-10-22 16:51:35.187676928,2019-10-22 16:51:35.187658782,7300248,T,IEX,87.110000,750
2019-10-22 16:51:35.187695104,2019-10-22 16:51:35.187676793,7300249,T,IEX,87.110000,200
2019-10-22 16:51:35.187710976,2019-10-22 16:51:35.187691192,7300250,T,IEX,87.110000,50
2019-10-22 16:53:04.656100096,2019-10-22 16:53:04.656077466,7332129,T,IEX,87.110000,1
2019-10-22 16:53:52.916428032,2019-10-22 16:53:52.916409294,7350854,T,IEX,87.110000,1
2019-10-22 16:55:10.246301952,2019-10-22 16:55:10.246280450,7376949,T,IEX,87.110000,96
2019-10-22 17:07:35.959592960,2019-10-22 17:07:35.959570784,7638037,T,IEX,87.110000,100
2019-10-22 17:07:35.959631104,2019-10-22 17:07:35.959612338,7638038,T,IEX,87.110000,100
2019-10-22 17:07:35.959770880,2019-10-22 17:07:35.959751068,7638039,T,IEX,87.110000,100
2019-10-22 17:13:24.430800896,2019-10-22 17:13:24.430782661,7750312,T,IEX,87.105000,100
2019-10-22 17:13:30.1522944,2019-10-22 17:13:30.1504256,7752035,T,IEX,87.105000,8
2019-10-22 17:13:54.728387072,2019-10-22 17:13:54.728362500,7759071,T,IEX,87.105000,300
2019-10-22 17:13:54.728424960,2019-10-22 17:13:54.728398544,7759075,T,IEX,87.105000,300
2019-10-22 17:13:54.728459008,2019-10-22 17:13:54.728441444,7759077,T,IEX,87.105000,100
2019-10-22 17:14:53.86446080,2019-10-22 17:14:53.86427272,7791437,T,IEX,87.110000,1
2019-10-22 17:14:53.87011072,2019-10-22 17:14:53.86992768,7791438,T,IEX,87.110000,1
2019-10-22 17:16:46.889814016,2019-10-22 17:16:46.889793974,7829958,T,IEX,87.110000,300
2019-10-22 17:18:35.60230912,2019-10-22 17:18:35.60210974,7861186,T,IEX,87.105000,100
2019-10-22 17:19:08.101040128,2019-10-22 17:19:08.101020229,7872207,T,IEX,87.105000,75
2019-10-22 17:19:46.302000128,2019-10-22 17:19:46.301981098,7882651,T,IEX,87.105000,12
2019-10-22 17:20:51.268476928,2019-10-22 17:20:51.268454795,7902752,T,IEX,87.105000,10
2019-10-22 17:21:13.775917056,2019-10-22 17:21:13.775897818,7908144,T,IEX,87.105000,100
2019-10-22 17:21:13.775939072,2019-10-22 17:21:13.775921536,7908145,T,IEX,87.105000,100
2019-10-22 17:21:47.246732032,2019-10-22 17:21:47.246705526,7917369,T,IEX,87.105000,100
2019-10-22 17:21:47.248119040,2019-10-22 17:21:47.248100053,7917383,T,IEX,87.105000,100
2019-10-22 17:21:48.259641088,2019-10-22 17:21:48.259619604,7917689,T,IEX,87.105000,100
2019-10-22 17:21:48.259650048,2019-10-22 17:21:48.259631816,7917690,T,IEX,87.105000,100
2019-10-22 17:23:27.730046976,2019-10-22 17:23:27.730027860,7949563,T,IEX,87.115000,300
2019-10-22 17:23:27.730066944,2019-10-22 17:23:27.730048682,7949564,T,IEX,87.120000,2400
2019-10-22 17:23:27.730083072,2019-10-22 17:23:27.730064203,7949565,T,IEX,87.120000,100
2019-10-22 17:23:34.594319872,2019-10-22 17:23:34.594300339,7951405,T,IEX,87.115000,100
2019-10-22 17:23:34.871934976,2019-10-22 17:23:34.871916023,7951449,T,IEX,87.120000,2400
2019-10-22 17:23:34.872562944,2019-10-22 17:23:34.872545831,7951451,T,IEX,87.115000,600
2019-10-22 17:24:02.761776896,2019-10-22 17:24:02.761759042,7959825,T,IEX,87.120000,2400
2019-10-22 17:24:02.761792000,2019-10-22 17:24:02.761775159,7959826,T,IEX,87.120000,300
2019-10-22 17:29:30.783406080,2019-10-22 17:29:30.783387361,8052177,T,IEX,87.115000,200
2019-10-22 17:31:52.44774912,2019-10-22 17:31:52.44756719,8091115,T,IEX,87.115000,500
2019-10-22 17:32:19.199753984,2019-10-22 17:32:19.199734468,8099919,T,IEX,87.115000,500
2019-10-22 17:35:50.257671936,2019-10-22 17:35:50.257654034,8170797,T,IEX,87.115000,800
2019-10-22 17:36:55.645506048,2019-10-22 17:36:55.645488043,8192449,T,IEX,87.115000,100
2019-10-22 17:36:55.646341888,2019-10-22 17:36:55.646324719,8192454,T,IEX,87.115000,100
2019-10-22 17:36:55.647162112,2019-10-22 17:36:55.647144797,8192457,T,IEX,87.115000,100
2019-10-22 17:36:55.647972096,2019-10-22 17:36:55.647954147,8192459,T,IEX,87.115000,100
2019-10-22 17:36:55.648784896,2019-10-22 17:36:55.648767322,8192461,T,IEX,87.115000,100
2019-10-22 17:37:07.738452992,2019-10-22 17:37:07.738434006,8197826,T,IEX,87.115000,100
2019-10-22 17:37:08.950793984,2019-10-22 17:37:08.950774774,8198276,T,IEX,87.115000,100
2019-10-22 17:37:08.952263936,2019-10-22 17:37:08.952244523,8198314,T,IEX,87.115000,100
2019-10-22 17:44:56.460001024,2019-10-22 17:44:56.459982422,8357438,T,IEX,87.125000,60
2019-10-22 17:49:11.622557952,2019-10-22 17:49:11.622539873,8436018,T,IEX,87.120000,1
2019-10-22 17:49:11.645321984,2019-10-22 17:49:11.645302358,8436024,T,IEX,87.120000,100
2019-10-22 17:49:11.657298944,2019-10-22 17:49:11.657279082,8436025,T,IEX,87.120000,2
2019-10-22 17:51:07.536844032,2019-10-22 17:51:07.536821305,8474480,T,IEX,87.125000,88
2019-10-22 17:52:02.34873088,2019-10-22 17:52:02.34667890,8493128,T,IEX,87.125000,11
2019-10-22 17:55:29.973596928,2019-10-22 17:55:29.973577366,8571407,T,IEX,87.125000,700
2019-10-22 17:55:29.973607936,2019-10-22 17:55:29.973590159,8571408,T,IEX,87.125000,100
2019-10-22 17:55:29.973622016,2019-10-22 17:55:29.973603421,8571409,T,IEX,87.125000,300
2019-10-22 17:55:29.973635072,2019-10-22 17:55:29.973617480,8571410,T,IEX,87.125000,100
2019-10-22 17:57:56.273255936,2019-10-22 17:57:56.273236436,8635093,T,IEX,87.125000,100
2019-10-22 18:00:49.473166080,2019-10-22 18:00:49.473147576,8708313,T,IEX,87.125000,200
2019-10-22 18:00:56.696164096,2019-10-22 18:00:56.696142419,8710558,T,IEX,87.125000,600
2019-10-22 18:01:17.989692928,2019-10-22 18:01:17.989669279,8720947,T,IEX,87.125000,100
2019-10-22 18:01:37.389262080,2019-10-22 18:01:37.389241579,8726919,T,IEX,87.125000,224
2019-10-22 18:01:58.507322880,2019-10-22 18:01:58.507303149,8734770,T,IEX,87.125000,3
2019-10-22 18:03:38.436560896,2019-10-22 18:03:38.436542450,8771342,T,IEX,87.125000,117
2019-10-22 18:03:58.151715072,2019-10-22 18:03:58.151694461,8777791,T,IEX,87.125000,100
2019-10-22 18:04:01.826176000,2019-10-22 18:04:01.826156076,8778932,T,IEX,87.125000,100
2019-10-22 18:04:23.415471104,2019-10-22 18:04:23.415453734,8787252,T,IEX,87.125000,180
2019-10-22 18:06:05.231320064,2019-10-22 18:06:05.231299625,8823547,T,IEX,87.125000,100
2019-10-22 18:06:13.23943936,2019-10-22 18:06:13.23926260,8826033,T,IEX,87.125000,600
2019-10-22 18:07:52.136250880,2019-10-22 18:07:52.136230373,8863612,T,IEX,87.130000,100
2019-10-22 18:14:24.568058880,2019-10-22 18:14:24.568034991,9018187,T,IEX,87.135000,200
2019-10-22 18:15:00.477881088,2019-10-22 18:15:00.477860569,9033338,T,IEX,87.135000,300
2019-10-22 18:24:33.91002880,2019-10-22 18:24:33.90983094,9310375,T,IEX,87.125000,54
2019-10-22 18:29:57.851426048,2019-10-22 18:29:57.851407171,9498382,T,IEX,87.125000,100
2019-10-22 18:29:57.855158016,2019-10-22 18:29:57.855135233,9498538,T,IEX,87.125000,100
2019-10-22 18:30:02.613340928,2019-10-22 18:30:02.613323916,9522707,T,IEX,87.140000,500
2019-10-22 18:30:04.440399872,2019-10-22 18:30:04.440382873,9530105,T,IEX,87.130000,200
2019-10-22 18:30:25.749728000,2019-10-22 18:30:25.749708599,9577544,T,IEX,87.135000,100
2019-10-22 18:30:39.492955904,2019-10-22 18:30:39.492938244,9601309,T,IEX,87.130000,35
2019-10-22 18:31:12.44939008,2019-10-22 18:31:12.44919471,9643189,T,IEX,87.125000,200
2019-10-22 18:31:12.108060928,2019-10-22 18:31:12.108043754,9643324,T,IEX,87.125000,400
2019-10-22 18:32:08.923706880,2019-10-22 18:32:08.923685120,9719291,T,IEX,87.115000,100
2019-10-22 18:32:15.301371904,2019-10-22 18:32:15.301354552,9726830,T,IEX,87.115000,200
2019-10-22 18:32:15.301416960,2019-10-22 18:32:15.301397051,9726831,T,IEX,87.115000,300
2019-10-22 18:32:15.301807104,2019-10-22 18:32:15.301789374,9726835,T,IEX,87.115000,6
2019-10-22 18:32:49.430411008,2019-10-22 18:32:49.430392581,9765267,T,IEX,87.115000,300
2019-10-22 18:32:49.432280064,2019-10-22 18:32:49.432252413,9765332,T,IEX,87.115000,200
2019-10-22 18:33:57.497838080,2019-10-22 18:33:57.497820970,9857125,T,IEX,87.105000,100
2019-10-22 18:33:57.498001920,2019-10-22 18:33:57.497986221,9857126,T,IEX,87.105000,300
2019-10-22 18:33:57.498040064,2019-10-22 18:33:57.498022992,9857127,T,IEX,87.105000,200
2019-10-22 18:33:57.498254080,2019-10-22 18:33:57.498238601,9857130,T,IEX,87.105000,100
2019-10-22 18:34:57.812916992,2019-10-22 18:34:57.812896097,9910776,T,IEX,87.115000,400
2019-10-22 18:34:57.812956928,2019-10-22 18:34:57.812939614,9910777,T,IEX,87.115000,200
2019-10-22 18:36:45.816466944,2019-10-22 18:36:45.816447479,10005153,T,IEX,87.115000,9
2019-10-22 18:36:59.173890048,2019-10-22 18:36:59.173872514,10010030,T,IEX,87.115000,100
2019-10-22 18:39:03.537101056,2019-10-22 18:39:03.537078525,10084221,T,IEX,87.135000,56
2019-10-22 18:42:51.734246912,2019-10-22 18:42:51.734229945,10218602,T,IEX,87.125000,176
2019-10-22 18:43:02.475865088,2019-10-22 18:43:02.475846334,10223941,T,IEX,87.125000,72
2019-10-22 18:44:08.445812992,2019-10-22 18:44:08.445792440,10257792,T,IEX,87.120000,21
2019-10-22 18:45:01.499821056,2019-10-22 18:45:01.499803537,10291975,T,IEX,87.125000,200
2019-10-22 18:47:33.62952960,2019-10-22 18:47:33.62935736,10407177,T,IEX,87.115000,300
2019-10-22 18:51:47.534036992,2019-10-22 18:51:47.534017504,10579545,T,IEX,87.095000,150
2019-10-22 18:52:27.756368896,2019-10-22 18:52:27.756352662,10609886,T,IEX,87.090000,3
2019-10-22 18:52:27.759408128,2019-10-22 18:52:27.759388022,10609892,T,IEX,87.090000,2
2019-10-22 18:52:34.187196928,2019-10-22 18:52:34.187181708,10616886,T,IEX,87.085000,95
2019-10-22 18:52:50.80235008,2019-10-22 18:52:50.80215466,10634525,T,IEX,87.085000,200
2019-10-22 18:53:02.750966016,2019-10-22 18:53:02.750946192,10647366,T,IEX,87.095000,200
2019-10-22 18:54:01.378969088,2019-10-22 18:54:01.378948348,10686837,T,IEX,87.105000,200
2019-10-22 18:54:01.417170944,2019-10-22 18:54:01.417154981,10686873,T,IEX,87.105000,100
2019-10-22 18:54:03.369179904,2019-10-22 18:54:03.369162455,10688109,T,IEX,87.105000,200
2019-10-22 18:54:03.915127040,2019-10-22 18:54:03.915107258,10688314,T,IEX,87.105000,200
2019-10-22 18:54:06.450567936,2019-10-22 18:54:06.450548507,10689461,T,IEX,87.105000,500
2019-10-22 18:54:09.374347008,2019-10-22 18:54:09.374327162,10691223,T,IEX,87.105000,800
2019-10-22 18:55:57.332780032,2019-10-22 18:55:57.332762390,10749648,T,IEX,87.115000,188
2019-10-22 18:56:11.904804096,2019-10-22 18:56:11.904783935,10758692,T,IEX,87.110000,1
2019-10-22 18:56:42.118727936,2019-10-22 18:56:42.118705494,10775473,T,IEX,87.115000,37
2019-10-22 18:59:04.54557952,2019-10-22 18:59:04.54537168,10856762,T,IEX,87.110000,2
2019-10-22 19:03:10.665232896,2019-10-22 19:03:10.665213918,11033022,T,IEX,87.115000,300
2019-10-22 19:03:10.665245952,2019-10-22 19:03:10.665229409,11033023,T,IEX,87.115000,200
2019-10-22 19:03:10.665265920,2019-10-22 19:03:10.665249037,11033024,T,IEX,87.115000,100
2019-10-22 19:03:21.894323968,2019-10-22 19:03:21.894304579,11047048,T,IEX,87.115000,300
2019-10-22 19:03:21.894339072,2019-10-22 19:03:21.894321524,11047049,T,IEX,87.115000,100
2019-10-22 19:03:21.899607040,2019-10-22 19:03:21.899589368,11047073,T,IEX,87.115000,100
2019-10-22 19:03:21.901635072,2019-10-22 19:03:21.901619336,11047077,T,IEX,87.115000,100
2019-10-22 19:03:21.903759872,2019-10-22 19:03:21.903741911,11047081,T,IEX,87.115000,100
2019-10-22 19:03:21.905890048,2019-10-22 19:03:21.905871699,11047085,T,IEX,87.115000,100
2019-10-22 19:03:21.908296960,2019-10-22 19:03:21.908279569,11047092,T,IEX,87.115000,100
2019-10-22 19:03:21.910597888,2019-10-22 19:03:21.910578183,11047093,T,IEX,87.115000,100
2019-10-22 19:03:21.912716032,2019-10-22 19:03:21.912696191,11047103,T,IEX,87.115000,100
2019-10-22 19:03:21.914850048,2019-10-22 19:03:21.914830184,11047111,T,IEX,87.115000,100
2019-10-22 19:03:21.917040128,2019-10-22 19:03:21.917020811,11047119,T,IEX,87.115000,100
2019-10-22 19:03:21.919159040,2019-10-22 19:03:21.919139268,11047120,T,IEX,87.115000,100
2019-10-22 19:03:21.921952000,2019-10-22 19:03:21.921932415,11047123,T,IEX,87.115000,100
2019-10-22 19:03:23.535919104,2019-10-22 19:03:23.535826569,11049366,T,IEX,87.115000,100
2019-10-22 19:03:23.536908032,2019-10-22 19:03:23.536889082,11049386,T,IEX,87.115000,100
2019-10-22 19:03:23.538984960,2019-10-22 19:03:23.538966918,11049417,T,IEX,87.115000,100
2019-10-22 19:03:23.541223936,2019-10-22 19:03:23.541206195,11049460,T,IEX,87.115000,100
2019-10-22 19:03:23.544901120,2019-10-22 19:03:23.544881942,11049482,T,IEX,87.115000,100
2019-10-22 19:03:23.547098880,2019-10-22 19:03:23.547082343,11049490,T,IEX,87.115000,100
2019-10-22 19:03:23.549229056,2019-10-22 19:03:23.549209080,11049497,T,IEX,87.115000,100
2019-10-22 19:03:23.671934976,2019-10-22 19:03:23.671916847,11049858,T,IEX,87.115000,100
2019-10-22 19:03:23.990093056,2019-10-22 19:03:23.990073642,11050238,T,IEX,87.115000,100
2019-10-22 19:03:23.992999936,2019-10-22 19:03:23.992981579,11050256,T,IEX,87.115000,100
2019-10-22 19:03:23.995109888,2019-10-22 19:03:23.995089641,11050257,T,IEX,87.115000,100
2019-10-22 19:03:27.631266048,2019-10-22 19:03:27.631241005,11057358,T,IEX,87.115000,100
2019-10-22 19:03:31.384655872,2019-10-22 19:03:31.384636778,11061250,T,IEX,87.115000,100
2019-10-22 19:03:31.391176960,2019-10-22 19:03:31.391159980,11061295,T,IEX,87.115000,600
2019-10-22 19:03:31.908738048,2019-10-22 19:03:31.908720562,11062092,T,IEX,87.115000,100
2019-10-22 19:03:31.908901888,2019-10-22 19:03:31.908884050,11062095,T,IEX,87.115000,100
2019-10-22 19:03:32.45605120,2019-10-22 19:03:32.45587345,11062224,T,IEX,87.115000,100
2019-10-22 19:03:32.415122944,2019-10-22 19:03:32.415102341,11062546,T,IEX,87.115000,100
2019-10-22 19:03:33.184814080,2019-10-22 19:03:33.184791668,11062985,T,IEX,87.115000,200
2019-10-22 19:03:33.187248896,2019-10-22 19:03:33.187230288,11063062,T,IEX,87.115000,100
2019-10-22 19:03:33.187409920,2019-10-22 19:03:33.187384190,11063069,T,IEX,87.115000,300
2019-10-22 19:03:33.188224000,2019-10-22 19:03:33.188206981,11063089,T,IEX,87.115000,300
2019-10-22 19:03:33.196483072,2019-10-22 19:03:33.196464556,11063154,T,IEX,87.115000,700
2019-10-22 19:03:33.547220992,2019-10-22 19:03:33.547205415,11063533,T,IEX,87.115000,100
2019-10-22 19:03:33.639379968,2019-10-22 19:03:33.639360276,11063696,T,IEX,87.115000,100
2019-10-22 19:03:33.639497984,2019-10-22 19:03:33.639477911,11063701,T,IEX,87.115000,300
2019-10-22 19:03:33.640318976,2019-10-22 19:03:33.640300106,11063719,T,IEX,87.115000,300
2019-10-22 19:03:33.763696128,2019-10-22 19:03:33.763676279,11063860,T,IEX,87.115000,100
2019-10-22 19:03:34.937432064,2019-10-22 19:03:34.937413652,11064902,T,IEX,87.115000,600
2019-10-22 19:03:34.939033088,2019-10-22 19:03:34.939012721,11064903,T,IEX,87.115000,100
2019-10-22 19:03:37.558725888,2019-10-22 19:03:37.558705084,11066833,T,IEX,87.115000,600
2019-10-22 19:03:37.559258880,2019-10-22 19:03:37.559242424,11066835,T,IEX,87.115000,100
2019-10-22 19:03:37.944637952,2019-10-22 19:03:37.944619764,11066981,T,IEX,87.115000,100
2019-10-22 19:03:38.43468032,2019-10-22 19:03:38.43447929,11067130,T,IEX,87.115000,500
2019-10-22 19:03:38.45122048,2019-10-22 19:03:38.45104565,11067144,T,IEX,87.115000,100
2019-10-22 19:03:38.420911104,2019-10-22 19:03:38.420894030,11067337,T,IEX,87.115000,100
2019-10-22 19:03:39.511584000,2019-10-22 19:03:39.511566171,11068074,T,IEX,87.115000,100
2019-10-22 19:03:39.513394944,2019-10-22 19:03:39.513374262,11068086,T,IEX,87.115000,600
2019-10-22 19:03:39.620269056,2019-10-22 19:03:39.620248740,11068170,T,IEX,87.115000,100
2019-10-22 19:03:41.13433088,2019-10-22 19:03:41.13412313,11068942,T,IEX,87.115000,600
2019-10-22 19:03:41.15043072,2019-10-22 19:03:41.15022907,11068943,T,IEX,87.115000,100
2019-10-22 19:03:44.716977920,2019-10-22 19:03:44.716958362,11072633,T,IEX,87.115000,700
2019-10-22 19:03:47.715354880,2019-10-22 19:03:47.715336479,11074375,T,IEX,87.115000,600
2019-10-22 19:03:49.203663872,2019-10-22 19:03:49.203645300,11075410,T,IEX,87.115000,800
2019-10-22 19:03:51.13509888,2019-10-22 19:03:51.13487828,11076563,T,IEX,87.115000,800
2019-10-22 19:03:52.968955904,2019-10-22 19:03:52.968937499,11078043,T,IEX,87.115000,700
2019-10-22 19:03:52.996631040,2019-10-22 19:03:52.996615479,11078432,T,IEX,87.115000,800
2019-10-22 19:03:54.194417920,2019-10-22 19:03:54.194401241,11080057,T,IEX,87.115000,600
2019-10-22 19:03:54.195952896,2019-10-22 19:03:54.195934662,11080063,T,IEX,87.115000,300
2019-10-22 19:03:54.196766976,2019-10-22 19:03:54.196747759,11080070,T,IEX,87.115000,300
2019-10-22 19:03:54.197927936,2019-10-22 19:03:54.197911438,11080076,T,IEX,87.115000,100
2019-10-22 19:03:54.342287872,2019-10-22 19:03:54.342266698,11080363,T,IEX,87.115000,100
2019-10-22 19:03:54.342656000,2019-10-22 19:03:54.342639253,11080365,T,IEX,87.115000,300
2019-10-22 19:03:55.196964096,2019-10-22 19:03:55.196945673,11081556,T,IEX,87.115000,100
2019-10-22 19:03:55.197999104,2019-10-22 19:03:55.197978705,11081557,T,IEX,87.115000,200
2019-10-22 19:03:55.298511104,2019-10-22 19:03:55.298493364,11081779,T,IEX,87.115000,600
2019-10-22 19:03:55.300168960,2019-10-22 19:03:55.300150950,11081783,T,IEX,87.115000,100
2019-10-22 19:03:55.300303872,2019-10-22 19:03:55.300288263,11081784,T,IEX,87.115000,200
2019-10-22 19:03:55.301359104,2019-10-22 19:03:55.301343104,11081787,T,IEX,87.115000,625
2019-10-22 19:03:56.13487104,2019-10-22 19:03:56.13467938,11082741,T,IEX,87.115000,700
2019-10-22 19:03:56.15148032,2019-10-22 19:03:56.15129780,11082744,T,IEX,87.115000,100
2019-10-22 19:03:56.15535104,2019-10-22 19:03:56.15518868,11082745,T,IEX,87.115000,200
2019-10-22 19:03:56.676881920,2019-10-22 19:03:56.676863783,11083347,T,IEX,87.115000,100
2019-10-22 19:04:38.117253888,2019-10-22 19:04:38.117232508,11120152,T,IEX,87.115000,800
2019-10-22 19:04:48.527508992,2019-10-22 19:04:48.527491533,11126638,T,IEX,87.115000,800
2019-10-22 19:04:58.88005888,2019-10-22 19:04:58.87988439,11134219,T,IEX,87.115000,300
2019-10-22 19:04:58.89039104,2019-10-22 19:04:58.89022521,11134221,T,IEX,87.115000,1300
2019-10-22 19:04:58.89984000,2019-10-22 19:04:58.89964419,11134222,T,IEX,87.115000,400
2019-10-22 19:05:00.832492032,2019-10-22 19:05:00.832476718,11136025,T,IEX,87.115000,800
2019-10-22 19:05:01.235305984,2019-10-22 19:05:01.235290001,11136876,T,IEX,87.115000,800
2019-10-22 19:05:01.621384960,2019-10-22 19:05:01.621365816,11137345,T,IEX,87.115000,300
2019-10-22 19:05:02.640427008,2019-10-22 19:05:02.640408839,11138314,T,IEX,87.115000,800
2019-10-22 19:05:02.642080000,2019-10-22 19:05:02.642062506,11138322,T,IEX,87.115000,100
2019-10-22 19:05:02.642253056,2019-10-22 19:05:02.642234254,11138326,T,IEX,87.115000,200
2019-10-22 19:05:02.643471104,2019-10-22 19:05:02.643451164,11138341,T,IEX,87.115000,225
2019-10-22 19:05:03.566375936,2019-10-22 19:05:03.566359968,11139280,T,IEX,87.115000,800
2019-10-22 19:05:04.378234112,2019-10-22 19:05:04.378214266,11140524,T,IEX,87.115000,600
2019-10-22 19:05:05.875020032,2019-10-22 19:05:05.875003314,11142052,T,IEX,87.115000,700
2019-10-22 19:05:07.23895040,2019-10-22 19:05:07.23875969,11143305,T,IEX,87.115000,600
2019-10-22 19:05:07.28174080,2019-10-22 19:05:07.28155854,11143313,T,IEX,87.115000,200
2019-10-22 19:05:07.910827008,2019-10-22 19:05:07.910808650,11144192,T,IEX,87.115000,800
2019-10-22 19:05:07.996698112,2019-10-22 19:05:07.996679563,11145157,T,IEX,87.115000,765
2019-10-22 19:05:08.571750912,2019-10-22 19:05:08.571732205,11146086,T,IEX,87.115000,300
2019-10-22 19:05:08.572904960,2019-10-22 19:05:08.572886444,11146088,T,IEX,87.115000,100
2019-10-22 19:05:08.573846016,2019-10-22 19:05:08.573828575,11146090,T,IEX,87.115000,100
2019-10-22 19:05:08.574775040,2019-10-22 19:05:08.574755846,11146091,T,IEX,87.115000,100
2019-10-22 19:05:09.270465024,2019-10-22 19:05:09.270450146,11146677,T,IEX,87.115000,800
2019-10-22 19:05:09.788332032,2019-10-22 19:05:09.788313344,11147404,T,IEX,87.115000,100
2019-10-22 19:05:09.788684032,2019-10-22 19:05:09.788664762,11147414,T,IEX,87.115000,200
2019-10-22 19:05:09.797827072,2019-10-22 19:05:09.797809569,11147540,T,IEX,87.115000,100
2019-10-22 19:05:09.874694912,2019-10-22 19:05:09.874676979,11147683,T,IEX,87.115000,100
2019-10-22 19:05:09.937743104,2019-10-22 19:05:09.937725115,11147915,T,IEX,87.115000,100
2019-10-22 19:05:09.937900032,2019-10-22 19:05:09.937882153,11147916,T,IEX,87.115000,100
2019-10-22 19:05:10.621839104,2019-10-22 19:05:10.621820200,11148725,T,IEX,87.115000,100
2019-10-22 19:05:10.760299008,2019-10-22 19:05:10.760281830,11148818,T,IEX,87.115000,100
2019-10-22 19:05:10.925076992,2019-10-22 19:05:10.925060217,11148917,T,IEX,87.115000,600
2019-10-22 19:05:13.319735040,2019-10-22 19:05:13.319716884,11151141,T,IEX,87.115000,800
2019-10-22 19:05:14.950071040,2019-10-22 19:05:14.950052634,11152295,T,IEX,87.115000,800
2019-10-22 19:05:19.234951936,2019-10-22 19:05:19.234931450,11155921,T,IEX,87.115000,800
2019-10-22 19:05:24.909907968,2019-10-22 19:05:24.909890221,11161769,T,IEX,87.115000,600
2019-10-22 19:05:28.766025984,2019-10-22 19:05:28.766007524,11165010,T,IEX,87.115000,800
2019-10-22 19:05:39.433584128,2019-10-22 19:05:39.433568854,11171410,T,IEX,87.115000,500
2019-10-22 19:05:39.433604096,2019-10-22 19:05:39.433586280,11171411,T,IEX,87.115000,100
2019-10-22 19:05:43.161765120,2019-10-22 19:05:43.161747984,11174184,T,IEX,87.115000,700
2019-10-22 19:05:57.572076032,2019-10-22 19:05:57.572054679,11182561,T,IEX,87.115000,700
2019-10-22 19:05:59.818152960,2019-10-22 19:05:59.818133143,11183834,T,IEX,87.115000,700
2019-10-22 19:06:10.2607104,2019-10-22 19:06:10.2591413,11194360,T,IEX,87.115000,500
2019-10-22 19:06:10.2626048,2019-10-22 19:06:10.2608874,11194361,T,IEX,87.115000,200
2019-10-22 19:09:32.586323968,2019-10-22 19:09:32.586303289,11306966,T,IEX,87.125000,200
2019-10-22 19:09:32.586340096,2019-10-22 19:09:32.586322456,11306967,T,IEX,87.120000,200
2019-10-22 19:09:59.509340928,2019-10-22 19:09:59.509317078,11318661,T,IEX,87.120000,20
2019-10-22 19:10:01.282125056,2019-10-22 19:10:01.282105398,11320192,T,IEX,87.120000,280
2019-10-22 19:10:02.20023040,2019-10-22 19:10:02.20002813,11321407,T,IEX,87.120000,300
2019-10-22 19:12:00.962688000,2019-10-22 19:12:00.962669979,11391618,T,IEX,87.125000,107
2019-10-22 19:18:30.597390080,2019-10-22 19:18:30.597367814,11627773,T,IEX,87.150000,100
2019-10-22 19:19:09.712859904,2019-10-22 19:19:09.712841489,11653026,T,IEX,87.145000,200
2019-10-22 19:21:10.469899008,2019-10-22 19:21:10.469883069,11718804,T,IEX,87.145000,100
2019-10-22 19:21:10.470000128,2019-10-22 19:21:10.469982714,11718806,T,IEX,87.145000,100
2019-10-22 19:21:48.724207104,2019-10-22 19:21:48.724188937,11739389,T,IEX,87.145000,127
2019-10-22 19:27:04.176666880,2019-10-22 19:27:04.176646406,11888464,T,IEX,87.155000,1
2019-10-22 19:28:55.684828928,2019-10-22 19:28:55.684808331,11956361,T,IEX,87.165000,1000
2019-10-22 19:29:49.742449920,2019-10-22 19:29:49.742431049,11979892,T,IEX,87.165000,1000
2019-10-22 19:33:22.934181888,2019-10-22 19:33:22.934162205,12093693,T,IEX,87.155000,300
2019-10-22 19:33:23.47151104,2019-10-22 19:33:23.47131631,12093738,T,IEX,87.155000,300
2019-10-22 19:33:23.47250944,2019-10-22 19:33:23.47235282,12093739,T,IEX,87.155000,200
2019-10-22 19:33:23.221900032,2019-10-22 19:33:23.221879911,12093839,T,IEX,87.155000,300
2019-10-22 19:33:23.354436096,2019-10-22 19:33:23.354416160,12093954,T,IEX,87.155000,300
2019-10-22 19:33:23.456603904,2019-10-22 19:33:23.456587080,12094006,T,IEX,87.155000,100
2019-10-22 19:33:38.150380032,2019-10-22 19:33:38.150364435,12102192,T,IEX,87.150000,100
2019-10-22 19:33:48.159441920,2019-10-22 19:33:48.159426394,12107109,T,IEX,87.150000,200
2019-10-22 19:33:48.159559936,2019-10-22 19:33:48.159541495,12107111,T,IEX,87.150000,200
2019-10-22 19:33:48.159634944,2019-10-22 19:33:48.159618520,12107113,T,IEX,87.145000,300
2019-10-22 19:33:48.264784896,2019-10-22 19:33:48.264761956,12107147,T,IEX,87.145000,200
2019-10-22 19:33:48.264794880,2019-10-22 19:33:48.264778174,12107148,T,IEX,87.145000,100
2019-10-22 19:33:48.368954880,2019-10-22 19:33:48.368938069,12107193,T,IEX,87.145000,200
2019-10-22 19:33:48.489690880,2019-10-22 19:33:48.489668962,12107278,T,IEX,87.145000,100
2019-10-22 19:33:48.567994112,2019-10-22 19:33:48.567975779,12107298,T,IEX,87.145000,200
2019-10-22 19:33:48.604549120,2019-10-22 19:33:48.604532714,12107305,T,IEX,87.145000,100
2019-10-22 19:33:48.864659968,2019-10-22 19:33:48.864642112,12107647,T,IEX,87.145000,200
2019-10-22 19:33:48.864700928,2019-10-22 19:33:48.864682063,12107648,T,IEX,87.145000,100
2019-10-22 19:34:12.123698944,2019-10-22 19:34:12.123677959,12118716,T,IEX,87.155000,200
2019-10-22 19:34:12.123713024,2019-10-22 19:34:12.123696322,12118717,T,IEX,87.155000,300
2019-10-22 19:34:49.225638912,2019-10-22 19:34:49.225618287,12134300,T,IEX,87.155000,400
2019-10-22 19:38:41.788890112,2019-10-22 19:38:41.788869435,12248147,T,IEX,87.155000,100
2019-10-22 19:38:41.788954880,2019-10-22 19:38:41.788936586,12248148,T,IEX,87.155000,300
2019-10-22 19:38:41.788992000,2019-10-22 19:38:41.788972682,12248149,T,IEX,87.155000,300
2019-10-22 19:38:41.899389952,2019-10-22 19:38:41.899371541,12248184,T,IEX,87.155000,300
2019-10-22 19:38:42.443904,2019-10-22 19:38:42.423388,12248213,T,IEX,87.155000,300
2019-10-22 19:38:42.1043968,2019-10-22 19:38:42.1026464,12248215,T,IEX,87.155000,200
2019-10-22 19:38:42.80090112,2019-10-22 19:38:42.80068775,12248275,T,IEX,87.155000,200
2019-10-22 19:38:42.80167936,2019-10-22 19:38:42.80151158,12248276,T,IEX,87.155000,100
2019-10-22 19:38:42.173797888,2019-10-22 19:38:42.173778364,12248292,T,IEX,87.155000,300
2019-10-22 19:38:42.288996096,2019-10-22 19:38:42.288976184,12248320,T,IEX,87.155000,300
2019-10-22 19:38:42.403739904,2019-10-22 19:38:42.403721011,12248346,T,IEX,87.155000,300
2019-10-22 19:39:14.859310080,2019-10-22 19:39:14.859290993,12270652,T,IEX,87.155000,100
2019-10-22 19:39:19.887621120,2019-10-22 19:39:19.887600228,12272738,T,IEX,87.155000,100
2019-10-22 19:39:19.888128000,2019-10-22 19:39:19.888109802,12272768,T,IEX,87.155000,100
2019-10-22 19:39:19.889338880,2019-10-22 19:39:19.889319491,12272824,T,IEX,87.155000,100
2019-10-22 19:39:19.905818112,2019-10-22 19:39:19.905798017,12272901,T,IEX,87.155000,100
2019-10-22 19:39:21.206821888,2019-10-22 19:39:21.206803671,12273529,T,IEX,87.155000,100
2019-10-22 19:39:21.207601920,2019-10-22 19:39:21.207584699,12273536,T,IEX,87.155000,100
2019-10-22 19:39:21.208519936,2019-10-22 19:39:21.208501358,12273548,T,IEX,87.155000,100
2019-10-22 19:39:26.268022016,2019-10-22 19:39:26.268003260,12276066,T,IEX,87.155000,100
2019-10-22 19:39:30.942522112,2019-10-22 19:39:30.942501394,12278309,T,IEX,87.155000,100
2019-10-22 19:39:35.857020928,2019-10-22 19:39:35.857001253,12280433,T,IEX,87.155000,100
2019-10-22 19:39:37.917112064,2019-10-22 19:39:37.917091751,12281649,T,IEX,87.155000,100
2019-10-22 19:39:39.195270912,2019-10-22 19:39:39.195253993,12282292,T,IEX,87.155000,100
2019-10-22 19:39:40.114498048,2019-10-22 19:39:40.114479825,12282765,T,IEX,87.155000,100
2019-10-22 19:39:46.823047936,2019-10-22 19:39:46.823029268,12285931,T,IEX,87.155000,100
2019-10-22 19:39:54.838194944,2019-10-22 19:39:54.838175599,12289775,T,IEX,87.155000,800
2019-10-22 19:39:54.839229952,2019-10-22 19:39:54.839210102,12289776,T,IEX,87.155000,2200
2019-10-22 19:40:36.420553984,2019-10-22 19:40:36.420533843,12315313,T,IEX,87.150000,100
2019-10-22 19:40:39.501981952,2019-10-22 19:40:39.501963939,12317062,T,IEX,87.145000,100
2019-10-22 19:42:57.566873088,2019-10-22 19:42:57.566854397,12400049,T,IEX,87.150000,200
2019-10-22 19:44:20.155092992,2019-10-22 19:44:20.155076145,12440383,T,IEX,87.150000,200
2019-10-22 19:45:55.713426944,2019-10-22 19:45:55.713412134,12521547,T,IEX,87.130000,1
2019-10-22 19:46:01.131692032,2019-10-22 19:46:01.131672781,12528086,T,IEX,87.130000,200
2019-10-22 19:46:01.233498112,2019-10-22 19:46:01.233480661,12528220,T,IEX,87.130000,200
2019-10-22 19:46:06.850628096,2019-10-22 19:46:06.850608582,12536124,T,IEX,87.125000,100
2019-10-22 19:46:48.48108032,2019-10-22 19:46:48.48090790,12570472,T,IEX,87.120000,100
2019-10-22 19:47:27.633224960,2019-10-22 19:47:27.633207250,12607731,T,IEX,87.120000,200
2019-10-22 19:48:08.479399936,2019-10-22 19:48:08.479380513,12643374,T,IEX,87.120000,128
2019-10-22 19:48:08.479426048,2019-10-22 19:48:08.479406925,12643376,T,IEX,87.120000,100
2019-10-22 19:48:08.480687104,2019-10-22 19:48:08.480665434,12643415,T,IEX,87.120000,100
2019-10-22 19:48:38.433019904,2019-10-22 19:48:38.432999901,12664754,T,IEX,87.125000,300
2019-10-22 19:48:38.433036032,2019-10-22 19:48:38.433018278,12664755,T,IEX,87.125000,300
2019-10-22 19:48:41.896079104,2019-10-22 19:48:41.896059996,12667204,T,IEX,87.125000,200
2019-10-22 19:48:41.896096000,2019-10-22 19:48:41.896078562,12667205,T,IEX,87.125000,300
2019-10-22 19:48:41.896451072,2019-10-22 19:48:41.896434313,12667206,T,IEX,87.125000,100
2019-10-22 19:53:01.250883072,2019-10-22 19:53:01.250865727,12873377,T,IEX,87.130000,300
2019-10-22 19:53:09.663823872,2019-10-22 19:53:09.663805931,12881554,T,IEX,87.135000,600
2019-10-22 19:53:47.109201920,2019-10-22 19:53:47.109181269,12913752,T,IEX,87.135000,400
2019-10-22 19:53:48.22562048,2019-10-22 19:53:48.22542879,12914565,T,IEX,87.135000,300
2019-10-22 19:53:53.855186944,2019-10-22 19:53:53.855169279,12919166,T,IEX,87.130000,100
2019-10-22 19:53:54.720916992,2019-10-22 19:53:54.720896103,12919625,T,IEX,87.135000,800
2019-10-22 19:53:54.720965888,2019-10-22 19:53:54.720949730,12919626,T,IEX,87.135000,400
2019-10-22 19:54:00.569775104,2019-10-22 19:54:00.569753875,12927968,T,IEX,87.135000,100
2019-10-22 19:54:00.712598016,2019-10-22 19:54:00.712578763,12928843,T,IEX,87.135000,100
2019-10-22 19:54:00.714171904,2019-10-22 19:54:00.714153041,12928863,T,IEX,87.135000,100
2019-10-22 19:54:00.954352128,2019-10-22 19:54:00.954335361,12929643,T,IEX,87.135000,100
2019-10-22 19:54:01.902253056,2019-10-22 19:54:01.902238300,12931537,T,IEX,87.135000,300
2019-10-22 19:54:07.637776896,2019-10-22 19:54:07.637757324,12938594,T,IEX,87.125000,100
2019-10-22 19:54:19.473893888,2019-10-22 19:54:19.473872752,12945692,T,IEX,87.125000,100
2019-10-22 19:54:43.788734976,2019-10-22 19:54:43.788712761,12963762,T,IEX,87.120000,100
2019-10-22 19:54:43.788747008,2019-10-22 19:54:43.788726906,12963763,T,IEX,87.120000,100
2019-10-22 19:54:51.229260032,2019-10-22 19:54:51.229243713,12972406,T,IEX,87.120000,300
2019-10-22 19:55:24.154948096,2019-10-22 19:55:24.154931301,13017818,T,IEX,87.125000,100
2019-10-22 19:59:00.934912,2019-10-22 19:59:00.916031,13254455,T,IEX,87.125000,300
2019-10-22 19:59:00.3585024,2019-10-22 19:59:00.3567191,13254486,T,IEX,87.125000,300
2019-10-22 19:59:00.5165056,2019-10-22 19:59:00.5146999,13254509,T,IEX,87.125000,300
2019-10-22 19:59:00.6555904,2019-10-22 19:59:00.6537544,13254539,T,IEX,87.125000,300
2019-10-22 19:59:10.136198912,2019-10-22 19:59:10.136180491,13271373,T,IEX,87.135000,200
2019-10-22 19:59:11.319619072,2019-10-22 19:59:11.319604080,13273344,T,IEX,87.145000,300
2019-10-22 19:59:12.109242880,2019-10-22 19:59:12.109226918,13274822,T,IEX,87.145000,300
2019-10-22 19:59:12.110813952,2019-10-22 19:59:12.110794400,13274824,T,IEX,87.145000,300
2019-10-22 19:59:12.113082112,2019-10-22 19:59:12.113063792,13274826,T,IEX,87.145000,300
2019-10-22 19:59:12.114865920,2019-10-22 19:59:12.114849229,13274833,T,IEX,87.145000,300
2019-10-22 19:59:23.526432000,2019-10-22 19:59:23.526411891,13289960,T,IEX,87.135000,100
2019-10-22 19:59:23.526479104,2019-10-22 19:59:23.526455864,13289961,T,IEX,87.135000,200
2019-10-22 19:59:28.93965056,2019-10-22 19:59:28.93945739,13295429,T,IEX,87.135000,300
2019-10-22 19:59:28.93985024,2019-10-22 19:59:28.93966785,13295430,T,IEX,87.130000,8500
2019-10-22 19:59:28.93999104,2019-10-22 19:59:28.93980224,13295431,T,IEX,87.130000,2100
2019-10-22 19:59:31.113024000,2019-10-22 19:59:31.113007236,13305566,T,IEX,87.135000,300
2019-10-22 19:59:31.113946112,2019-10-22 19:59:31.113926681,13305567,T,IEX,87.135000,300
2019-10-22 19:59:32.597360128,2019-10-22 19:59:32.597344455,13312274,T,IEX,87.135000,1
2019-10-22 19:59:35.652196096,2019-10-22 19:59:35.652180304,13328410,T,IEX,87.155000,300
2019-10-22 19:59:35.653199104,2019-10-22 19:59:35.653182058,13328413,T,IEX,87.155000,300
2019-10-22 19:59:38.134263040,2019-10-22 19:59:38.134247098,13340418,T,IEX,87.155000,100
2019-10-22 19:59:38.725165056,2019-10-22 19:59:38.725147349,13343696,T,IEX,87.155000,200
2019-10-22 19:59:39.776620032,2019-10-22 19:59:39.776603837,13348730,T,IEX,87.155000,100
2019-10-22 19:59:40.692634880,2019-10-22 19:59:40.692618653,13355372,T,IEX,87.155000,300
2019-10-22 19:59:40.693530880,2019-10-22 19:59:40.693513255,13355389,T,IEX,87.155000,300
2019-10-22 19:59:40.697221888,2019-10-22 19:59:40.697206486,13355457,T,IEX,87.155000,100
2019-10-22 19:59:41.85586944,2019-10-22 19:59:41.85569687,13360251,T,IEX,87.155000,100
2019-10-22 19:59:41.91987968,2019-10-22 19:59:41.91969125,13360576,T,IEX,87.155000,100
2019-10-22 19:59:41.100654080,2019-10-22 19:59:41.100636981,13360624,T,IEX,87.155000,100
2019-10-22 19:59:44.441600000,2019-10-22 19:59:44.441585487,13379347,T,IEX,87.155000,100
2019-10-22 19:59:44.442572032,2019-10-22 19:59:44.442554655,13379351,T,IEX,87.155000,200
2019-10-22 19:59:47.900518912,2019-10-22 19:59:47.900502021,13402609,T,IEX,87.145000,100
2019-10-22 19:59:48.105144064,2019-10-22 19:59:48.105123131,13403769,T,IEX,87.145000,100
2019-10-22 19:59:48.106548992,2019-10-22 19:59:48.106505554,13403950,T,IEX,87.145000,100
2019-10-22 19:59:56.53829888,2019-10-22 19:59:56.53811661,13459047,T,IEX,87.130000,200
