2019-10-23 13:30:18.282541056,2019-10-23 13:30:18.282516959,106929,T,IEX,133.320000,100
2019-10-23 13:31:00.911631872,2019-10-23 13:31:00.911610309,152250,T,IEX,133.645000,100
2019-10-23 13:31:00.911687936,2019-10-23 13:31:00.911666802,152251,T,IEX,133.645000,300
2019-10-23 13:32:14.51842048,2019-10-23 13:32:14.51818111,232388,T,IEX,133.350000,11
2019-10-23 13:32:14.51941888,2019-10-23 13:32:14.51917854,232392,T,IEX,133.350000,89
2019-10-23 13:34:16.536278016,2019-10-23 13:34:16.536261004,367703,T,IEX,133.300000,37
2019-10-23 13:34:16.536371968,2019-10-23 13:34:16.536354003,367704,T,IEX,133.300000,37
2019-10-23 13:34:17.169154048,2019-10-23 13:34:17.169132388,368429,T,IEX,133.320000,5
2019-10-23 13:34:18.170216960,2019-10-23 13:34:18.170195582,369640,T,IEX,133.320000,100
2019-10-23 13:34:19.68873984,2019-10-23 13:34:19.68855802,370425,T,IEX,133.320000,5
2019-10-23 13:34:19.68934912,2019-10-23 13:34:19.68909763,370428,T,IEX,133.320000,25
2019-10-23 13:34:19.853934080,2019-10-23 13:34:19.853913303,371616,T,IEX,133.350000,1
2019-10-23 13:34:19.854017024,2019-10-23 13:34:19.854001047,371617,T,IEX,133.350000,2
2019-10-23 13:34:21.204540928,2019-10-23 13:34:21.204522155,372974,T,IEX,133.455000,100
2019-10-23 13:35:00.100588032,2019-10-23 13:35:00.100568269,410326,T,IEX,133.310000,8
2019-10-23 13:36:27.244482048,2019-10-23 13:36:27.244464785,519978,T,IEX,133.250000,100
2019-10-23 13:36:44.648120064,2019-10-23 13:36:44.648098944,540630,T,IEX,133.140000,100
2019-10-23 13:37:13.443081984,2019-10-23 13:37:13.443064674,583744,T,IEX,133.000000,1
2019-10-23 13:38:32.632328960,2019-10-23 13:38:32.632309141,688957,T,IEX,133.370000,100
2019-10-23 13:38:45.83611904,2019-10-23 13:38:45.83591937,701369,T,IEX,133.440000,50
2019-10-23 13:41:41.840123904,2019-10-23 13:41:41.840105767,875484,T,IEX,133.215000,200
2019-10-23 13:42:24.194472960,2019-10-23 13:42:24.194456726,915222,T,IEX,133.300000,100
2019-10-23 13:43:19.231933952,2019-10-23 13:43:19.231914304,959849,T,IEX,133.090000,100
2019-10-23 13:43:31.180967936,2019-10-23 13:43:31.180949786,970151,T,IEX,133.045000,100
2019-10-23 13:43:53.600999936,2019-10-23 13:43:53.600979673,990417,T,IEX,133.075000,100
2019-10-23 13:44:06.937897984,2019-10-23 13:44:06.937875176,1003893,T,IEX,132.990000,100
2019-10-23 13:44:07.33506048,2019-10-23 13:44:07.33490127,1003995,T,IEX,132.995000,100
2019-10-23 13:44:27.222694912,2019-10-23 13:44:27.222677163,1021612,T,IEX,132.810000,100
2019-10-23 13:44:42.526043904,2019-10-23 13:44:42.526023675,1033847,T,IEX,132.780000,100
2019-10-23 13:44:57.438996992,2019-10-23 13:44:57.438979012,1044484,T,IEX,132.825000,100
2019-10-23 13:45:37.368718080,2019-10-23 13:45:37.368698227,1089227,T,IEX,132.955000,1
2019-10-23 13:45:46.101454080,2019-10-23 13:45:46.101432280,1095965,T,IEX,133.005000,100
2019-10-23 13:45:46.101477888,2019-10-23 13:45:46.101458546,1095966,T,IEX,133.005000,1
2019-10-23 13:45:52.377692928,2019-10-23 13:45:52.377675181,1101255,T,IEX,133.000000,1
2019-10-23 13:45:55.369200896,2019-10-23 13:45:55.369181318,1104070,T,IEX,132.995000,1
2019-10-23 13:45:59.938353920,2019-10-23 13:45:59.938333858,1107588,T,IEX,132.975000,2
2019-10-23 13:46:13.353416960,2019-10-23 13:46:13.353399627,1118457,T,IEX,132.965000,1
2019-10-23 13:46:13.371846912,2019-10-23 13:46:13.371826501,1118488,T,IEX,132.980000,1
2019-10-23 13:46:30.320721920,2019-10-23 13:46:30.320699701,1133735,T,IEX,132.925000,100
2019-10-23 13:46:48.605876992,2019-10-23 13:46:48.605855648,1150972,T,IEX,132.885000,1
2019-10-23 13:46:48.605896960,2019-10-23 13:46:48.605879859,1150973,T,IEX,132.885000,100
2019-10-23 13:46:50.794348032,2019-10-23 13:46:50.794329931,1152996,T,IEX,132.885000,2
2019-10-23 13:47:14.350345984,2019-10-23 13:47:14.350326618,1173222,T,IEX,132.925000,100
2019-10-23 13:47:24.577184000,2019-10-23 13:47:24.577165336,1181688,T,IEX,132.925000,3
2019-10-23 13:47:24.632307968,2019-10-23 13:47:24.632289070,1181744,T,IEX,132.980000,5
2019-10-23 13:47:54.266953984,2019-10-23 13:47:54.266932451,1211834,T,IEX,132.950000,100
2019-10-23 13:48:19.53193984,2019-10-23 13:48:19.53174600,1232743,T,IEX,132.960000,100
2019-10-23 13:48:19.53218048,2019-10-23 13:48:19.53201971,1232744,T,IEX,132.970000,1
2019-10-23 13:48:19.101111040,2019-10-23 13:48:19.101092110,1232768,T,IEX,132.970000,6
2019-10-23 13:48:24.307944960,2019-10-23 13:48:24.307924735,1238110,T,IEX,133.020000,100
2019-10-23 13:48:24.307962112,2019-10-23 13:48:24.307944740,1238111,T,IEX,133.020000,1
2019-10-23 13:48:27.818765056,2019-10-23 13:48:27.818746144,1240825,T,IEX,133.020000,1
2019-10-23 13:49:15.39808000,2019-10-23 13:49:15.39788072,1274969,T,IEX,132.990000,18
2019-10-23 13:49:16.148642048,2019-10-23 13:49:16.148622443,1276084,T,IEX,132.960000,100
2019-10-23 13:49:16.152352000,2019-10-23 13:49:16.152328320,1276085,T,IEX,132.960000,2
2019-10-23 13:49:16.164652032,2019-10-23 13:49:16.164631574,1276102,T,IEX,133.000000,20
2019-10-23 13:49:16.164664064,2019-10-23 13:49:16.164645651,1276103,T,IEX,133.000000,2
2019-10-23 13:49:28.427142912,2019-10-23 13:49:28.427125956,1285042,T,IEX,132.940000,1
2019-10-23 13:49:28.427164928,2019-10-23 13:49:28.427147489,1285043,T,IEX,132.940000,100
2019-10-23 13:49:33.456268032,2019-10-23 13:49:33.456251529,1289890,T,IEX,132.935000,5
2019-10-23 13:49:33.473889024,2019-10-23 13:49:33.473869314,1289902,T,IEX,132.960000,1
2019-10-23 13:50:04.740657920,2019-10-23 13:50:04.740640162,1312262,T,IEX,132.905000,100
2019-10-23 13:50:04.740670976,2019-10-23 13:50:04.740653996,1312263,T,IEX,132.905000,100
2019-10-23 13:50:04.832098048,2019-10-23 13:50:04.832077110,1312312,T,IEX,132.950000,1
2019-10-23 13:50:10.565795072,2019-10-23 13:50:10.565773731,1318084,T,IEX,132.925000,100
2019-10-23 13:50:25.804422912,2019-10-23 13:50:25.804402794,1331464,T,IEX,132.835000,100
2019-10-23 13:50:25.996108032,2019-10-23 13:50:25.996087436,1331673,T,IEX,132.825000,100
2019-10-23 13:50:26.492176896,2019-10-23 13:50:26.492155422,1332085,T,IEX,132.810000,100
2019-10-23 13:50:31.215788032,2019-10-23 13:50:31.215768258,1336646,T,IEX,132.790000,4
2019-10-23 13:51:14.807314944,2019-10-23 13:51:14.807295122,1375588,T,IEX,132.830000,7
2019-10-23 13:51:38.178002944,2019-10-23 13:51:38.177984689,1394897,T,IEX,132.810000,13
2019-10-23 13:51:38.178020096,2019-10-23 13:51:38.178003161,1394898,T,IEX,132.810000,200
2019-10-23 13:51:38.178038016,2019-10-23 13:51:38.178021012,1394899,T,IEX,132.810000,100
2019-10-23 13:52:11.388197120,2019-10-23 13:52:11.388174550,1431035,T,IEX,132.745000,3
2019-10-23 13:52:18.474998016,2019-10-23 13:52:18.474979122,1438578,T,IEX,132.735000,1
2019-10-23 13:52:18.486108928,2019-10-23 13:52:18.486087927,1438580,T,IEX,132.750000,15
2019-10-23 13:52:18.491757056,2019-10-23 13:52:18.491736876,1438585,T,IEX,132.745000,100
2019-10-23 13:52:24.438942976,2019-10-23 13:52:24.438921760,1444127,T,IEX,132.770000,1
2019-10-23 13:52:24.449722880,2019-10-23 13:52:24.449701851,1444134,T,IEX,132.800000,1
2019-10-23 13:52:35.29504000,2019-10-23 13:52:35.29483646,1453478,T,IEX,132.780000,1
2019-10-23 13:52:44.720145920,2019-10-23 13:52:44.720124191,1459898,T,IEX,132.840000,100
2019-10-23 13:52:44.720158976,2019-10-23 13:52:44.720140216,1459899,T,IEX,132.840000,100
2019-10-23 13:53:05.31464960,2019-10-23 13:53:05.31448588,1477704,T,IEX,132.880000,1
2019-10-23 13:53:22.385294080,2019-10-23 13:53:22.385276803,1491517,T,IEX,132.920000,1
2019-10-23 13:53:30.390813952,2019-10-23 13:53:30.390794994,1498409,T,IEX,132.970000,100
2019-10-23 13:53:36.142917888,2019-10-23 13:53:36.142897804,1503386,T,IEX,133.035000,1
2019-10-23 13:53:53.567131904,2019-10-23 13:53:53.567111628,1514620,T,IEX,133.075000,1
2019-10-23 13:54:44.776551936,2019-10-23 13:54:44.776529475,1567034,T,IEX,132.920000,1
2019-10-23 13:55:28.562330880,2019-10-23 13:55:28.562310541,1605448,T,IEX,132.950000,5
2019-10-23 13:55:28.575301120,2019-10-23 13:55:28.575281818,1605456,T,IEX,132.980000,1
2019-10-23 13:55:32.902009088,2019-10-23 13:55:32.901987553,1613383,T,IEX,132.920000,100
2019-10-23 13:55:41.309543936,2019-10-23 13:55:41.309522998,1622719,T,IEX,132.915000,100
2019-10-23 13:55:46.215388928,2019-10-23 13:55:46.215368574,1626575,T,IEX,132.920000,1
2019-10-23 13:56:27.91628032,2019-10-23 13:56:27.91606409,1664434,T,IEX,132.925000,100
2019-10-23 13:56:34.44194048,2019-10-23 13:56:34.44175996,1669717,T,IEX,132.925000,2
2019-10-23 13:56:34.44218112,2019-10-23 13:56:34.44202173,1669718,T,IEX,132.925000,100
2019-10-23 13:56:46.510763008,2019-10-23 13:56:46.510744860,1680127,T,IEX,132.995000,100
2019-10-23 13:56:56.536560128,2019-10-23 13:56:56.536537924,1687309,T,IEX,132.950000,1000
2019-10-23 13:57:23.258245888,2019-10-23 13:57:23.258226757,1714019,T,IEX,132.915000,100
2019-10-23 13:57:28.137057024,2019-10-23 13:57:28.137038357,1719486,T,IEX,132.920000,28
2019-10-23 13:57:44.110960896,2019-10-23 13:57:44.110937735,1734090,T,IEX,132.925000,100
2019-10-23 13:57:44.121668096,2019-10-23 13:57:44.121647553,1734098,T,IEX,132.940000,100
2019-10-23 13:58:23.291389952,2019-10-23 13:58:23.291369081,1764862,T,IEX,133.010000,100
2019-10-23 13:58:50.720126976,2019-10-23 13:58:50.720110995,1787834,T,IEX,133.010000,50
2019-10-23 13:58:57.744570880,2019-10-23 13:58:57.744550689,1791782,T,IEX,133.000000,100
2019-10-23 13:59:25.287739904,2019-10-23 13:59:25.287720406,1818095,T,IEX,132.970000,48
2019-10-23 13:59:25.288164096,2019-10-23 13:59:25.288146983,1818097,T,IEX,132.970000,52
2019-10-23 13:59:57.723109120,2019-10-23 13:59:57.723090518,1846279,T,IEX,132.970000,100
2019-10-23 14:00:09.437455872,2019-10-23 14:00:09.437434556,1855629,T,IEX,132.965000,10
2019-10-23 14:00:14.190398976,2019-10-23 14:00:14.190375366,1861641,T,IEX,132.950000,100
2019-10-23 14:01:23.371081984,2019-10-23 14:01:23.371062489,1934745,T,IEX,133.035000,113
2019-10-23 14:01:52.927097088,2019-10-23 14:01:52.927076524,1959534,T,IEX,133.010000,100
2019-10-23 14:02:23.393719040,2019-10-23 14:02:23.393696013,1995240,T,IEX,133.010000,100
2019-10-23 14:02:28.103890944,2019-10-23 14:02:28.103869167,2000775,T,IEX,133.000000,1
2019-10-23 14:02:48.314260992,2019-10-23 14:02:48.314244493,2019769,T,IEX,132.980000,100
2019-10-23 14:03:03.61796096,2019-10-23 14:03:03.61777607,2031979,T,IEX,132.990000,1
2019-10-23 14:03:11.800259072,2019-10-23 14:03:11.800238479,2042488,T,IEX,133.085000,1
2019-10-23 14:03:18.699649024,2019-10-23 14:03:18.699632765,2049499,T,IEX,133.025000,1
2019-10-23 14:03:19.928948992,2019-10-23 14:03:19.928928976,2050339,T,IEX,133.020000,100
2019-10-23 14:03:23.436372992,2019-10-23 14:03:23.436350606,2054160,T,IEX,133.020000,1
2019-10-23 14:04:02.482121984,2019-10-23 14:04:02.482103636,2086163,T,IEX,132.960000,2
2019-10-23 14:04:11.26909952,2019-10-23 14:04:11.26890411,2097343,T,IEX,132.990000,100
2019-10-23 14:04:11.26932992,2019-10-23 14:04:11.26913947,2097344,T,IEX,132.990000,100
2019-10-23 14:04:23.492226048,2019-10-23 14:04:23.492205844,2108620,T,IEX,133.050000,100
2019-10-23 14:04:48.588112896,2019-10-23 14:04:48.588093480,2127776,T,IEX,132.980000,100
2019-10-23 14:04:48.589156096,2019-10-23 14:04:48.589136543,2127777,T,IEX,132.980000,100
2019-10-23 14:05:23.538789120,2019-10-23 14:05:23.538770755,2158478,T,IEX,132.990000,100
2019-10-23 14:05:30.796294912,2019-10-23 14:05:30.796277655,2164655,T,IEX,133.000000,200
2019-10-23 14:05:33.898377984,2019-10-23 14:05:33.898358640,2167958,T,IEX,133.060000,100
2019-10-23 14:05:55.947780096,2019-10-23 14:05:55.947758314,2189607,T,IEX,133.020000,100
2019-10-23 14:05:58.273336064,2019-10-23 14:05:58.273319279,2191709,T,IEX,133.000000,2
2019-10-23 14:06:34.939462912,2019-10-23 14:06:34.939443526,2221668,T,IEX,133.030000,100
2019-10-23 14:07:31.977012992,2019-10-23 14:07:31.976991710,2264120,T,IEX,133.050000,100
2019-10-23 14:07:44.586588928,2019-10-23 14:07:44.586568977,2272539,T,IEX,133.040000,100
2019-10-23 14:08:31.116004096,2019-10-23 14:08:31.115974860,2310170,T,IEX,133.030000,100
2019-10-23 14:09:18.34905088,2019-10-23 14:09:18.34887781,2347276,T,IEX,132.980000,100
2019-10-23 14:09:24.669360896,2019-10-23 14:09:24.669341239,2352329,T,IEX,133.000000,1
2019-10-23 14:09:38.905092096,2019-10-23 14:09:38.905072535,2363912,T,IEX,133.040000,100
2019-10-23 14:10:23.857858048,2019-10-23 14:10:23.857837477,2404455,T,IEX,133.100000,100
2019-10-23 14:10:23.970006016,2019-10-23 14:10:23.969988442,2404522,T,IEX,133.120000,10
2019-10-23 14:10:43.382596096,2019-10-23 14:10:43.382575246,2421873,T,IEX,133.200000,15
2019-10-23 14:10:57.342371072,2019-10-23 14:10:57.342349665,2430778,T,IEX,133.205000,100
2019-10-23 14:11:04.525967872,2019-10-23 14:11:04.525949567,2437137,T,IEX,133.220000,100
2019-10-23 14:11:42.874021888,2019-10-23 14:11:42.874000049,2471254,T,IEX,133.220000,100
2019-10-23 14:12:24.89373952,2019-10-23 14:12:24.89354165,2503757,T,IEX,133.225000,100
2019-10-23 14:12:54.752880896,2019-10-23 14:12:54.752865331,2525740,T,IEX,133.260000,100
2019-10-23 14:13:25.139220992,2019-10-23 14:13:25.139204644,2549151,T,IEX,133.340000,100
2019-10-23 14:14:04.156175104,2019-10-23 14:14:04.156153979,2577116,T,IEX,133.320000,100
2019-10-23 14:14:04.157274880,2019-10-23 14:14:04.157255555,2577117,T,IEX,133.320000,4
2019-10-23 14:14:24.127078912,2019-10-23 14:14:24.127057119,2593649,T,IEX,133.310000,100
2019-10-23 14:14:27.670675968,2019-10-23 14:14:27.670655307,2596393,T,IEX,133.310000,100
2019-10-23 14:14:40.275620096,2019-10-23 14:14:40.275599938,2604419,T,IEX,133.290000,1
2019-10-23 14:14:51.27876096,2019-10-23 14:14:51.27854391,2611016,T,IEX,133.275000,1
2019-10-23 14:15:21.232878080,2019-10-23 14:15:21.232857264,2635204,T,IEX,133.290000,2
2019-10-23 14:15:24.171621120,2019-10-23 14:15:24.171598912,2636908,T,IEX,133.290000,100
2019-10-23 14:15:24.171633920,2019-10-23 14:15:24.171616355,2636909,T,IEX,133.290000,5
2019-10-23 14:15:25.264864000,2019-10-23 14:15:25.264839648,2638291,T,IEX,133.290000,1
2019-10-23 14:15:53.101324032,2019-10-23 14:15:53.101300795,2665662,T,IEX,133.195000,1
2019-10-23 14:15:53.150614016,2019-10-23 14:15:53.150594505,2665747,T,IEX,133.195000,1
2019-10-23 14:15:55.793121024,2019-10-23 14:15:55.793102510,2667599,T,IEX,133.200000,1
2019-10-23 14:16:19.936833024,2019-10-23 14:16:19.936815108,2688308,T,IEX,133.180000,5
2019-10-23 14:16:24.204302080,2019-10-23 14:16:24.204282051,2693778,T,IEX,133.175000,100
2019-10-23 14:16:24.204326912,2019-10-23 14:16:24.204309674,2693779,T,IEX,133.175000,4
2019-10-23 14:16:47.866292992,2019-10-23 14:16:47.866273679,2711387,T,IEX,133.170000,1
2019-10-23 14:16:54.263248896,2019-10-23 14:16:54.263228373,2714973,T,IEX,133.170000,100
2019-10-23 14:17:57.519088896,2019-10-23 14:17:57.519069971,2765647,T,IEX,133.160000,100
2019-10-23 14:18:55.773295104,2019-10-23 14:18:55.773266713,2806473,T,IEX,133.190000,100
2019-10-23 14:18:55.773309952,2019-10-23 14:18:55.773292849,2806474,T,IEX,133.190000,100
2019-10-23 14:19:38.721137920,2019-10-23 14:19:38.721117873,2844769,T,IEX,133.315000,100
2019-10-23 14:19:56.846519040,2019-10-23 14:19:56.846497823,2859750,T,IEX,133.305000,100
2019-10-23 14:20:39.386117888,2019-10-23 14:20:39.386098200,2889342,T,IEX,133.290000,2
2019-10-23 14:20:58.777869056,2019-10-23 14:20:58.777846679,2902838,T,IEX,133.295000,100
2019-10-23 14:21:10.232827904,2019-10-23 14:21:10.232808443,2911552,T,IEX,133.340000,100
2019-10-23 14:21:14.826213120,2019-10-23 14:21:14.826192843,2915342,T,IEX,133.340000,1
2019-10-23 14:21:19.850917888,2019-10-23 14:21:19.850896575,2918667,T,IEX,133.340000,1
2019-10-23 14:21:23.993566976,2019-10-23 14:21:23.993545812,2923527,T,IEX,133.410000,100
2019-10-23 14:21:24.484779008,2019-10-23 14:21:24.484757320,2923977,T,IEX,133.445000,1
2019-10-23 14:21:28.842961920,2019-10-23 14:21:28.842940870,2928496,T,IEX,133.440000,1
2019-10-23 14:21:35.346127104,2019-10-23 14:21:35.346109807,2933089,T,IEX,133.460000,1
2019-10-23 14:21:35.384556032,2019-10-23 14:21:35.384534249,2933145,T,IEX,133.460000,1
2019-10-23 14:21:53.905433088,2019-10-23 14:21:53.905411734,2947718,T,IEX,133.455000,1
2019-10-23 14:22:01.929684992,2019-10-23 14:22:01.929662374,2953244,T,IEX,133.455000,2
2019-10-23 14:22:01.929702912,2019-10-23 14:22:01.929685135,2953245,T,IEX,133.455000,100
2019-10-23 14:22:02.41513984,2019-10-23 14:22:02.41497422,2953305,T,IEX,133.455000,1
2019-10-23 14:22:38.235149056,2019-10-23 14:22:38.235127683,2977034,T,IEX,133.395000,100
2019-10-23 14:22:52.853625088,2019-10-23 14:22:52.853607355,2986306,T,IEX,133.350000,1
2019-10-23 14:22:52.861101056,2019-10-23 14:22:52.861082870,2986312,T,IEX,133.350000,4
2019-10-23 14:22:58.577474048,2019-10-23 14:22:58.577455057,2989543,T,IEX,133.365000,1
2019-10-23 14:22:59.495227904,2019-10-23 14:22:59.495207233,2989969,T,IEX,133.370000,100
2019-10-23 14:23:20.547964928,2019-10-23 14:23:20.547945345,3003720,T,IEX,133.370000,94
2019-10-23 14:23:23.376648960,2019-10-23 14:23:23.376630639,3006179,T,IEX,133.390000,2
2019-10-23 14:23:33.180879104,2019-10-23 14:23:33.180859648,3013766,T,IEX,133.400000,2
2019-10-23 14:24:00.911371008,2019-10-23 14:24:00.911350868,3027655,T,IEX,133.445000,1
2019-10-23 14:24:07.586578944,2019-10-23 14:24:07.586558312,3033411,T,IEX,133.510000,2
2019-10-23 14:24:19.228145920,2019-10-23 14:24:19.228127714,3041097,T,IEX,133.510000,100
2019-10-23 14:25:06.359369984,2019-10-23 14:25:06.359350260,3075368,T,IEX,133.425000,1
2019-10-23 14:25:35.867538944,2019-10-23 14:25:35.867517549,3091684,T,IEX,133.430000,100
2019-10-23 14:26:11.614697984,2019-10-23 14:26:11.614679425,3113357,T,IEX,133.355000,100
2019-10-23 14:26:16.762482944,2019-10-23 14:26:16.762451506,3116330,T,IEX,133.355000,500
2019-10-23 14:26:16.762488064,2019-10-23 14:26:16.762469620,3116331,T,IEX,133.355000,100
2019-10-23 14:26:34.547736064,2019-10-23 14:26:34.547715460,3131713,T,IEX,133.315000,1
2019-10-23 14:26:50.195048960,2019-10-23 14:26:50.195030388,3140468,T,IEX,133.320000,4
2019-10-23 14:26:58.13953024,2019-10-23 14:26:58.13933559,3144247,T,IEX,133.330000,1
2019-10-23 14:27:09.286074880,2019-10-23 14:27:09.286053615,3153442,T,IEX,133.345000,100
2019-10-23 14:27:13.137536000,2019-10-23 14:27:13.137518921,3156059,T,IEX,133.345000,1
2019-10-23 14:27:13.221306112,2019-10-23 14:27:13.221287849,3156273,T,IEX,133.350000,1
2019-10-23 14:27:14.101016064,2019-10-23 14:27:14.100996802,3156870,T,IEX,133.350000,100
2019-10-23 14:28:04.909253120,2019-10-23 14:28:04.909234076,3190723,T,IEX,133.340000,1
2019-10-23 14:28:18.657241088,2019-10-23 14:28:18.657223437,3199856,T,IEX,133.335000,100
2019-10-23 14:28:53.185238016,2019-10-23 14:28:53.185217635,3221008,T,IEX,133.345000,100
2019-10-23 14:29:25.215773952,2019-10-23 14:29:25.215752904,3240416,T,IEX,133.290000,100
2019-10-23 14:29:49.123771904,2019-10-23 14:29:49.123750669,3252694,T,IEX,133.320000,100
2019-10-23 14:30:02.291591936,2019-10-23 14:30:02.291574284,3268458,T,IEX,133.450000,100
2019-10-23 14:30:02.291610880,2019-10-23 14:30:02.291593806,3268459,T,IEX,133.450000,100
2019-10-23 14:30:29.412398080,2019-10-23 14:30:29.412378159,3308099,T,IEX,133.560000,100
2019-10-23 14:30:29.484944896,2019-10-23 14:30:29.484927452,3308219,T,IEX,133.560000,100
2019-10-23 14:31:33.180257024,2019-10-23 14:31:33.180236373,3371685,T,IEX,133.435000,100
2019-10-23 14:32:35.34758912,2019-10-23 14:32:35.34738181,3444754,T,IEX,133.265000,100
2019-10-23 14:32:35.56579072,2019-10-23 14:32:35.56558633,3444763,T,IEX,133.265000,100
2019-10-23 14:32:50.203810048,2019-10-23 14:32:50.203789251,3455558,T,IEX,133.275000,100
2019-10-23 14:33:22.237170944,2019-10-23 14:33:22.237152838,3480910,T,IEX,133.265000,2
2019-10-23 14:33:40.707034112,2019-10-23 14:33:40.707014194,3494498,T,IEX,133.280000,100
2019-10-23 14:33:43.675155968,2019-10-23 14:33:43.675133897,3496198,T,IEX,133.280000,100
2019-10-23 14:34:44.814960128,2019-10-23 14:34:44.814940340,3547461,T,IEX,133.315000,100
2019-10-23 14:35:03.70734080,2019-10-23 14:35:03.70712657,3563061,T,IEX,133.320000,1
2019-10-23 14:35:24.175235072,2019-10-23 14:35:24.175213743,3587683,T,IEX,133.380000,100
2019-10-23 14:35:50.816953088,2019-10-23 14:35:50.816933348,3607925,T,IEX,133.330000,1
2019-10-23 14:35:50.816968960,2019-10-23 14:35:50.816953268,3607926,T,IEX,133.330000,2
2019-10-23 14:35:50.816989952,2019-10-23 14:35:50.816970963,3607927,T,IEX,133.330000,4
2019-10-23 14:35:50.816999936,2019-10-23 14:35:50.816982990,3607928,T,IEX,133.330000,3
2019-10-23 14:35:50.817020928,2019-10-23 14:35:50.817002963,3607929,T,IEX,133.330000,2
2019-10-23 14:36:12.245155072,2019-10-23 14:36:12.245136727,3626585,T,IEX,133.305000,100
2019-10-23 14:36:20.841140992,2019-10-23 14:36:20.841119430,3631351,T,IEX,133.265000,100
2019-10-23 14:36:20.841156096,2019-10-23 14:36:20.841138388,3631352,T,IEX,133.265000,100
2019-10-23 14:36:20.868508928,2019-10-23 14:36:20.868486963,3631358,T,IEX,133.265000,100
2019-10-23 14:36:20.876548096,2019-10-23 14:36:20.876527862,3631361,T,IEX,133.265000,100
2019-10-23 14:36:56.25587968,2019-10-23 14:36:56.25568483,3656096,T,IEX,133.330000,100
2019-10-23 14:38:09.94750976,2019-10-23 14:38:09.94730117,3709583,T,IEX,133.330000,100
2019-10-23 14:38:11.387172096,2019-10-23 14:38:11.387152253,3711855,T,IEX,133.365000,100
2019-10-23 14:39:20.330246912,2019-10-23 14:39:20.330225676,3761787,T,IEX,133.420000,100
2019-10-23 14:39:20.330259968,2019-10-23 14:39:20.330243328,3761788,T,IEX,133.420000,100
2019-10-23 14:39:55.869029120,2019-10-23 14:39:55.869009291,3788098,T,IEX,133.505000,100
2019-10-23 14:40:20.698018048,2019-10-23 14:40:20.697997475,3806628,T,IEX,133.485000,100
2019-10-23 14:41:43.731102976,2019-10-23 14:41:43.731082026,3873883,T,IEX,133.635000,100
2019-10-23 14:43:25.185765120,2019-10-23 14:43:25.185743512,3941028,T,IEX,133.645000,100
2019-10-23 14:43:25.185783040,2019-10-23 14:43:25.185766610,3941029,T,IEX,133.645000,1
2019-10-23 14:43:44.760427008,2019-10-23 14:43:44.760410650,3959488,T,IEX,133.545000,100
2019-10-23 14:44:20.515002880,2019-10-23 14:44:20.514982316,3982561,T,IEX,133.565000,100
2019-10-23 14:45:08.167557120,2019-10-23 14:45:08.167371908,4020327,T,IEX,133.660000,100
2019-10-23 14:45:24.236285952,2019-10-23 14:45:24.236267974,4037389,T,IEX,133.655000,100
2019-10-23 14:46:24.277349120,2019-10-23 14:46:24.277326953,4082335,T,IEX,133.645000,100
2019-10-23 14:47:05.40698880,2019-10-23 14:47:05.40681260,4109425,T,IEX,133.645000,100
2019-10-23 14:47:24.316033024,2019-10-23 14:47:24.316012914,4122626,T,IEX,133.700000,100
2019-10-23 14:47:24.316046080,2019-10-23 14:47:24.316029222,4122627,T,IEX,133.700000,100
2019-10-23 14:47:24.326846976,2019-10-23 14:47:24.326827003,4122637,T,IEX,133.735000,100
2019-10-23 14:48:09.45584896,2019-10-23 14:48:09.45566470,4154169,T,IEX,133.790000,100
2019-10-23 14:48:09.45602048,2019-10-23 14:48:09.45584587,4154170,T,IEX,133.790000,100
2019-10-23 14:48:23.174212096,2019-10-23 14:48:23.174192092,4166258,T,IEX,133.825000,100
2019-10-23 14:50:03.655053056,2019-10-23 14:50:03.655031635,4223100,T,IEX,133.865000,1
2019-10-23 14:50:14.339523072,2019-10-23 14:50:14.339502184,4235814,T,IEX,133.860000,100
2019-10-23 14:50:36.645202944,2019-10-23 14:50:36.645182080,4248627,T,IEX,133.880000,2
2019-10-23 14:50:36.645221888,2019-10-23 14:50:36.645202112,4248628,T,IEX,133.880000,100
2019-10-23 14:50:36.653190912,2019-10-23 14:50:36.653169412,4248630,T,IEX,133.880000,3
2019-10-23 14:50:37.574825984,2019-10-23 14:50:37.574803813,4248960,T,IEX,133.880000,15
2019-10-23 14:50:42.821433088,2019-10-23 14:50:42.821415561,4252637,T,IEX,133.905000,1
2019-10-23 14:50:59.634653952,2019-10-23 14:50:59.634636926,4261826,T,IEX,133.915000,1
2019-10-23 14:51:09.383022080,2019-10-23 14:51:09.383001770,4268611,T,IEX,133.910000,2
2019-10-23 14:51:09.641712896,2019-10-23 14:51:09.641689048,4268836,T,IEX,133.910000,100
2019-10-23 14:51:11.233682944,2019-10-23 14:51:11.233662651,4272058,T,IEX,133.890000,2
2019-10-23 14:51:11.241615872,2019-10-23 14:51:11.241599338,4272066,T,IEX,133.885000,2
2019-10-23 14:51:11.439217920,2019-10-23 14:51:11.439200431,4272309,T,IEX,133.885000,3
2019-10-23 14:51:20.905320960,2019-10-23 14:51:20.905300141,4277967,T,IEX,133.890000,1
2019-10-23 14:51:48.182430976,2019-10-23 14:51:48.182408679,4296703,T,IEX,133.930000,4
2019-10-23 14:52:12.353074944,2019-10-23 14:52:12.353057218,4314992,T,IEX,133.945000,1
2019-10-23 14:52:45.958289920,2019-10-23 14:52:45.958273623,4337991,T,IEX,133.945000,100
2019-10-23 14:52:51.88690944,2019-10-23 14:52:51.88670422,4341797,T,IEX,133.950000,2
2019-10-23 14:52:52.107601920,2019-10-23 14:52:52.107584868,4344539,T,IEX,133.975000,100
2019-10-23 14:52:59.182326016,2019-10-23 14:52:59.182307392,4349872,T,IEX,133.970000,6
2019-10-23 14:54:28.610915072,2019-10-23 14:54:28.610896261,4420753,T,IEX,133.930000,100
2019-10-23 14:54:57.67678976,2019-10-23 14:54:57.67658222,4438415,T,IEX,133.970000,100
2019-10-23 14:55:47.95020032,2019-10-23 14:55:47.94998856,4474834,T,IEX,133.900000,2
2019-10-23 14:56:25.68050944,2019-10-23 14:56:25.68031792,4500257,T,IEX,133.885000,100
2019-10-23 14:56:25.73594112,2019-10-23 14:56:25.73576451,4500259,T,IEX,133.860000,100
2019-10-23 14:56:25.112643072,2019-10-23 14:56:25.112621613,4500270,T,IEX,133.870000,50
2019-10-23 14:56:41.14031872,2019-10-23 14:56:41.14011817,4508625,T,IEX,133.870000,100
2019-10-23 14:56:45.426338048,2019-10-23 14:56:45.426312791,4510439,T,IEX,133.870000,18
2019-10-23 14:57:00.356537088,2019-10-23 14:57:00.356517998,4518629,T,IEX,133.890000,100
2019-10-23 14:57:33.42760960,2019-10-23 14:57:33.42740494,4539121,T,IEX,133.875000,1
2019-10-23 14:57:46.492086016,2019-10-23 14:57:46.492067165,4547640,T,IEX,133.895000,100
2019-10-23 14:57:46.492111104,2019-10-23 14:57:46.492089349,4547643,T,IEX,133.895000,4
2019-10-23 14:59:09.885882880,2019-10-23 14:59:09.885863662,4606069,T,IEX,134.000000,2
2019-10-23 14:59:24.820593920,2019-10-23 14:59:24.820572156,4614157,T,IEX,134.010000,1
2019-10-23 15:00:02.526513920,2019-10-23 15:00:02.526494629,4642518,T,IEX,134.010000,100
2019-10-23 15:00:14.582011904,2019-10-23 15:00:14.581994146,4653302,T,IEX,134.030000,1
2019-10-23 15:00:14.582031104,2019-10-23 15:00:14.582012786,4653303,T,IEX,134.030000,1
2019-10-23 15:00:15.399729920,2019-10-23 15:00:15.399709543,4654096,T,IEX,134.040000,1
2019-10-23 15:01:20.888030976,2019-10-23 15:01:20.888013044,4697806,T,IEX,134.010000,100
2019-10-23 15:03:10.541937920,2019-10-23 15:03:10.541920213,4769215,T,IEX,134.060000,100
2019-10-23 15:03:31.991016960,2019-10-23 15:03:31.990998946,4781825,T,IEX,133.980000,3
2019-10-23 15:03:32.3738880,2019-10-23 15:03:32.3718921,4781832,T,IEX,133.970000,97
2019-10-23 15:04:45.499448064,2019-10-23 15:04:45.499428611,4824544,T,IEX,133.950000,8
2019-10-23 15:04:50.418067968,2019-10-23 15:04:50.418045318,4827009,T,IEX,133.950000,100
2019-10-23 15:06:37.170298880,2019-10-23 15:06:37.170281869,4885839,T,IEX,133.970000,100
2019-10-23 15:06:37.178789888,2019-10-23 15:06:37.178770206,4885858,T,IEX,133.990000,100
2019-10-23 15:06:37.179761920,2019-10-23 15:06:37.179743245,4885859,T,IEX,133.990000,100
2019-10-23 15:06:37.181618944,2019-10-23 15:06:37.181601548,4885863,T,IEX,134.000000,100
2019-10-23 15:06:37.185531904,2019-10-23 15:06:37.185511057,4885864,T,IEX,134.020000,52
2019-10-23 15:06:37.186480896,2019-10-23 15:06:37.186457482,4885865,T,IEX,134.020000,100
2019-10-23 15:06:37.186490880,2019-10-23 15:06:37.186473709,4885866,T,IEX,134.020000,100
2019-10-23 15:06:37.186504960,2019-10-23 15:06:37.186487023,4885867,T,IEX,134.020000,48
2019-10-23 15:07:01.318245120,2019-10-23 15:07:01.318225454,4896549,T,IEX,133.940000,100
2019-10-23 15:07:01.318259968,2019-10-23 15:07:01.318241379,4896550,T,IEX,133.940000,1
2019-10-23 15:08:26.11607040,2019-10-23 15:08:26.11586074,4944990,T,IEX,133.960000,27
2019-10-23 15:08:37.154370048,2019-10-23 15:08:37.154350464,4950945,T,IEX,133.990000,32
2019-10-23 15:09:06.623048960,2019-10-23 15:09:06.623031659,4967269,T,IEX,133.980000,1
2019-10-23 15:09:23.884337920,2019-10-23 15:09:23.884316467,4976431,T,IEX,133.985000,67
2019-10-23 15:09:25.240307968,2019-10-23 15:09:25.240290077,4977107,T,IEX,133.985000,1
2019-10-23 15:09:49.422354944,2019-10-23 15:09:49.422338931,4990577,T,IEX,134.010000,1
2019-10-23 15:09:49.430136064,2019-10-23 15:09:49.430118083,4990588,T,IEX,134.000000,1
2019-10-23 15:09:52.395484928,2019-10-23 15:09:52.395467863,4992107,T,IEX,134.000000,1
2019-10-23 15:09:53.539683072,2019-10-23 15:09:53.539662354,4992520,T,IEX,134.000000,5
2019-10-23 15:10:03.189530880,2019-10-23 15:10:03.189511259,4998620,T,IEX,134.030000,1
2019-10-23 15:10:18.534552064,2019-10-23 15:10:18.534535961,5007116,T,IEX,134.000000,2
2019-10-23 15:10:19.315624960,2019-10-23 15:10:19.315607585,5007903,T,IEX,133.980000,1
2019-10-23 15:10:25.798220032,2019-10-23 15:10:25.798198429,5012844,T,IEX,133.980000,1
2019-10-23 15:10:50.71297024,2019-10-23 15:10:50.71276033,5023944,T,IEX,133.980000,100
2019-10-23 15:10:50.442766080,2019-10-23 15:10:50.442745506,5024064,T,IEX,133.970000,1
2019-10-23 15:10:51.315618048,2019-10-23 15:10:51.315598477,5025169,T,IEX,133.940000,1
2019-10-23 15:10:53.852523008,2019-10-23 15:10:53.852506032,5028834,T,IEX,133.950000,1
2019-10-23 15:10:56.799777024,2019-10-23 15:10:56.799758933,5031618,T,IEX,133.970000,1
2019-10-23 15:11:14.386690048,2019-10-23 15:11:14.386669903,5042842,T,IEX,133.935000,1
2019-10-23 15:11:33.694589952,2019-10-23 15:11:33.694568148,5054798,T,IEX,133.950000,1
2019-10-23 15:12:02.699334912,2019-10-23 15:12:02.699315293,5073384,T,IEX,133.970000,1
2019-10-23 15:12:03.606651904,2019-10-23 15:12:03.606635277,5074198,T,IEX,133.970000,200
2019-10-23 15:12:03.609686016,2019-10-23 15:12:03.609666504,5074200,T,IEX,133.970000,10
2019-10-23 15:12:03.614053888,2019-10-23 15:12:03.614032028,5074201,T,IEX,133.960000,1
2019-10-23 15:12:03.621480960,2019-10-23 15:12:03.621461267,5074202,T,IEX,133.960000,100
2019-10-23 15:12:03.628900096,2019-10-23 15:12:03.628878786,5074207,T,IEX,133.950000,1
2019-10-23 15:12:03.638763008,2019-10-23 15:12:03.638741890,5074211,T,IEX,133.945000,100
2019-10-23 15:12:03.643144960,2019-10-23 15:12:03.643126069,5074213,T,IEX,133.940000,1
2019-10-23 15:12:03.678478080,2019-10-23 15:12:03.678456347,5074225,T,IEX,133.945000,100
2019-10-23 15:12:03.680760064,2019-10-23 15:12:03.680738765,5074226,T,IEX,133.945000,56
2019-10-23 15:12:03.701769984,2019-10-23 15:12:03.701748648,5074230,T,IEX,133.930000,144
2019-10-23 15:12:22.130663936,2019-10-23 15:12:22.130643293,5083375,T,IEX,133.945000,1
2019-10-23 15:12:22.141154048,2019-10-23 15:12:22.141132602,5083376,T,IEX,133.970000,1
2019-10-23 15:12:22.150695936,2019-10-23 15:12:22.150675419,5083378,T,IEX,134.000000,3
2019-10-23 15:12:22.150710016,2019-10-23 15:12:22.150692685,5083379,T,IEX,134.000000,1
2019-10-23 15:12:22.161619968,2019-10-23 15:12:22.161601426,5083392,T,IEX,134.020000,1
2019-10-23 15:12:22.163885056,2019-10-23 15:12:22.163868286,5083430,T,IEX,134.000000,100
2019-10-23 15:12:22.163898880,2019-10-23 15:12:22.163881242,5083431,T,IEX,134.000000,100
2019-10-23 15:12:35.808691968,2019-10-23 15:12:35.808671053,5092210,T,IEX,133.930000,2
2019-10-23 15:13:49.416732928,2019-10-23 15:13:49.416713118,5136993,T,IEX,133.900000,10
2019-10-23 15:14:25.438635008,2019-10-23 15:14:25.438617423,5160040,T,IEX,133.840000,1
2019-10-23 15:15:06.889031936,2019-10-23 15:15:06.889015468,5182962,T,IEX,133.840000,100
2019-10-23 15:15:51.758664960,2019-10-23 15:15:51.758647965,5210562,T,IEX,133.910000,19
2019-10-23 15:16:12.689927936,2019-10-23 15:16:12.689908418,5223857,T,IEX,133.910000,1
2019-10-23 15:16:25.563885056,2019-10-23 15:16:25.563864609,5229699,T,IEX,133.945000,6
2019-10-23 15:16:48.178341888,2019-10-23 15:16:48.178321710,5242183,T,IEX,133.970000,3
2019-10-23 15:17:04.816699904,2019-10-23 15:17:04.816680040,5258171,T,IEX,133.980000,100
2019-10-23 15:17:13.786405120,2019-10-23 15:17:13.786383225,5263143,T,IEX,133.980000,100
2019-10-23 15:17:19.152116992,2019-10-23 15:17:19.152097353,5267129,T,IEX,133.960000,2
2019-10-23 15:17:23.519297024,2019-10-23 15:17:23.519277095,5270355,T,IEX,133.945000,2
2019-10-23 15:17:23.526885888,2019-10-23 15:17:23.526866051,5270357,T,IEX,133.945000,4
2019-10-23 15:17:25.35507968,2019-10-23 15:17:25.35491294,5271271,T,IEX,133.940000,1
2019-10-23 15:18:05.701086976,2019-10-23 15:18:05.701066091,5296761,T,IEX,133.960000,100
2019-10-23 15:26:00.820152064,2019-10-23 15:26:00.820133014,5566381,T,IEX,133.875000,7
2019-10-23 15:26:25.982146048,2019-10-23 15:26:25.982125062,5580450,T,IEX,133.880000,7
2019-10-23 15:27:49.400420096,2019-10-23 15:27:49.400403765,5626961,T,IEX,133.850000,170
2019-10-23 15:30:11.607885056,2019-10-23 15:30:11.607865074,5707643,T,IEX,133.870000,7
2019-10-23 15:40:15.612691968,2019-10-23 15:40:15.612674337,6027962,T,IEX,134.000000,100
2019-10-23 15:40:15.617253888,2019-10-23 15:40:15.617234677,6027968,T,IEX,134.010000,100
2019-10-23 15:43:03.774969088,2019-10-23 15:43:03.774949415,6115019,T,IEX,134.165000,7
2019-10-23 15:43:19.763794944,2019-10-23 15:43:19.763778878,6126869,T,IEX,134.180000,300
2019-10-23 15:44:19.976204032,2019-10-23 15:44:19.976183607,6157163,T,IEX,134.200000,100
2019-10-23 15:45:14.207191040,2019-10-23 15:45:14.207172499,6184194,T,IEX,134.190000,100
2019-10-23 15:45:21.469643008,2019-10-23 15:45:21.469622843,6187707,T,IEX,134.210000,100
2019-10-23 15:46:13.381630976,2019-10-23 15:46:13.381615327,6212218,T,IEX,134.230000,7
2019-10-23 15:46:25.522710016,2019-10-23 15:46:25.522690579,6215993,T,IEX,134.230000,100
2019-10-23 15:48:30.7740928,2019-10-23 15:48:30.7720540,6273222,T,IEX,134.140000,7
2019-10-23 15:51:25.650743040,2019-10-23 15:51:25.650723029,6356690,T,IEX,134.050000,100
2019-10-23 15:54:28.783883008,2019-10-23 15:54:28.783866761,6442290,T,IEX,134.080000,100
2019-10-23 15:56:18.314590976,2019-10-23 15:56:18.314573414,6492085,T,IEX,134.150000,3
2019-10-23 15:56:58.203439104,2019-10-23 15:56:58.203415429,6510703,T,IEX,134.200000,100
2019-10-23 15:57:11.589883904,2019-10-23 15:57:11.589862786,6518037,T,IEX,134.170000,100
2019-10-23 15:59:26.546444032,2019-10-23 15:59:26.546428149,6576500,T,IEX,134.065000,100
2019-10-23 15:59:29.22978048,2019-10-23 15:59:29.22959455,6577839,T,IEX,134.045000,69
2019-10-23 15:59:39.656516096,2019-10-23 15:59:39.656494790,6583729,T,IEX,134.050000,50
2019-10-23 15:59:50.546205952,2019-10-23 15:59:50.546184528,6590614,T,IEX,134.025000,100
2019-10-23 16:00:04.510245120,2019-10-23 16:00:04.510222407,6599315,T,IEX,134.070000,100
2019-10-23 16:00:48.582828032,2019-10-23 16:00:48.582806824,6619615,T,IEX,134.050000,69
2019-10-23 16:01:06.995621120,2019-10-23 16:01:06.995594933,6627614,T,IEX,134.070000,200
2019-10-23 16:04:42.496493056,2019-10-23 16:04:42.496473325,6725819,T,IEX,133.970000,100
2019-10-23 16:05:29.645718016,2019-10-23 16:05:29.645697080,6746392,T,IEX,133.955000,100
2019-10-23 16:05:54.664926976,2019-10-23 16:05:54.664906028,6754506,T,IEX,133.970000,100
2019-10-23 16:05:54.665986048,2019-10-23 16:05:54.665967577,6754508,T,IEX,133.970000,100
2019-10-23 16:09:30.20860928,2019-10-23 16:09:30.20839563,6851006,T,IEX,133.930000,500
2019-10-23 16:09:30.20877056,2019-10-23 16:09:30.20860021,6851007,T,IEX,133.930000,100
2019-10-23 16:11:15.63252992,2019-10-23 16:11:15.63227960,6892534,T,IEX,133.980000,100
2019-10-23 16:13:47.689464064,2019-10-23 16:13:47.689444237,6950903,T,IEX,133.970000,100
2019-10-23 16:13:47.899683072,2019-10-23 16:13:47.899667350,6951262,T,IEX,133.980000,100
2019-10-23 16:13:53.676224000,2019-10-23 16:13:53.676203294,6953868,T,IEX,133.990000,100
2019-10-23 16:14:45.131217920,2019-10-23 16:14:45.131198326,6974932,T,IEX,133.970000,100
2019-10-23 16:14:56.462604032,2019-10-23 16:14:56.462583087,6979083,T,IEX,133.975000,100
2019-10-23 16:15:27.466881024,2019-10-23 16:15:27.466860007,6991727,T,IEX,134.020000,100
2019-10-23 16:16:19.463299072,2019-10-23 16:16:19.463277088,7013473,T,IEX,134.030000,100
2019-10-23 16:19:21.512974080,2019-10-23 16:19:21.512953461,7086251,T,IEX,134.005000,118
2019-10-23 16:23:26.620536064,2019-10-23 16:23:26.620518605,7181306,T,IEX,133.980000,1
2019-10-23 16:23:59.127074048,2019-10-23 16:23:59.127052204,7193601,T,IEX,133.990000,1
2019-10-23 16:24:01.252524032,2019-10-23 16:24:01.252501675,7194559,T,IEX,133.990000,1
2019-10-23 16:24:07.130016000,2019-10-23 16:24:07.129995283,7196819,T,IEX,133.990000,1
2019-10-23 16:25:26.373048064,2019-10-23 16:25:26.373027178,7223617,T,IEX,133.975000,1
2019-10-23 16:25:57.24355072,2019-10-23 16:25:57.24332653,7236914,T,IEX,134.000000,5
2019-10-23 16:25:57.32164096,2019-10-23 16:25:57.32141706,7236917,T,IEX,134.000000,1
2019-10-23 16:26:25.950728960,2019-10-23 16:26:25.950707550,7249840,T,IEX,134.000000,1
2019-10-23 16:26:39.230836992,2019-10-23 16:26:39.230816635,7254315,T,IEX,134.005000,1
2019-10-23 16:26:54.48235008,2019-10-23 16:26:54.48214972,7259712,T,IEX,134.015000,1
2019-10-23 16:26:59.596761088,2019-10-23 16:26:59.596739555,7262240,T,IEX,134.025000,1
2019-10-23 16:26:59.605096960,2019-10-23 16:26:59.605079925,7262268,T,IEX,134.025000,1
2019-10-23 16:26:59.732058112,2019-10-23 16:26:59.732038247,7262384,T,IEX,134.025000,1
2019-10-23 16:27:40.34511872,2019-10-23 16:27:40.34492111,7281120,T,IEX,133.945000,200
2019-10-23 16:27:40.58341120,2019-10-23 16:27:40.58319530,7281128,T,IEX,133.945000,100
2019-10-23 16:27:41.459910912,2019-10-23 16:27:41.459891720,7282463,T,IEX,133.955000,1
2019-10-23 16:28:13.815003904,2019-10-23 16:28:13.814983563,7298261,T,IEX,133.950000,5
2019-10-23 16:28:23.426404096,2019-10-23 16:28:23.426382857,7302757,T,IEX,133.950000,2
2019-10-23 16:28:27.482619904,2019-10-23 16:28:27.482600012,7304220,T,IEX,133.950000,1
2019-10-23 16:29:41.507264000,2019-10-23 16:29:41.507247865,7333932,T,IEX,133.965000,1
2019-10-23 16:29:46.400109056,2019-10-23 16:29:46.400088820,7335786,T,IEX,133.965000,100
2019-10-23 16:30:03.292662016,2019-10-23 16:30:03.292641218,7344830,T,IEX,133.950000,2
2019-10-23 16:30:04.437988096,2019-10-23 16:30:04.437965095,7345449,T,IEX,133.950000,2
2019-10-23 16:30:35.326866944,2019-10-23 16:30:35.326843304,7360319,T,IEX,133.985000,1
2019-10-23 16:30:35.347849984,2019-10-23 16:30:35.347830115,7360717,T,IEX,133.985000,1
2019-10-23 16:30:42.556112896,2019-10-23 16:30:42.556093459,7365132,T,IEX,133.985000,1
2019-10-23 16:30:55.83880960,2019-10-23 16:30:55.83859628,7372140,T,IEX,133.975000,1
2019-10-23 16:30:55.94594048,2019-10-23 16:30:55.94574456,7372146,T,IEX,133.975000,4
2019-10-23 16:31:09.110536960,2019-10-23 16:31:09.110516555,7377883,T,IEX,133.985000,1
2019-10-23 16:31:26.551578880,2019-10-23 16:31:26.551557295,7387388,T,IEX,133.995000,1
2019-10-23 16:31:32.602347008,2019-10-23 16:31:32.602330262,7391721,T,IEX,133.975000,1
2019-10-23 16:31:50.826845952,2019-10-23 16:31:50.826824984,7399112,T,IEX,133.990000,1
2019-10-23 16:32:33.527067904,2019-10-23 16:32:33.527045979,7415484,T,IEX,133.950000,1
2019-10-23 16:32:37.56675072,2019-10-23 16:32:37.56653645,7416757,T,IEX,133.950000,1
2019-10-23 16:32:37.56860928,2019-10-23 16:32:37.56842527,7416758,T,IEX,133.950000,24
2019-10-23 16:32:41.637264896,2019-10-23 16:32:41.637244145,7418962,T,IEX,133.950000,1
2019-10-23 16:33:03.556966912,2019-10-23 16:33:03.556946240,7428359,T,IEX,133.950000,1
2019-10-23 16:33:21.794848000,2019-10-23 16:33:21.794828815,7436373,T,IEX,133.950000,2
2019-10-23 16:33:28.77683968,2019-10-23 16:33:28.77667165,7439043,T,IEX,133.965000,1
2019-10-23 16:33:28.97349888,2019-10-23 16:33:28.97331709,7439157,T,IEX,133.965000,1
2019-10-23 16:33:28.614868992,2019-10-23 16:33:28.614847661,7439548,T,IEX,133.970000,1
2019-10-23 16:33:56.106542080,2019-10-23 16:33:56.106521298,7450378,T,IEX,133.985000,1
2019-10-23 16:34:27.856997120,2019-10-23 16:34:27.856977760,7462057,T,IEX,133.980000,1
2019-10-23 16:34:27.865594112,2019-10-23 16:34:27.865573923,7462062,T,IEX,133.980000,1
2019-10-23 16:34:42.708326912,2019-10-23 16:34:42.708306929,7468544,T,IEX,134.015000,1
2019-10-23 16:34:53.669170944,2019-10-23 16:34:53.669146273,7472904,T,IEX,134.020000,2
2019-10-23 16:34:55.257014016,2019-10-23 16:34:55.256992328,7473425,T,IEX,134.020000,1
2019-10-23 16:35:03.803552000,2019-10-23 16:35:03.803531561,7477858,T,IEX,134.020000,100
2019-10-23 16:35:11.925652992,2019-10-23 16:35:11.925631713,7480897,T,IEX,134.020000,1
2019-10-23 16:35:12.129554944,2019-10-23 16:35:12.129537159,7480985,T,IEX,134.010000,1
2019-10-23 16:35:12.557019904,2019-10-23 16:35:12.557000633,7481150,T,IEX,134.005000,3
2019-10-23 16:35:12.565440000,2019-10-23 16:35:12.565419752,7481152,T,IEX,134.005000,6
2019-10-23 16:35:22.565228032,2019-10-23 16:35:22.565208216,7485053,T,IEX,134.000000,100
2019-10-23 16:35:22.569101056,2019-10-23 16:35:22.569082305,7485054,T,IEX,133.990000,1
2019-10-23 16:35:22.569634048,2019-10-23 16:35:22.569618646,7485055,T,IEX,133.980000,99
2019-10-23 16:35:22.569649920,2019-10-23 16:35:22.569630089,7485056,T,IEX,133.980000,100
2019-10-23 16:35:22.569659904,2019-10-23 16:35:22.569642465,7485057,T,IEX,133.980000,57
2019-10-23 16:36:03.251152896,2019-10-23 16:36:03.251132632,7501536,T,IEX,133.990000,1
2019-10-23 16:36:03.266211072,2019-10-23 16:36:03.266191677,7501544,T,IEX,133.990000,4
2019-10-23 16:36:05.429946112,2019-10-23 16:36:05.429924331,7502223,T,IEX,134.010000,1
2019-10-23 16:36:15.528306944,2019-10-23 16:36:15.528286390,7505799,T,IEX,134.010000,7
2019-10-23 16:36:53.65135104,2019-10-23 16:36:53.65117518,7519648,T,IEX,134.030000,100
2019-10-23 16:37:01.64678912,2019-10-23 16:37:01.64659647,7523259,T,IEX,134.025000,1
2019-10-23 16:37:01.72523008,2019-10-23 16:37:01.72505813,7523267,T,IEX,134.025000,5
2019-10-23 16:37:03.710033920,2019-10-23 16:37:03.710014692,7524582,T,IEX,134.015000,1
2019-10-23 16:37:03.718767104,2019-10-23 16:37:03.718748459,7524587,T,IEX,134.020000,1
2019-10-23 16:37:21.844280064,2019-10-23 16:37:21.844258328,7533005,T,IEX,134.030000,1
2019-10-23 16:38:19.217888000,2019-10-23 16:38:19.217867390,7552734,T,IEX,134.030000,1
2019-10-23 16:38:30.207055872,2019-10-23 16:38:30.207034524,7556718,T,IEX,134.025000,2
2019-10-23 16:38:41.617221120,2019-10-23 16:38:41.617202210,7560191,T,IEX,134.035000,1
2019-10-23 16:39:01.521528064,2019-10-23 16:39:01.521507394,7571412,T,IEX,134.080000,18
2019-10-23 16:39:01.521551104,2019-10-23 16:39:01.521534112,7571413,T,IEX,134.080000,1
2019-10-23 16:39:03.612046080,2019-10-23 16:39:03.612025060,7572901,T,IEX,134.080000,4
2019-10-23 16:39:11.195992064,2019-10-23 16:39:11.195971175,7576706,T,IEX,134.080000,10
2019-10-23 16:39:42.521957120,2019-10-23 16:39:42.521936623,7590009,T,IEX,134.110000,1
2019-10-23 16:40:05.76617984,2019-10-23 16:40:05.76598668,7599034,T,IEX,134.110000,1
2019-10-23 16:40:27.854930944,2019-10-23 16:40:27.854910337,7615957,T,IEX,134.135000,1
2019-10-23 16:40:42.593126912,2019-10-23 16:40:42.593106653,7622783,T,IEX,134.130000,1
2019-10-23 16:41:15.883066880,2019-10-23 16:41:15.883046591,7637298,T,IEX,134.140000,1
2019-10-23 16:41:27.900358912,2019-10-23 16:41:27.900342689,7640536,T,IEX,134.155000,1
2019-10-23 16:42:00.862424064,2019-10-23 16:42:00.862403049,7652619,T,IEX,134.150000,1
2019-10-23 16:42:41.707599104,2019-10-23 16:42:41.707578618,7665102,T,IEX,134.135000,1
2019-10-23 16:43:22.269623040,2019-10-23 16:43:22.269601938,7682761,T,IEX,134.115000,100
2019-10-23 16:43:22.272563968,2019-10-23 16:43:22.272545481,7682762,T,IEX,134.100000,1
2019-10-23 16:43:22.280816896,2019-10-23 16:43:22.280796623,7682768,T,IEX,134.095000,1
2019-10-23 16:43:57.36764928,2019-10-23 16:43:57.36746301,7695206,T,IEX,134.095000,1
2019-10-23 16:44:00.362604032,2019-10-23 16:44:00.362582534,7696788,T,IEX,134.095000,100
2019-10-23 16:44:42.763713024,2019-10-23 16:44:42.763692435,7712676,T,IEX,134.105000,1
2019-10-23 16:44:42.782813952,2019-10-23 16:44:42.782793010,7712686,T,IEX,134.110000,1
2019-10-23 16:45:15.57464064,2019-10-23 16:45:15.57442378,7727539,T,IEX,134.125000,1
2019-10-23 16:45:42.857437952,2019-10-23 16:45:42.857419609,7737325,T,IEX,134.135000,1
2019-10-23 16:45:44.355578112,2019-10-23 16:45:44.355557805,7737919,T,IEX,134.135000,48
2019-10-23 16:47:46.689070080,2019-10-23 16:47:46.689048742,7779601,T,IEX,134.135000,27
2019-10-23 16:49:22.466679040,2019-10-23 16:49:22.466657085,7812496,T,IEX,134.140000,25
2019-10-23 16:50:21.398149888,2019-10-23 16:50:21.398127863,7830222,T,IEX,134.120000,100
2019-10-23 16:50:21.398166016,2019-10-23 16:50:21.398148695,7830223,T,IEX,134.120000,100
2019-10-23 16:50:21.427595008,2019-10-23 16:50:21.427577771,7830237,T,IEX,134.080000,100
2019-10-23 16:50:21.469731072,2019-10-23 16:50:21.469711739,7830327,T,IEX,134.020000,100
2019-10-23 16:50:21.471943936,2019-10-23 16:50:21.471924394,7830328,T,IEX,134.020000,100
2019-10-23 16:51:30.36612096,2019-10-23 16:51:30.36591951,7851673,T,IEX,133.985000,2
2019-10-23 16:58:27.510269952,2019-10-23 16:58:27.510249325,8000948,T,IEX,134.090000,100
2019-10-23 17:01:44.473839104,2019-10-23 17:01:44.473816776,8072526,T,IEX,134.100000,100
2019-10-23 17:02:06.500601088,2019-10-23 17:02:06.500581254,8083455,T,IEX,134.110000,4
2019-10-23 17:03:14.564232960,2019-10-23 17:03:14.564210507,8107458,T,IEX,134.110000,100
2019-10-23 17:07:31.345754112,2019-10-23 17:07:31.345732928,8197909,T,IEX,134.220000,1
2019-10-23 17:07:36.181772032,2019-10-23 17:07:36.181750351,8200537,T,IEX,134.220000,99
2019-10-23 17:08:08.51819008,2019-10-23 17:08:08.51799805,8213989,T,IEX,134.220000,100
2019-10-23 17:09:12.180348928,2019-10-23 17:09:12.180326706,8238384,T,IEX,134.290000,200
2019-10-23 17:09:56.918019072,2019-10-23 17:09:56.917994356,8254058,T,IEX,134.235000,100
2019-10-23 17:12:43.819099904,2019-10-23 17:12:43.819080404,8316674,T,IEX,134.165000,303
2019-10-23 17:13:45.781838080,2019-10-23 17:13:45.781821351,8344246,T,IEX,134.150000,100
2019-10-23 17:13:46.561797120,2019-10-23 17:13:46.561776821,8344616,T,IEX,134.150000,100
2019-10-23 17:15:29.322836992,2019-10-23 17:15:29.322818295,8396041,T,IEX,134.090000,100
2019-10-23 17:15:30.287535104,2019-10-23 17:15:30.287515010,8396677,T,IEX,134.110000,2
2019-10-23 17:19:01.983866112,2019-10-23 17:19:01.983846043,8462928,T,IEX,134.120000,16
2019-10-23 17:24:12.524954112,2019-10-23 17:24:12.524936209,8567550,T,IEX,134.100000,100
2019-10-23 17:25:21.374885888,2019-10-23 17:25:21.374865971,8586835,T,IEX,134.100000,100
2019-10-23 17:27:20.943494912,2019-10-23 17:27:20.943474055,8627400,T,IEX,134.040000,100
2019-10-23 17:27:41.815218944,2019-10-23 17:27:41.815195737,8633470,T,IEX,133.990000,74
2019-10-23 17:34:18.544862976,2019-10-23 17:34:18.544843897,8763488,T,IEX,134.040000,100
2019-10-23 17:37:42.66171904,2019-10-23 17:37:42.66150402,8830623,T,IEX,134.065000,103
2019-10-23 17:52:14.181174016,2019-10-23 17:52:14.181157431,9112668,T,IEX,134.240000,2
2019-10-23 17:54:39.861327104,2019-10-23 17:54:39.861305084,9155036,T,IEX,134.200000,100
2019-10-23 17:55:13.594359040,2019-10-23 17:55:13.594338759,9165462,T,IEX,134.210000,100
2019-10-23 17:56:31.159930880,2019-10-23 17:56:31.159910049,9188050,T,IEX,134.165000,100
2019-10-23 17:57:46.133370112,2019-10-23 17:57:46.133348426,9210062,T,IEX,134.190000,100
2019-10-23 18:00:04.634489088,2019-10-23 18:00:04.634466851,9259936,T,IEX,134.210000,100
2019-10-23 18:01:28.590968064,2019-10-23 18:01:28.590947017,9296122,T,IEX,134.130000,100
2019-10-23 18:02:44.784471040,2019-10-23 18:02:44.784449661,9331928,T,IEX,134.050000,53
2019-10-23 18:06:44.920107008,2019-10-23 18:06:44.920085370,9420477,T,IEX,133.980000,100
2019-10-23 18:06:44.920119040,2019-10-23 18:06:44.920102490,9420478,T,IEX,133.980000,100
2019-10-23 18:08:54.573756928,2019-10-23 18:08:54.573736628,9468604,T,IEX,134.040000,100
2019-10-23 18:10:34.314161920,2019-10-23 18:10:34.314139893,9507981,T,IEX,134.060000,2
2019-10-23 18:19:40.111634944,2019-10-23 18:19:40.111616057,9730817,T,IEX,133.940000,23
2019-10-23 18:19:40.157046016,2019-10-23 18:19:40.157029687,9731436,T,IEX,133.970000,100
2019-10-23 18:19:40.194083072,2019-10-23 18:19:40.194065230,9731541,T,IEX,133.980000,100
2019-10-23 18:19:40.203949056,2019-10-23 18:19:40.203928436,9731559,T,IEX,134.010000,100
2019-10-23 18:19:40.204931072,2019-10-23 18:19:40.204914103,9731562,T,IEX,134.010000,4
2019-10-23 18:21:43.972328960,2019-10-23 18:21:43.972308797,9789748,T,IEX,133.990000,100
2019-10-23 18:23:02.477860096,2019-10-23 18:23:02.477837756,9820782,T,IEX,134.060000,100
2019-10-23 18:24:41.58356992,2019-10-23 18:24:41.58336511,9858493,T,IEX,134.155000,300
2019-10-23 18:26:04.773530880,2019-10-23 18:26:04.773510001,9889187,T,IEX,134.100000,9
2019-10-23 18:28:40.796581888,2019-10-23 18:28:40.796561953,9961048,T,IEX,134.080000,100
2019-10-23 18:28:50.137111040,2019-10-23 18:28:50.137093842,9965186,T,IEX,134.050000,12
2019-10-23 18:29:03.758632960,2019-10-23 18:29:03.758611459,9971742,T,IEX,134.055000,4
2019-10-23 18:29:04.10592000,2019-10-23 18:29:04.10571113,9971870,T,IEX,134.055000,1
2019-10-23 18:29:04.663035904,2019-10-23 18:29:04.663019120,9972084,T,IEX,134.055000,1
2019-10-23 18:29:09.65027072,2019-10-23 18:29:09.65008897,9974434,T,IEX,134.040000,100
2019-10-23 18:29:35.93982976,2019-10-23 18:29:35.93960969,9986508,T,IEX,134.045000,100
2019-10-23 18:29:35.95930880,2019-10-23 18:29:35.95911596,9986509,T,IEX,134.045000,200
2019-10-23 18:29:35.98027008,2019-10-23 18:29:35.98010965,9986522,T,IEX,134.045000,154
2019-10-23 18:32:48.400497920,2019-10-23 18:32:48.400478190,10069261,T,IEX,134.080000,200
2019-10-23 18:32:48.400515072,2019-10-23 18:32:48.400497923,10069262,T,IEX,134.080000,100
2019-10-23 18:32:48.400535040,2019-10-23 18:32:48.400515658,10069263,T,IEX,134.080000,100
2019-10-23 18:32:50.314277888,2019-10-23 18:32:50.314258241,10069958,T,IEX,134.095000,53
2019-10-23 18:36:24.239856896,2019-10-23 18:36:24.239836672,10153882,T,IEX,134.135000,100
2019-10-23 18:37:38.246615040,2019-10-23 18:37:38.246595014,10194941,T,IEX,134.110000,100
2019-10-23 18:39:03.53569024,2019-10-23 18:39:03.53551589,10247246,T,IEX,134.100000,1
2019-10-23 18:43:00.315632128,2019-10-23 18:43:00.315615229,10352541,T,IEX,134.190000,15
2019-10-23 18:46:09.203400960,2019-10-23 18:46:09.203383783,10429032,T,IEX,134.210000,795
2019-10-23 18:47:06.452988928,2019-10-23 18:47:06.452967274,10453865,T,IEX,134.230000,500
2019-10-23 18:49:06.171995904,2019-10-23 18:49:06.171976343,10495473,T,IEX,134.205000,1
2019-10-23 18:49:10.781271040,2019-10-23 18:49:10.781254322,10497633,T,IEX,134.225000,1
2019-10-23 18:49:33.132826112,2019-10-23 18:49:33.132806040,10508059,T,IEX,134.250000,3
2019-10-23 18:49:46.935525120,2019-10-23 18:49:46.935505658,10513716,T,IEX,134.240000,3
2019-10-23 18:49:47.70050048,2019-10-23 18:49:47.70029645,10513815,T,IEX,134.235000,1
2019-10-23 18:49:55.511852032,2019-10-23 18:49:55.511832645,10517236,T,IEX,134.225000,1
2019-10-23 18:49:55.587127040,2019-10-23 18:49:55.587110010,10517295,T,IEX,134.225000,1
2019-10-23 18:50:22.886214912,2019-10-23 18:50:22.886193594,10528326,T,IEX,134.215000,1
2019-10-23 18:50:31.753466112,2019-10-23 18:50:31.753445689,10531759,T,IEX,134.210000,2
2019-10-23 18:50:35.161601024,2019-10-23 18:50:35.161580164,10533035,T,IEX,134.205000,96
2019-10-23 18:50:46.970637056,2019-10-23 18:50:46.970616167,10537223,T,IEX,134.190000,1
2019-10-23 18:50:51.271209984,2019-10-23 18:50:51.271189666,10538899,T,IEX,134.190000,2
2019-10-23 18:51:35.58445056,2019-10-23 18:51:35.58424341,10556202,T,IEX,134.180000,1
2019-10-23 18:51:35.58459904,2019-10-23 18:51:35.58443806,10556203,T,IEX,134.180000,399
2019-10-23 18:51:47.70371072,2019-10-23 18:51:47.70351722,10560336,T,IEX,134.185000,7
2019-10-23 18:52:06.659575040,2019-10-23 18:52:06.659554535,10568293,T,IEX,134.200000,1
2019-10-23 18:52:43.274836992,2019-10-23 18:52:43.274816515,10585787,T,IEX,134.180000,5
2019-10-23 18:54:05.32955904,2019-10-23 18:54:05.32934944,10620056,T,IEX,134.230000,2
2019-10-23 18:54:05.40072960,2019-10-23 18:54:05.40052698,10620058,T,IEX,134.230000,5
2019-10-23 18:54:06.11074048,2019-10-23 18:54:06.11053805,10620360,T,IEX,134.235000,95
2019-10-23 18:54:15.846649088,2019-10-23 18:54:15.846628420,10624034,T,IEX,134.255000,100
2019-10-23 18:54:16.293700096,2019-10-23 18:54:16.293680364,10624565,T,IEX,134.260000,1
2019-10-23 18:54:16.440911104,2019-10-23 18:54:16.440889199,10624643,T,IEX,134.270000,2
2019-10-23 18:54:18.279753984,2019-10-23 18:54:18.279732691,10626221,T,IEX,134.270000,1
2019-10-23 18:54:18.583188992,2019-10-23 18:54:18.583170501,10626353,T,IEX,134.260000,1
2019-10-23 18:54:34.375865088,2019-10-23 18:54:34.375847128,10631991,T,IEX,134.260000,1
2019-10-23 18:55:27.790618880,2019-10-23 18:55:27.790597265,10648493,T,IEX,134.260000,1
2019-10-23 18:57:39.349388032,2019-10-23 18:57:39.349368159,10698571,T,IEX,134.240000,3
2019-10-23 18:57:39.357271040,2019-10-23 18:57:39.357249591,10698580,T,IEX,134.240000,15
2019-10-23 18:57:45.544999936,2019-10-23 18:57:45.544982275,10700608,T,IEX,134.255000,1
2019-10-23 18:57:54.486402048,2019-10-23 18:57:54.486379000,10704004,T,IEX,134.260000,1
2019-10-23 18:57:57.636292096,2019-10-23 18:57:57.636272937,10705693,T,IEX,134.245000,1
2019-10-23 18:58:10.745742080,2019-10-23 18:58:10.745720902,10712076,T,IEX,134.245000,1
2019-10-23 18:58:10.749634048,2019-10-23 18:58:10.749613066,10712078,T,IEX,134.250000,78
2019-10-23 18:58:46.406055936,2019-10-23 18:58:46.406036887,10724911,T,IEX,134.280000,1
2019-10-23 18:59:28.706566912,2019-10-23 18:59:28.706550151,10741002,T,IEX,134.270000,1
2019-10-23 18:59:28.726216960,2019-10-23 18:59:28.726196606,10741014,T,IEX,134.270000,5
2019-10-23 18:59:47.441756928,2019-10-23 18:59:47.441736859,10749877,T,IEX,134.280000,1
2019-10-23 18:59:58.968355072,2019-10-23 18:59:58.968336037,10754675,T,IEX,134.290000,165
2019-10-23 19:00:23.394354944,2019-10-23 19:00:23.394338458,10765261,T,IEX,134.255000,1
2019-10-23 19:00:44.794000896,2019-10-23 19:00:44.793979954,10773081,T,IEX,134.290000,3
2019-10-23 19:00:45.300005888,2019-10-23 19:00:45.299986877,10773376,T,IEX,134.295000,1
2019-10-23 19:00:47.476662016,2019-10-23 19:00:47.476644041,10774175,T,IEX,134.295000,2
2019-10-23 19:01:02.626256896,2019-10-23 19:01:02.626236053,10779337,T,IEX,134.315000,2
2019-10-23 19:01:43.785145088,2019-10-23 19:01:43.785122814,10792251,T,IEX,134.290000,100
2019-10-23 19:01:46.527803904,2019-10-23 19:01:46.527781921,10792797,T,IEX,134.295000,1
2019-10-23 19:01:49.875634944,2019-10-23 19:01:49.875618348,10794291,T,IEX,134.310000,5
2019-10-23 19:01:49.883783936,2019-10-23 19:01:49.883761809,10794294,T,IEX,134.310000,1
2019-10-23 19:01:52.97295104,2019-10-23 19:01:52.97276078,10794982,T,IEX,134.320000,1
2019-10-23 19:01:52.103994880,2019-10-23 19:01:52.103978461,10794986,T,IEX,134.320000,1
2019-10-23 19:02:05.671678976,2019-10-23 19:02:05.671657727,10799994,T,IEX,134.335000,1
2019-10-23 19:02:33.904558080,2019-10-23 19:02:33.904536194,10811524,T,IEX,134.355000,1
2019-10-23 19:02:36.256636928,2019-10-23 19:02:36.256617220,10812848,T,IEX,134.350000,90
2019-10-23 19:02:38.248862976,2019-10-23 19:02:38.248845845,10813764,T,IEX,134.355000,200
2019-10-23 19:02:38.248897024,2019-10-23 19:02:38.248876403,10813766,T,IEX,134.355000,1
2019-10-23 19:02:47.547351040,2019-10-23 19:02:47.547324164,10816942,T,IEX,134.350000,1
2019-10-23 19:03:46.611062016,2019-10-23 19:03:46.611044511,10839984,T,IEX,134.360000,1
2019-10-23 19:03:56.501517056,2019-10-23 19:03:56.501495827,10842458,T,IEX,134.360000,300
2019-10-23 19:05:04.214333952,2019-10-23 19:05:04.214317843,10872922,T,IEX,134.380000,4
2019-10-23 19:05:46.699968000,2019-10-23 19:05:46.699946748,10886614,T,IEX,134.315000,8
2019-10-23 19:06:39.938025984,2019-10-23 19:06:39.938007087,10901880,T,IEX,134.350000,3
2019-10-23 19:06:46.706588928,2019-10-23 19:06:46.706567204,10904932,T,IEX,134.350000,2
2019-10-23 19:06:59.975980032,2019-10-23 19:06:59.975960379,10908531,T,IEX,134.360000,6
2019-10-23 19:06:59.984482048,2019-10-23 19:06:59.984462930,10908532,T,IEX,134.360000,1
2019-10-23 19:07:00.464918016,2019-10-23 19:07:00.464899088,10908715,T,IEX,134.360000,24
2019-10-23 19:07:09.528542976,2019-10-23 19:07:09.528523863,10911270,T,IEX,134.355000,100
2019-10-23 19:08:31.518330112,2019-10-23 19:08:31.518308539,10936695,T,IEX,134.360000,1
2019-10-23 19:08:47.20344064,2019-10-23 19:08:47.20326471,10944397,T,IEX,134.390000,4
2019-10-23 19:09:06.959505920,2019-10-23 19:09:06.959484660,10955260,T,IEX,134.390000,100
2019-10-23 19:09:07.252664064,2019-10-23 19:09:07.252645059,10955500,T,IEX,134.385000,1
2019-10-23 19:09:07.260445952,2019-10-23 19:09:07.260424476,10955502,T,IEX,134.385000,3
2019-10-23 19:09:39.708828928,2019-10-23 19:09:39.708808757,10967405,T,IEX,134.390000,1
2019-10-23 19:10:09.38036992,2019-10-23 19:10:09.38019598,10979095,T,IEX,134.425000,1
2019-10-23 19:10:37.525697024,2019-10-23 19:10:37.525680069,10990267,T,IEX,134.420000,3
2019-10-23 19:10:47.153163008,2019-10-23 19:10:47.153142430,10994409,T,IEX,134.430000,2
2019-10-23 19:11:09.526496000,2019-10-23 19:11:09.526476064,11002677,T,IEX,134.430000,1
2019-10-23 19:11:18.583289088,2019-10-23 19:11:18.583269765,11009282,T,IEX,134.385000,1
2019-10-23 19:11:20.705891072,2019-10-23 19:11:20.705873230,11010394,T,IEX,134.385000,2
2019-10-23 19:11:47.186290944,2019-10-23 19:11:47.186274660,11019898,T,IEX,134.395000,1
2019-10-23 19:12:31.713719040,2019-10-23 19:12:31.713697994,11034963,T,IEX,134.415000,1
2019-10-23 19:12:31.745694976,2019-10-23 19:12:31.745674613,11034969,T,IEX,134.415000,2
2019-10-23 19:12:31.985477120,2019-10-23 19:12:31.985455913,11035032,T,IEX,134.410000,1
2019-10-23 19:12:31.990489088,2019-10-23 19:12:31.990467797,11035033,T,IEX,134.410000,96
2019-10-23 19:12:47.223578880,2019-10-23 19:12:47.223562354,11042444,T,IEX,134.405000,1
2019-10-23 19:13:19.157216000,2019-10-23 19:13:19.157194136,11054805,T,IEX,134.440000,1
2019-10-23 19:13:32.753787904,2019-10-23 19:13:32.753768963,11058455,T,IEX,134.450000,2
2019-10-23 19:13:47.253814016,2019-10-23 19:13:47.253793647,11062929,T,IEX,134.455000,4
2019-10-23 19:14:47.278891008,2019-10-23 19:14:47.278870464,11091136,T,IEX,134.415000,3
2019-10-23 19:15:17.168163072,2019-10-23 19:15:17.168140302,11104366,T,IEX,134.395000,400
2019-10-23 19:15:41.761139968,2019-10-23 19:15:41.761119309,11113401,T,IEX,134.390000,6
2019-10-23 19:15:47.352221952,2019-10-23 19:15:47.352205847,11115294,T,IEX,134.390000,8
2019-10-23 19:15:53.539627008,2019-10-23 19:15:53.539607532,11117325,T,IEX,134.390000,1
2019-10-23 19:16:35.868934912,2019-10-23 19:16:35.868914415,11133692,T,IEX,134.380000,1
2019-10-23 19:16:47.423166976,2019-10-23 19:16:47.423146503,11138275,T,IEX,134.375000,5
2019-10-23 19:17:32.968250112,2019-10-23 19:17:32.968228189,11151584,T,IEX,134.315000,100
2019-10-23 19:19:18.976038912,2019-10-23 19:19:18.976018156,11184124,T,IEX,134.290000,1
2019-10-23 19:19:18.984381952,2019-10-23 19:19:18.984362211,11184127,T,IEX,134.290000,13
2019-10-23 19:19:23.922806016,2019-10-23 19:19:23.922782840,11185747,T,IEX,134.285000,2
2019-10-23 19:19:32.565532928,2019-10-23 19:19:32.565516444,11188106,T,IEX,134.285000,84
2019-10-23 19:19:55.183973888,2019-10-23 19:19:55.183952401,11195216,T,IEX,134.305000,100
2019-10-23 19:19:57.665701120,2019-10-23 19:19:57.665681454,11196027,T,IEX,134.305000,100
2019-10-23 19:20:07.549891072,2019-10-23 19:20:07.549871362,11199396,T,IEX,134.305000,100
2019-10-23 19:20:25.683889920,2019-10-23 19:20:25.683871866,11208017,T,IEX,134.340000,100
2019-10-23 19:20:25.693666048,2019-10-23 19:20:25.693648430,11208023,T,IEX,134.330000,6
2019-10-23 19:20:26.293641984,2019-10-23 19:20:26.293624905,11208361,T,IEX,134.340000,200
2019-10-23 19:20:56.801089024,2019-10-23 19:20:56.801066151,11222425,T,IEX,134.350000,100
2019-10-23 19:21:05.276978944,2019-10-23 19:21:05.276957628,11225756,T,IEX,134.340000,100
2019-10-23 19:21:11.560465920,2019-10-23 19:21:11.560447358,11228999,T,IEX,134.350000,100
2019-10-23 19:21:21.142016000,2019-10-23 19:21:21.141995140,11233822,T,IEX,134.350000,100
2019-10-23 19:21:32.440835072,2019-10-23 19:21:32.440815304,11238513,T,IEX,134.355000,2
2019-10-23 19:21:36.544713984,2019-10-23 19:21:36.544696165,11240528,T,IEX,134.360000,3
2019-10-23 19:21:41.97572096,2019-10-23 19:21:41.97550855,11242755,T,IEX,134.360000,95
2019-10-23 19:21:59.706077952,2019-10-23 19:21:59.706055120,11249492,T,IEX,134.345000,96
2019-10-23 19:22:06.569231104,2019-10-23 19:22:06.569209300,11252093,T,IEX,134.345000,4
2019-10-23 19:22:08.341071104,2019-10-23 19:22:08.341049072,11252546,T,IEX,134.345000,100
2019-10-23 19:23:02.558693120,2019-10-23 19:23:02.558673046,11270375,T,IEX,134.375000,200
2019-10-23 19:23:10.949064960,2019-10-23 19:23:10.949045195,11273947,T,IEX,134.370000,2
2019-10-23 19:23:40.563354112,2019-10-23 19:23:40.563335817,11283591,T,IEX,134.350000,2
2019-10-23 19:24:15.358832128,2019-10-23 19:24:15.358805552,11294990,T,IEX,134.350000,100
2019-10-23 19:25:01.798117888,2019-10-23 19:25:01.798099714,11309783,T,IEX,134.325000,4
2019-10-23 19:25:01.798135040,2019-10-23 19:25:01.798119638,11309784,T,IEX,134.325000,396
2019-10-23 19:25:19.336171008,2019-10-23 19:25:19.336151650,11316434,T,IEX,134.305000,15
2019-10-23 19:25:19.336193024,2019-10-23 19:25:19.336176717,11316435,T,IEX,134.300000,24
2019-10-23 19:25:19.359220992,2019-10-23 19:25:19.359204599,11316484,T,IEX,134.270000,100
2019-10-23 19:25:19.761780992,2019-10-23 19:25:19.761764910,11316818,T,IEX,134.280000,500
2019-10-23 19:25:22.12142080,2019-10-23 19:25:22.12123254,11317999,T,IEX,134.290000,100
2019-10-23 19:25:33.226676992,2019-10-23 19:25:33.226656184,11322167,T,IEX,134.295000,1
2019-10-23 19:25:34.507450880,2019-10-23 19:25:34.507430245,11322557,T,IEX,134.285000,7
2019-10-23 19:25:37.391606016,2019-10-23 19:25:37.391584352,11323723,T,IEX,134.300000,2
2019-10-23 19:26:15.813012992,2019-10-23 19:26:15.812989960,11336916,T,IEX,134.295000,56
2019-10-23 19:26:19.962253056,2019-10-23 19:26:19.962231262,11338544,T,IEX,134.290000,34
2019-10-23 19:27:53.714624000,2019-10-23 19:27:53.714603123,11374448,T,IEX,134.345000,4
2019-10-23 19:27:53.714636032,2019-10-23 19:27:53.714619578,11374449,T,IEX,134.345000,1
2019-10-23 19:27:53.714653952,2019-10-23 19:27:53.714637983,11374450,T,IEX,134.345000,1
2019-10-23 19:28:06.26031104,2019-10-23 19:28:06.26012600,11378974,T,IEX,134.350000,100
2019-10-23 19:28:06.26309120,2019-10-23 19:28:06.26292038,11378976,T,IEX,134.350000,6
2019-10-23 19:29:56.663454976,2019-10-23 19:29:56.663433447,11425041,T,IEX,134.385000,200
2019-10-23 19:31:39.263552000,2019-10-23 19:31:39.263531539,11476848,T,IEX,134.395000,300
2019-10-23 19:31:58.868560896,2019-10-23 19:31:58.868542195,11484412,T,IEX,134.410000,27
2019-10-23 19:32:24.615596032,2019-10-23 19:32:24.615576892,11500806,T,IEX,134.445000,27
2019-10-23 19:32:24.634049024,2019-10-23 19:32:24.634030184,11501379,T,IEX,134.470000,100
2019-10-23 19:33:02.474574080,2019-10-23 19:33:02.474554516,11524007,T,IEX,134.460000,2
2019-10-23 19:33:03.190781952,2019-10-23 19:33:03.190763501,11524484,T,IEX,134.460000,2
2019-10-23 19:34:18.984251904,2019-10-23 19:34:18.984232356,11559005,T,IEX,134.430000,1
2019-10-23 19:35:09.599664896,2019-10-23 19:35:09.599644171,11583568,T,IEX,134.435000,1
2019-10-23 19:35:09.608000000,2019-10-23 19:35:09.607978189,11583574,T,IEX,134.435000,1
2019-10-23 19:35:10.531704064,2019-10-23 19:35:10.531682894,11583892,T,IEX,134.435000,98
2019-10-23 19:35:44.64764928,2019-10-23 19:35:44.64745216,11599839,T,IEX,134.385000,200
2019-10-23 19:36:18.444940032,2019-10-23 19:36:18.444919201,11618827,T,IEX,134.365000,3
2019-10-23 19:36:18.456617984,2019-10-23 19:36:18.456597257,11618834,T,IEX,134.370000,1
2019-10-23 19:36:38.205897984,2019-10-23 19:36:38.205877172,11628001,T,IEX,134.380000,1
2019-10-23 19:36:38.478162944,2019-10-23 19:36:38.478142468,11628096,T,IEX,134.380000,1
2019-10-23 19:36:40.136518912,2019-10-23 19:36:40.136500848,11628702,T,IEX,134.390000,100
2019-10-23 19:37:04.499990016,2019-10-23 19:37:04.499967530,11639996,T,IEX,134.385000,1
2019-10-23 19:37:04.508250880,2019-10-23 19:37:04.508229393,11640002,T,IEX,134.385000,1
2019-10-23 19:37:05.567664896,2019-10-23 19:37:05.567646304,11640489,T,IEX,134.385000,200
2019-10-23 19:37:05.573705984,2019-10-23 19:37:05.573688817,11640499,T,IEX,134.385000,1
2019-10-23 19:37:32.601960960,2019-10-23 19:37:32.601940195,11653307,T,IEX,134.410000,1
2019-10-23 19:37:37.448481024,2019-10-23 19:37:37.448462302,11656243,T,IEX,134.425000,1
2019-10-23 19:37:54.847104,2019-10-23 19:37:54.826745,11663759,T,IEX,134.420000,1
2019-10-23 19:38:02.449372928,2019-10-23 19:38:02.449349570,11667930,T,IEX,134.395000,1
2019-10-23 19:38:08.563661056,2019-10-23 19:38:08.563644909,11670445,T,IEX,134.395000,2
2019-10-23 19:38:14.810639104,2019-10-23 19:38:14.810621150,11677423,T,IEX,134.440000,1
2019-10-23 19:38:26.126371072,2019-10-23 19:38:26.126351971,11685918,T,IEX,134.430000,100
2019-10-23 19:38:49.65054976,2019-10-23 19:38:49.65034100,11700054,T,IEX,134.365000,2
2019-10-23 19:39:00.593753088,2019-10-23 19:39:00.593733161,11706531,T,IEX,134.350000,25
2019-10-23 19:39:08.288169984,2019-10-23 19:39:08.288147343,11711334,T,IEX,134.335000,1
2019-10-23 19:39:28.245221888,2019-10-23 19:39:28.245201761,11720725,T,IEX,134.340000,1
2019-10-23 19:39:39.862650112,2019-10-23 19:39:39.862631847,11724878,T,IEX,134.325000,1
2019-10-23 19:39:44.101213952,2019-10-23 19:39:44.101194927,11726406,T,IEX,134.305000,1
2019-10-23 19:39:52.834717952,2019-10-23 19:39:52.834696425,11733152,T,IEX,134.285000,1
2019-10-23 19:39:52.845033984,2019-10-23 19:39:52.845016090,11733155,T,IEX,134.290000,3
2019-10-23 19:39:52.845049088,2019-10-23 19:39:52.845031717,11733156,T,IEX,134.290000,1
2019-10-23 19:40:02.2938112,2019-10-23 19:40:02.2916910,11738361,T,IEX,134.300000,1
2019-10-23 19:40:02.949323008,2019-10-23 19:40:02.949303084,11739497,T,IEX,134.305000,1
2019-10-23 19:40:09.303815936,2019-10-23 19:40:09.303796504,11742962,T,IEX,134.315000,1
2019-10-23 19:40:34.370352896,2019-10-23 19:40:34.370331842,11753138,T,IEX,134.315000,200
2019-10-23 19:40:34.728105984,2019-10-23 19:40:34.728079287,11753349,T,IEX,134.325000,1
2019-10-23 19:40:35.101204992,2019-10-23 19:40:35.101185824,11754087,T,IEX,134.325000,2
2019-10-23 19:40:35.311112960,2019-10-23 19:40:35.311091472,11754230,T,IEX,134.330000,1
2019-10-23 19:40:49.296091904,2019-10-23 19:40:49.296074666,11762069,T,IEX,134.320000,1
2019-10-23 19:40:49.328587008,2019-10-23 19:40:49.328569176,11762080,T,IEX,134.320000,100
2019-10-23 19:41:18.629241088,2019-10-23 19:41:18.629219228,11776583,T,IEX,134.295000,2
2019-10-23 19:41:18.680966912,2019-10-23 19:41:18.680947266,11776599,T,IEX,134.295000,1
2019-10-23 19:41:26.734780928,2019-10-23 19:41:26.734758955,11779917,T,IEX,134.295000,1
2019-10-23 19:41:31.997655040,2019-10-23 19:41:31.997634782,11782167,T,IEX,134.295000,1
2019-10-23 19:42:05.147963904,2019-10-23 19:42:05.147945375,11798559,T,IEX,134.275000,1
2019-10-23 19:42:05.344841984,2019-10-23 19:42:05.344821851,11798709,T,IEX,134.290000,1
2019-10-23 19:42:47.975664128,2019-10-23 19:42:47.975641596,11819201,T,IEX,134.295000,1
2019-10-23 19:42:54.154148096,2019-10-23 19:42:54.154126509,11823796,T,IEX,134.305000,5
2019-10-23 19:42:54.154166016,2019-10-23 19:42:54.154147344,11823797,T,IEX,134.305000,1
2019-10-23 19:43:44.759917056,2019-10-23 19:43:44.759900091,11846510,T,IEX,134.310000,1
2019-10-23 19:43:48.127812096,2019-10-23 19:43:48.127793143,11847963,T,IEX,134.305000,1
2019-10-23 19:43:54.759963904,2019-10-23 19:43:54.759945412,11851668,T,IEX,134.325000,200
2019-10-23 19:43:54.763642112,2019-10-23 19:43:54.763621499,11851671,T,IEX,134.325000,1
2019-10-23 19:43:54.772420096,2019-10-23 19:43:54.772399068,11851682,T,IEX,134.325000,1
2019-10-23 19:44:05.896154880,2019-10-23 19:44:05.896132954,11856629,T,IEX,134.335000,1
2019-10-23 19:45:18.121640960,2019-10-23 19:45:18.121621003,11900569,T,IEX,134.410000,200
2019-10-23 19:46:00.617320960,2019-10-23 19:46:00.617304960,11926733,T,IEX,134.435000,229
2019-10-23 19:47:02.760283904,2019-10-23 19:47:02.760265188,11966205,T,IEX,134.380000,100
2019-10-23 19:50:00.44323072,2019-10-23 19:50:00.44303490,12078911,T,IEX,134.510000,23
2019-10-23 19:50:00.75124992,2019-10-23 19:50:00.75108093,12079075,T,IEX,134.510000,2
2019-10-23 19:50:00.85486080,2019-10-23 19:50:00.85469505,12079101,T,IEX,134.510000,152
2019-10-23 19:50:03.932289024,2019-10-23 19:50:03.932269424,12090746,T,IEX,134.520000,4
2019-10-23 19:50:08.451444992,2019-10-23 19:50:08.451427279,12097781,T,IEX,134.520000,100
2019-10-23 19:50:08.484698880,2019-10-23 19:50:08.484681814,12097845,T,IEX,134.520000,100
2019-10-23 19:50:27.88660992,2019-10-23 19:50:27.88641752,12117131,T,IEX,134.500000,1
2019-10-23 19:50:38.629742080,2019-10-23 19:50:38.629720659,12123692,T,IEX,134.495000,100
2019-10-23 19:50:45.322076928,2019-10-23 19:50:45.322060800,12127571,T,IEX,134.495000,100
2019-10-23 19:50:48.548720896,2019-10-23 19:50:48.548701393,12130737,T,IEX,134.505000,27
2019-10-23 19:51:05.783580928,2019-10-23 19:51:05.783564303,12142485,T,IEX,134.500000,2
2019-10-23 19:51:44.921169920,2019-10-23 19:51:44.921150547,12169197,T,IEX,134.495000,100
2019-10-23 19:52:24.281633024,2019-10-23 19:52:24.281612055,12198654,T,IEX,134.525000,100
2019-10-23 19:52:27.681455104,2019-10-23 19:52:27.681439121,12201079,T,IEX,134.550000,100
2019-10-23 19:53:41.252267008,2019-10-23 19:53:41.252250102,12254955,T,IEX,134.520000,100
2019-10-23 19:53:42.468333056,2019-10-23 19:53:42.468312015,12255965,T,IEX,134.530000,100
2019-10-23 19:53:42.846640896,2019-10-23 19:53:42.846624602,12256371,T,IEX,134.530000,100
2019-10-23 19:54:17.996829952,2019-10-23 19:54:17.996812430,12297076,T,IEX,134.520000,1
2019-10-23 19:54:38.701424128,2019-10-23 19:54:38.701406429,12315690,T,IEX,134.460000,2
2019-10-23 19:54:41.285052928,2019-10-23 19:54:41.285035363,12318599,T,IEX,134.460000,1
2019-10-23 19:54:41.285073920,2019-10-23 19:54:41.285056167,12318600,T,IEX,134.460000,98
2019-10-23 19:54:49.629022976,2019-10-23 19:54:49.629004439,12325272,T,IEX,134.460000,100
2019-10-23 19:54:49.632160000,2019-10-23 19:54:49.632133799,12325421,T,IEX,134.460000,3
2019-10-23 19:54:54.640909056,2019-10-23 19:54:54.640886496,12330965,T,IEX,134.465000,200
2019-10-23 19:55:00.34075904,2019-10-23 19:55:00.34055241,12336006,T,IEX,134.480000,50
2019-10-23 19:55:00.253730048,2019-10-23 19:55:00.253711424,12339474,T,IEX,134.470000,85
2019-10-23 19:55:02.227006976,2019-10-23 19:55:02.226989651,12346297,T,IEX,134.470000,300
2019-10-23 19:55:02.228811008,2019-10-23 19:55:02.228791956,12346301,T,IEX,134.470000,200
2019-10-23 19:55:02.738476032,2019-10-23 19:55:02.738452637,12347081,T,IEX,134.470000,30
2019-10-23 19:55:02.820796928,2019-10-23 19:55:02.820775906,12347170,T,IEX,134.470000,100
2019-10-23 19:55:03.450212096,2019-10-23 19:55:03.450192414,12348380,T,IEX,134.470000,15
2019-10-23 19:56:34.974695936,2019-10-23 19:56:34.974677016,12437649,T,IEX,134.475000,100
2019-10-23 19:56:48.237364992,2019-10-23 19:56:48.237345615,12448970,T,IEX,134.485000,3
2019-10-23 19:56:48.237381888,2019-10-23 19:56:48.237365535,12448971,T,IEX,134.485000,6
2019-10-23 19:56:48.237396992,2019-10-23 19:56:48.237379288,12448972,T,IEX,134.485000,2
2019-10-23 19:56:49.957146112,2019-10-23 19:56:49.957126106,12450616,T,IEX,134.490000,89
2019-10-23 19:56:58.474060032,2019-10-23 19:56:58.474039686,12458827,T,IEX,134.470000,4
2019-10-23 19:56:58.474102016,2019-10-23 19:56:58.474083721,12458828,T,IEX,134.470000,9
2019-10-23 19:57:09.196350976,2019-10-23 19:57:09.196330048,12470798,T,IEX,134.490000,73
2019-10-23 19:57:22.315344896,2019-10-23 19:57:22.315326782,12483954,T,IEX,134.490000,188
2019-10-23 19:57:49.306590976,2019-10-23 19:57:49.306570897,12515007,T,IEX,134.455000,200
2019-10-23 19:57:50.88017920,2019-10-23 19:57:50.87999466,12515715,T,IEX,134.455000,5
2019-10-23 19:58:19.530795008,2019-10-23 19:58:19.530775578,12546808,T,IEX,134.425000,374
2019-10-23 19:58:32.259473920,2019-10-23 19:58:32.259450934,12561274,T,IEX,134.425000,5
2019-10-23 19:58:34.370951936,2019-10-23 19:58:34.370931472,12563745,T,IEX,134.425000,500
2019-10-23 19:58:34.477799936,2019-10-23 19:58:34.477777309,12563875,T,IEX,134.420000,22
2019-10-23 19:58:34.477812992,2019-10-23 19:58:34.477789705,12563877,T,IEX,134.420000,78
2019-10-23 19:58:40.98305024,2019-10-23 19:58:40.98286168,12569307,T,IEX,134.425000,100
2019-10-23 19:58:40.507238912,2019-10-23 19:58:40.507219170,12569756,T,IEX,134.425000,200
2019-10-23 19:58:45.10405120,2019-10-23 19:58:45.10388349,12574900,T,IEX,134.425000,200
2019-10-23 19:58:50.354950912,2019-10-23 19:58:50.354934379,12580254,T,IEX,134.420000,100
2019-10-23 19:58:52.928124928,2019-10-23 19:58:52.928103722,12583236,T,IEX,134.400000,100
2019-10-23 19:58:54.179027968,2019-10-23 19:58:54.179006799,12584387,T,IEX,134.360000,100
2019-10-23 19:58:54.187912960,2019-10-23 19:58:54.187891606,12584394,T,IEX,134.360000,100
2019-10-23 19:58:54.507827968,2019-10-23 19:58:54.507808925,12585150,T,IEX,134.375000,200
2019-10-23 19:59:06.316484096,2019-10-23 19:59:06.316463186,12603012,T,IEX,134.440000,7
2019-10-23 19:59:10.474478080,2019-10-23 19:59:10.474461614,12611410,T,IEX,134.490000,95
2019-10-23 19:59:12.500083968,2019-10-23 19:59:12.500064595,12614641,T,IEX,134.480000,13
2019-10-23 19:59:18.655431936,2019-10-23 19:59:18.655414288,12625648,T,IEX,134.460000,10
2019-10-23 19:59:24.973569024,2019-10-23 19:59:24.973553393,12633003,T,IEX,134.455000,22
2019-10-23 19:59:24.973588992,2019-10-23 19:59:24.973573009,12633004,T,IEX,134.455000,7
2019-10-23 19:59:24.973603072,2019-10-23 19:59:24.973586992,12633005,T,IEX,134.455000,8
2019-10-23 19:59:28.509889024,2019-10-23 19:59:28.509867762,12637898,T,IEX,134.440000,200
2019-10-23 19:59:39.27283968,2019-10-23 19:59:39.27267839,12684090,T,IEX,134.420000,16
2019-10-23 19:59:40.940122112,2019-10-23 19:59:40.940103454,12699609,T,IEX,134.430000,7
2019-10-23 19:59:51.113622016,2019-10-23 19:59:51.113604490,12754584,T,IEX,134.400000,100
2019-10-23 19:59:53.403778048,2019-10-23 19:59:53.403759106,12761133,T,IEX,134.400000,8
2019-10-23 19:59:55.403027968,2019-10-23 19:59:55.403008933,12773986,T,IEX,134.410000,1
2019-10-23 19:59:57.420678912,2019-10-23 19:59:57.420659453,12783550,T,IEX,134.430000,33
