2019-10-07 13:30:10.284688896,2019-10-07 13:30:10.284666516,96446,T,IEX,84.840000,18
2019-10-07 13:30:36.382533888,2019-10-07 13:30:36.382507679,126963,T,IEX,84.955000,100
2019-10-07 13:30:45.954955008,2019-10-07 13:30:45.954927597,136623,T,IEX,84.990000,100
2019-10-07 13:31:00.47574016,2019-10-07 13:31:00.47551289,151519,T,IEX,85.070000,100
2019-10-07 13:31:00.47636992,2019-10-07 13:31:00.47614220,151521,T,IEX,85.070000,100
2019-10-07 13:31:00.47684096,2019-10-07 13:31:00.47663167,151523,T,IEX,85.070000,100
2019-10-07 13:32:12.281344000,2019-10-07 13:32:12.281316644,221109,T,IEX,84.960000,100
2019-10-07 13:32:29.734691072,2019-10-07 13:32:29.734667621,241176,T,IEX,85.040000,100
2019-10-07 13:33:02.349139968,2019-10-07 13:33:02.349117402,276122,T,IEX,85.050000,100
2019-10-07 13:33:45.215695104,2019-10-07 13:33:45.215674388,320990,T,IEX,85.020000,14
2019-10-07 13:33:45.259374080,2019-10-07 13:33:45.259350833,321022,T,IEX,85.040000,100
2019-10-07 13:33:45.259418112,2019-10-07 13:33:45.259399435,321023,T,IEX,85.040000,100
2019-10-07 13:33:45.263956992,2019-10-07 13:33:45.263936675,321030,T,IEX,85.050000,100
2019-10-07 13:34:17.8968960,2019-10-07 13:34:17.8944291,355512,T,IEX,84.950000,100
2019-10-07 13:35:28.940782080,2019-10-07 13:35:28.940762055,430429,T,IEX,84.960000,72
2019-10-07 13:35:39.830426880,2019-10-07 13:35:39.830405719,441932,T,IEX,84.920000,21
2019-10-07 13:35:40.552974080,2019-10-07 13:35:40.552953225,442503,T,IEX,84.910000,500
2019-10-07 13:35:42.528634112,2019-10-07 13:35:42.528614814,444717,T,IEX,84.865000,100
2019-10-07 13:35:46.705862912,2019-10-07 13:35:46.705842692,449804,T,IEX,84.885000,100
2019-10-07 13:35:46.706952960,2019-10-07 13:35:46.706934059,449805,T,IEX,84.885000,100
2019-10-07 13:35:48.680539904,2019-10-07 13:35:48.680521299,452030,T,IEX,84.865000,100
2019-10-07 13:35:49.593828096,2019-10-07 13:35:49.593810190,453388,T,IEX,84.895000,300
2019-10-07 13:35:50.730949120,2019-10-07 13:35:50.730930540,454358,T,IEX,84.900000,100
2019-10-07 13:35:56.148489984,2019-10-07 13:35:56.148473402,459375,T,IEX,84.940000,100
2019-10-07 13:36:25.630440960,2019-10-07 13:36:25.630420135,487954,T,IEX,84.915000,69
2019-10-07 13:36:30.65467904,2019-10-07 13:36:30.65449353,492432,T,IEX,84.900000,100
2019-10-07 13:36:30.66085120,2019-10-07 13:36:30.66066705,492448,T,IEX,84.900000,200
2019-10-07 13:36:30.66915072,2019-10-07 13:36:30.66897058,492461,T,IEX,84.900000,100
2019-10-07 13:36:30.274168064,2019-10-07 13:36:30.274150288,492881,T,IEX,84.885000,100
2019-10-07 13:36:30.439294976,2019-10-07 13:36:30.439274811,492989,T,IEX,84.900000,100
2019-10-07 13:36:30.864851968,2019-10-07 13:36:30.864831942,493376,T,IEX,84.900000,500
2019-10-07 13:36:31.197565952,2019-10-07 13:36:31.197548623,493721,T,IEX,84.900000,100
2019-10-07 13:36:33.236822016,2019-10-07 13:36:33.236804544,496224,T,IEX,84.900000,100
2019-10-07 13:36:48.203886080,2019-10-07 13:36:48.203867984,509922,T,IEX,84.910000,100
2019-10-07 13:37:18.448896000,2019-10-07 13:37:18.448876237,538367,T,IEX,84.885000,100
2019-10-07 13:37:18.450489088,2019-10-07 13:37:18.450470740,538368,T,IEX,84.885000,100
2019-10-07 13:37:20.808964096,2019-10-07 13:37:20.808943791,540698,T,IEX,84.900000,55
2019-10-07 13:37:26.581292032,2019-10-07 13:37:26.581272620,546800,T,IEX,84.920000,100
2019-10-07 13:37:58.672654080,2019-10-07 13:37:58.672634422,571874,T,IEX,84.940000,100
2019-10-07 13:37:58.673714944,2019-10-07 13:37:58.673696593,571875,T,IEX,84.940000,100
2019-10-07 13:37:58.673762048,2019-10-07 13:37:58.673746173,571876,T,IEX,84.940000,100
2019-10-07 13:39:01.327642880,2019-10-07 13:39:01.327622492,618082,T,IEX,84.955000,100
2019-10-07 13:39:02.544952064,2019-10-07 13:39:02.544933000,619872,T,IEX,84.960000,100
2019-10-07 13:39:07.150150912,2019-10-07 13:39:07.150128563,624312,T,IEX,84.965000,100
2019-10-07 13:39:23.496688896,2019-10-07 13:39:23.496669134,635251,T,IEX,84.940000,1
2019-10-07 13:42:58.886692096,2019-10-07 13:42:58.886670989,805540,T,IEX,84.925000,1
2019-10-07 13:43:00.387837952,2019-10-07 13:43:00.387818855,807387,T,IEX,84.900000,100
2019-10-07 13:45:12.267262976,2019-10-07 13:45:12.267247519,913331,T,IEX,84.730000,100
2019-10-07 13:45:21.131209984,2019-10-07 13:45:21.131190995,922933,T,IEX,84.760000,100
2019-10-07 13:45:45.871506944,2019-10-07 13:45:45.871489840,942096,T,IEX,84.710000,100
2019-10-07 13:46:45.196975104,2019-10-07 13:46:45.196955496,1001336,T,IEX,84.595000,3
2019-10-07 13:46:49.45338112,2019-10-07 13:46:49.45319675,1004409,T,IEX,84.595000,3
2019-10-07 13:47:06.232985088,2019-10-07 13:47:06.232965615,1018191,T,IEX,84.600000,100
2019-10-07 13:47:22.424598016,2019-10-07 13:47:22.424580486,1034159,T,IEX,84.650000,100
2019-10-07 13:47:22.429291008,2019-10-07 13:47:22.429269970,1034161,T,IEX,84.650000,100
2019-10-07 13:47:39.239917056,2019-10-07 13:47:39.239896989,1046549,T,IEX,84.645000,3
2019-10-07 13:48:11.610072064,2019-10-07 13:48:11.610051883,1079782,T,IEX,84.570000,200
2019-10-07 13:48:40.108109056,2019-10-07 13:48:40.108091529,1107454,T,IEX,84.525000,22
2019-10-07 13:49:25.709784064,2019-10-07 13:49:25.709765060,1143532,T,IEX,84.460000,10
2019-10-07 13:49:25.716108032,2019-10-07 13:49:25.716088553,1143534,T,IEX,84.460000,100
2019-10-07 13:50:10.259915008,2019-10-07 13:50:10.259893128,1179793,T,IEX,84.440000,100
2019-10-07 13:50:14.992884992,2019-10-07 13:50:14.992865865,1183082,T,IEX,84.450000,100
2019-10-07 13:50:54.394964992,2019-10-07 13:50:54.394946852,1218273,T,IEX,84.495000,100
2019-10-07 13:51:34.991408128,2019-10-07 13:51:34.991387010,1257035,T,IEX,84.470000,2300
2019-10-07 13:52:35.205672960,2019-10-07 13:52:35.205652164,1316577,T,IEX,84.490000,100
2019-10-07 13:53:20.167622912,2019-10-07 13:53:20.167607161,1354250,T,IEX,84.490000,4
2019-10-07 13:53:20.167638016,2019-10-07 13:53:20.167622533,1354251,T,IEX,84.490000,4
2019-10-07 13:54:15.89989120,2019-10-07 13:54:15.89970388,1408433,T,IEX,84.490000,4
2019-10-07 13:54:15.90008064,2019-10-07 13:54:15.89990203,1408434,T,IEX,84.490000,49
2019-10-07 13:55:06.199736064,2019-10-07 13:55:06.199717161,1449824,T,IEX,84.440000,100
2019-10-07 13:55:14.653882880,2019-10-07 13:55:14.653863262,1456434,T,IEX,84.440000,100
2019-10-07 13:55:14.656086016,2019-10-07 13:55:14.656066715,1456435,T,IEX,84.435000,100
2019-10-07 13:55:27.122994944,2019-10-07 13:55:27.122975706,1467692,T,IEX,84.430000,100
2019-10-07 13:56:24.619042048,2019-10-07 13:56:24.619023726,1513040,T,IEX,84.440000,100
2019-10-07 13:56:25.664011008,2019-10-07 13:56:25.663987783,1513890,T,IEX,84.460000,100
2019-10-07 13:56:27.366927104,2019-10-07 13:56:27.366904817,1515076,T,IEX,84.450000,100
2019-10-07 13:56:27.367610112,2019-10-07 13:56:27.367592993,1515078,T,IEX,84.450000,100
2019-10-07 13:56:32.729694976,2019-10-07 13:56:32.729673639,1519127,T,IEX,84.445000,100
2019-10-07 13:56:53.674693888,2019-10-07 13:56:53.674675691,1534308,T,IEX,84.450000,100
2019-10-07 13:56:58.708417024,2019-10-07 13:56:58.708397126,1536931,T,IEX,84.435000,2
2019-10-07 13:58:02.655570944,2019-10-07 13:58:02.655552953,1584516,T,IEX,84.430000,100
2019-10-07 13:58:02.656787968,2019-10-07 13:58:02.656769718,1584518,T,IEX,84.430000,100
2019-10-07 13:58:04.200911104,2019-10-07 13:58:04.200892377,1585304,T,IEX,84.420000,100
2019-10-07 13:58:19.890885888,2019-10-07 13:58:19.890866519,1599061,T,IEX,84.440000,1
2019-10-07 13:58:19.890895872,2019-10-07 13:58:19.890878767,1599062,T,IEX,84.440000,149
2019-10-07 13:58:20.151889920,2019-10-07 13:58:20.151873072,1599442,T,IEX,84.430000,100
2019-10-07 13:58:24.949977088,2019-10-07 13:58:24.949958068,1604909,T,IEX,84.430000,46
2019-10-07 13:58:30.101139968,2019-10-07 13:58:30.101122413,1609708,T,IEX,84.450000,3
2019-10-07 13:58:30.101158912,2019-10-07 13:58:30.101141894,1609709,T,IEX,84.450000,100
2019-10-07 13:58:57.847631104,2019-10-07 13:58:57.847613111,1630956,T,IEX,84.400000,100
2019-10-07 13:59:21.380462080,2019-10-07 13:59:21.380440666,1654971,T,IEX,84.350000,100
2019-10-07 14:00:36.56335872,2019-10-07 14:00:36.56317533,1723128,T,IEX,84.325000,100
2019-10-07 14:00:36.225856000,2019-10-07 14:00:36.225836866,1723266,T,IEX,84.325000,100
2019-10-07 14:00:37.614012928,2019-10-07 14:00:37.613995584,1724815,T,IEX,84.325000,100
2019-10-07 14:00:37.614035968,2019-10-07 14:00:37.614020025,1724816,T,IEX,84.325000,127
2019-10-07 14:01:25.62916096,2019-10-07 14:01:25.62894968,1770685,T,IEX,84.280000,1
2019-10-07 14:01:50.943425024,2019-10-07 14:01:50.943410295,1789575,T,IEX,84.255000,100
2019-10-07 14:01:50.958980096,2019-10-07 14:01:50.958962495,1789634,T,IEX,84.260000,100
2019-10-07 14:02:37.710489088,2019-10-07 14:02:37.710469655,1828042,T,IEX,84.230000,1
2019-10-07 14:03:17.858856960,2019-10-07 14:03:17.858835456,1858680,T,IEX,84.175000,100
2019-10-07 14:03:17.861699072,2019-10-07 14:03:17.861679104,1858683,T,IEX,84.180000,100
2019-10-07 14:04:06.36558080,2019-10-07 14:04:06.36539337,1895497,T,IEX,84.180000,100
2019-10-07 14:04:34.604046080,2019-10-07 14:04:34.604024759,1921343,T,IEX,84.190000,1
2019-10-07 14:04:44.287226880,2019-10-07 14:04:44.287207679,1928705,T,IEX,84.180000,1
2019-10-07 14:04:55.40268032,2019-10-07 14:04:55.40252955,1936551,T,IEX,84.180000,100
2019-10-07 14:04:59.579844096,2019-10-07 14:04:59.579826249,1939715,T,IEX,84.195000,1
2019-10-07 14:05:05.202409984,2019-10-07 14:05:05.202391205,1949371,T,IEX,84.200000,100
2019-10-07 14:05:06.347952896,2019-10-07 14:05:06.347933521,1951255,T,IEX,84.195000,1
2019-10-07 14:05:16.947834112,2019-10-07 14:05:16.947812455,1966011,T,IEX,84.155000,2
2019-10-07 14:05:17.208211968,2019-10-07 14:05:17.208190786,1966198,T,IEX,84.155000,1
2019-10-07 14:05:17.434757120,2019-10-07 14:05:17.434738073,1966396,T,IEX,84.145000,100
2019-10-07 14:05:17.434812928,2019-10-07 14:05:17.434796304,1966397,T,IEX,84.145000,1
2019-10-07 14:05:17.443896064,2019-10-07 14:05:17.443874559,1966406,T,IEX,84.145000,205
2019-10-07 14:05:17.489967104,2019-10-07 14:05:17.489948176,1966489,T,IEX,84.150000,100
2019-10-07 14:05:17.990104064,2019-10-07 14:05:17.990083712,1967307,T,IEX,84.150000,100
2019-10-07 14:05:18.81411072,2019-10-07 14:05:18.81392844,1967493,T,IEX,84.150000,100
2019-10-07 14:05:18.957325056,2019-10-07 14:05:18.957308937,1968576,T,IEX,84.160000,1
2019-10-07 14:05:19.634490880,2019-10-07 14:05:19.634475098,1969253,T,IEX,84.165000,100
2019-10-07 14:05:21.183240960,2019-10-07 14:05:21.183224940,1970647,T,IEX,84.165000,200
2019-10-07 14:05:21.188171008,2019-10-07 14:05:21.188149756,1970650,T,IEX,84.165000,1
2019-10-07 14:05:22.712905984,2019-10-07 14:05:22.712881786,1972424,T,IEX,84.165000,200
2019-10-07 14:05:24.714093056,2019-10-07 14:05:24.714074112,1973997,T,IEX,84.165000,200
2019-10-07 14:05:26.446098944,2019-10-07 14:05:26.446079038,1975176,T,IEX,84.165000,200
2019-10-07 14:05:26.617360896,2019-10-07 14:05:26.617345267,1975230,T,IEX,84.165000,129
2019-10-07 14:05:26.622428928,2019-10-07 14:05:26.622412728,1975233,T,IEX,84.165000,1
2019-10-07 14:05:27.90020096,2019-10-07 14:05:27.90000954,1976183,T,IEX,84.165000,117
2019-10-07 14:05:27.117456896,2019-10-07 14:05:27.117440809,1976255,T,IEX,84.165000,100
2019-10-07 14:05:35.241146880,2019-10-07 14:05:35.241128096,1986095,T,IEX,84.195000,100
2019-10-07 14:05:53.242085120,2019-10-07 14:05:53.242066270,2010206,T,IEX,84.195000,100
2019-10-07 14:06:05.806144000,2019-10-07 14:06:05.806123927,2026344,T,IEX,84.245000,397
2019-10-07 14:06:11.807438080,2019-10-07 14:06:11.807418009,2038575,T,IEX,84.235000,7
2019-10-07 14:06:12.245658112,2019-10-07 14:06:12.245638857,2039371,T,IEX,84.240000,100
2019-10-07 14:06:30.507956992,2019-10-07 14:06:30.507940594,2059156,T,IEX,84.260000,2
2019-10-07 14:06:35.811581952,2019-10-07 14:06:35.811563801,2067510,T,IEX,84.265000,3
2019-10-07 14:06:37.650703104,2019-10-07 14:06:37.650682545,2069937,T,IEX,84.260000,100
2019-10-07 14:06:37.650714880,2019-10-07 14:06:37.650697479,2069938,T,IEX,84.260000,100
2019-10-07 14:06:38.56791040,2019-10-07 14:06:38.56768986,2070665,T,IEX,84.255000,1
2019-10-07 14:06:42.247687936,2019-10-07 14:06:42.247671337,2074067,T,IEX,84.260000,100
2019-10-07 14:06:48.788401920,2019-10-07 14:06:48.788385811,2080787,T,IEX,84.220000,1
2019-10-07 14:06:49.290138112,2019-10-07 14:06:49.290119416,2082036,T,IEX,84.220000,95
2019-10-07 14:06:57.166413056,2019-10-07 14:06:57.166394095,2090605,T,IEX,84.220000,100
2019-10-07 14:07:05.248829952,2019-10-07 14:07:05.248811681,2098220,T,IEX,84.220000,1
2019-10-07 14:07:06.289976064,2019-10-07 14:07:06.289959237,2098861,T,IEX,84.210000,2
2019-10-07 14:07:06.473592064,2019-10-07 14:07:06.473571753,2099268,T,IEX,84.220000,1
2019-10-07 14:07:10.930488064,2019-10-07 14:07:10.930470783,2103589,T,IEX,84.220000,1
2019-10-07 14:07:27.247725056,2019-10-07 14:07:27.247704461,2114510,T,IEX,84.220000,100
2019-10-07 14:07:35.299667968,2019-10-07 14:07:35.299652121,2119084,T,IEX,84.230000,1
2019-10-07 14:07:39.45595904,2019-10-07 14:07:39.45580355,2122376,T,IEX,84.230000,2
2019-10-07 14:07:56.717095936,2019-10-07 14:07:56.717078072,2134633,T,IEX,84.255000,4
2019-10-07 14:07:56.721893888,2019-10-07 14:07:56.721874750,2134646,T,IEX,84.260000,100
2019-10-07 14:07:56.722888960,2019-10-07 14:07:56.722871027,2134647,T,IEX,84.260000,500
2019-10-07 14:08:04.398219008,2019-10-07 14:08:04.398198276,2142159,T,IEX,84.250000,3
2019-10-07 14:08:07.395100928,2019-10-07 14:08:07.395082363,2144454,T,IEX,84.245000,3
2019-10-07 14:08:13.268370944,2019-10-07 14:08:13.268351188,2148987,T,IEX,84.225000,1
2019-10-07 14:08:19.258750976,2019-10-07 14:08:19.258733208,2153871,T,IEX,84.230000,100
2019-10-07 14:08:20.272716032,2019-10-07 14:08:20.272695027,2154889,T,IEX,84.225000,43
2019-10-07 14:08:33.954483968,2019-10-07 14:08:33.954466870,2165906,T,IEX,84.230000,1
2019-10-07 14:09:03.758212096,2019-10-07 14:09:03.758196700,2188695,T,IEX,84.230000,1
2019-10-07 14:09:04.929544960,2019-10-07 14:09:04.929524372,2189475,T,IEX,84.230000,2
2019-10-07 14:09:07.592948992,2019-10-07 14:09:07.592932175,2190972,T,IEX,84.230000,97
2019-10-07 14:09:17.361548032,2019-10-07 14:09:17.361527800,2198793,T,IEX,84.230000,100
2019-10-07 14:09:50.463634944,2019-10-07 14:09:50.463617840,2223457,T,IEX,84.285000,100
2019-10-07 14:09:56.597978112,2019-10-07 14:09:56.597961091,2228979,T,IEX,84.295000,100
2019-10-07 14:10:02.32660992,2019-10-07 14:10:02.32642448,2233997,T,IEX,84.300000,100
2019-10-07 14:10:09.25254912,2019-10-07 14:10:09.25236616,2239994,T,IEX,84.280000,16
2019-10-07 14:10:24.622052096,2019-10-07 14:10:24.622033926,2255098,T,IEX,84.315000,100
2019-10-07 14:10:24.623030016,2019-10-07 14:10:24.623013144,2255101,T,IEX,84.315000,100
2019-10-07 14:10:53.154694912,2019-10-07 14:10:53.154673444,2278774,T,IEX,84.260000,100
2019-10-07 14:10:53.155791872,2019-10-07 14:10:53.155771072,2278775,T,IEX,84.260000,100
2019-10-07 14:10:53.156526080,2019-10-07 14:10:53.156509129,2278778,T,IEX,84.260000,100
2019-10-07 14:10:53.157332992,2019-10-07 14:10:53.157313805,2278779,T,IEX,84.260000,142
2019-10-07 14:10:53.190823936,2019-10-07 14:10:53.190802510,2278789,T,IEX,84.260000,101
2019-10-07 14:10:58.602370048,2019-10-07 14:10:58.602350665,2282652,T,IEX,84.255000,20
2019-10-07 14:11:09.342435072,2019-10-07 14:11:09.342416388,2293740,T,IEX,84.265000,2
2019-10-07 14:11:09.499973120,2019-10-07 14:11:09.499951359,2293864,T,IEX,84.265000,100
2019-10-07 14:11:31.606647040,2019-10-07 14:11:31.606630956,2311903,T,IEX,84.250000,2
2019-10-07 14:11:33.506586880,2019-10-07 14:11:33.506570533,2313399,T,IEX,84.260000,3
2019-10-07 14:11:34.855119872,2019-10-07 14:11:34.855091520,2314120,T,IEX,84.260000,100
2019-10-07 14:11:35.414384896,2019-10-07 14:11:35.414365630,2314368,T,IEX,84.260000,100
2019-10-07 14:11:40.460532992,2019-10-07 14:11:40.460514043,2318040,T,IEX,84.260000,100
2019-10-07 14:11:50.189126912,2019-10-07 14:11:50.189105548,2323577,T,IEX,84.260000,100
2019-10-07 14:11:54.815623936,2019-10-07 14:11:54.815607783,2326247,T,IEX,84.260000,130
2019-10-07 14:12:35.30622976,2019-10-07 14:12:35.30605348,2356971,T,IEX,84.260000,1
2019-10-07 14:12:59.961537024,2019-10-07 14:12:59.961518856,2374468,T,IEX,84.255000,100
2019-10-07 14:13:01.941356032,2019-10-07 14:13:01.941339207,2376607,T,IEX,84.260000,100
2019-10-07 14:13:31.231493888,2019-10-07 14:13:31.231477833,2397126,T,IEX,84.260000,100
2019-10-07 14:14:05.906973952,2019-10-07 14:14:05.906954402,2418339,T,IEX,84.245000,1
2019-10-07 14:14:22.731917056,2019-10-07 14:14:22.731899642,2432432,T,IEX,84.250000,100
2019-10-07 14:15:03.166757888,2019-10-07 14:15:03.166739939,2459744,T,IEX,84.245000,100
2019-10-07 14:15:03.627397120,2019-10-07 14:15:03.627376864,2460342,T,IEX,84.250000,100
2019-10-07 14:15:08.659781120,2019-10-07 14:15:08.659758940,2465712,T,IEX,84.260000,98
2019-10-07 14:15:47.509904896,2019-10-07 14:15:47.509883316,2501028,T,IEX,84.185000,100
2019-10-07 14:16:05.617264128,2019-10-07 14:16:05.617244684,2512282,T,IEX,84.205000,1
2019-10-07 14:16:05.617282048,2019-10-07 14:16:05.617264788,2512283,T,IEX,84.205000,99
2019-10-07 14:16:12.718125056,2019-10-07 14:16:12.718105146,2515991,T,IEX,84.185000,100
2019-10-07 14:16:14.942166016,2019-10-07 14:16:14.942148289,2517050,T,IEX,84.185000,6
2019-10-07 14:16:18.548271104,2019-10-07 14:16:18.548248546,2518497,T,IEX,84.185000,100
2019-10-07 14:17:31.146051072,2019-10-07 14:17:31.146027724,2567693,T,IEX,84.100000,100
2019-10-07 14:17:35.230714112,2019-10-07 14:17:35.230692133,2570860,T,IEX,84.110000,58
2019-10-07 14:18:36.478452992,2019-10-07 14:18:36.478432527,2611223,T,IEX,84.065000,100
2019-10-07 14:19:04.539803904,2019-10-07 14:19:04.539786957,2630482,T,IEX,84.035000,100
2019-10-07 14:19:05.183849984,2019-10-07 14:19:05.183832087,2630985,T,IEX,84.035000,100
2019-10-07 14:19:05.682462976,2019-10-07 14:19:05.682445852,2631265,T,IEX,84.035000,100
2019-10-07 14:19:17.977480960,2019-10-07 14:19:17.977456163,2637633,T,IEX,84.055000,32
2019-10-07 14:19:17.982985984,2019-10-07 14:19:17.982966987,2637639,T,IEX,84.055000,100
2019-10-07 14:19:27.140829952,2019-10-07 14:19:27.140810537,2641983,T,IEX,84.060000,100
2019-10-07 14:19:32.918451968,2019-10-07 14:19:32.918430215,2647285,T,IEX,84.055000,1
2019-10-07 14:20:01.988711936,2019-10-07 14:20:01.988692304,2665849,T,IEX,83.950000,3
2019-10-07 14:20:03.882681088,2019-10-07 14:20:03.882657020,2668131,T,IEX,83.975000,100
2019-10-07 14:20:03.885552896,2019-10-07 14:20:03.885535579,2668134,T,IEX,83.975000,3
2019-10-07 14:20:03.886662912,2019-10-07 14:20:03.886641648,2668135,T,IEX,83.980000,3
2019-10-07 14:20:06.370178048,2019-10-07 14:20:06.370158737,2670669,T,IEX,83.995000,100
2019-10-07 14:20:06.370190080,2019-10-07 14:20:06.370172537,2670670,T,IEX,83.995000,100
2019-10-07 14:20:06.370209024,2019-10-07 14:20:06.370192437,2670671,T,IEX,83.995000,100
2019-10-07 14:20:06.370223104,2019-10-07 14:20:06.370205188,2670672,T,IEX,83.995000,100
2019-10-07 14:20:07.530394880,2019-10-07 14:20:07.530376075,2673359,T,IEX,84.000000,100
2019-10-07 14:20:49.361817088,2019-10-07 14:20:49.361794931,2696830,T,IEX,84.000000,25
2019-10-07 14:20:52.181063936,2019-10-07 14:20:52.181044058,2698469,T,IEX,84.010000,100
2019-10-07 14:20:52.182053120,2019-10-07 14:20:52.182035390,2698470,T,IEX,84.010000,400
2019-10-07 14:20:52.182068992,2019-10-07 14:20:52.182051574,2698471,T,IEX,84.010000,100
2019-10-07 14:20:52.187108096,2019-10-07 14:20:52.187087825,2698472,T,IEX,84.015000,100
2019-10-07 14:20:52.201271040,2019-10-07 14:20:52.201250410,2698478,T,IEX,84.020000,100
2019-10-07 14:21:05.269368064,2019-10-07 14:21:05.269348947,2706705,T,IEX,83.990000,100
2019-10-07 14:21:05.271621888,2019-10-07 14:21:05.271602810,2706710,T,IEX,83.990000,100
2019-10-07 14:21:18.373491968,2019-10-07 14:21:18.373474110,2716570,T,IEX,83.970000,100
2019-10-07 14:21:19.567173888,2019-10-07 14:21:19.567153462,2719074,T,IEX,83.965000,100
2019-10-07 14:21:19.567191040,2019-10-07 14:21:19.567174847,2719075,T,IEX,83.965000,100
2019-10-07 14:21:44.87330048,2019-10-07 14:21:44.87309410,2742860,T,IEX,83.955000,100
2019-10-07 14:22:04.662575104,2019-10-07 14:22:04.662558133,2756325,T,IEX,83.995000,100
2019-10-07 14:22:05.677702912,2019-10-07 14:22:05.677684055,2757591,T,IEX,83.985000,100
2019-10-07 14:22:15.660194048,2019-10-07 14:22:15.660176316,2765679,T,IEX,83.975000,100
2019-10-07 14:22:22.667002880,2019-10-07 14:22:22.666981020,2770393,T,IEX,83.970000,100
2019-10-07 14:22:22.668084992,2019-10-07 14:22:22.668067467,2770395,T,IEX,83.970000,100
2019-10-07 14:22:22.669064960,2019-10-07 14:22:22.669046094,2770396,T,IEX,83.970000,100
2019-10-07 14:22:27.232984064,2019-10-07 14:22:27.232965940,2773000,T,IEX,83.985000,100
2019-10-07 14:22:53.959474944,2019-10-07 14:22:53.959455648,2786548,T,IEX,83.990000,100
2019-10-07 14:22:53.966353920,2019-10-07 14:22:53.966333150,2786551,T,IEX,83.990000,100
2019-10-07 14:23:08.830167040,2019-10-07 14:23:08.830146448,2795417,T,IEX,83.965000,100
2019-10-07 14:23:09.38467072,2019-10-07 14:23:09.38446239,2795513,T,IEX,83.970000,151
2019-10-07 14:23:26.814128896,2019-10-07 14:23:26.814106751,2807219,T,IEX,83.960000,100
2019-10-07 14:23:27.926974976,2019-10-07 14:23:27.926955131,2807689,T,IEX,83.965000,100
2019-10-07 14:23:35.344091904,2019-10-07 14:23:35.344073555,2812154,T,IEX,83.980000,100
2019-10-07 14:23:53.243179008,2019-10-07 14:23:53.243159194,2820746,T,IEX,83.960000,40
2019-10-07 14:24:03.636208128,2019-10-07 14:24:03.636190184,2831286,T,IEX,83.985000,100
2019-10-07 14:24:04.500048896,2019-10-07 14:24:04.500030796,2831978,T,IEX,83.985000,100
2019-10-07 14:24:09.329768960,2019-10-07 14:24:09.329750946,2834268,T,IEX,83.980000,160
2019-10-07 14:24:30.322867968,2019-10-07 14:24:30.322846238,2850896,T,IEX,84.020000,100
2019-10-07 14:25:06.163066112,2019-10-07 14:25:06.163046519,2876420,T,IEX,84.000000,1
2019-10-07 14:25:07.362494976,2019-10-07 14:25:07.362477383,2877415,T,IEX,84.035000,3
2019-10-07 14:25:07.363371008,2019-10-07 14:25:07.363355037,2877417,T,IEX,84.035000,100
2019-10-07 14:25:07.363385088,2019-10-07 14:25:07.363369500,2877418,T,IEX,84.035000,100
2019-10-07 14:25:10.171305984,2019-10-07 14:25:10.171288154,2879321,T,IEX,84.060000,100
2019-10-07 14:25:13.283664896,2019-10-07 14:25:13.283645194,2881249,T,IEX,84.050000,100
2019-10-07 14:25:13.284397056,2019-10-07 14:25:13.284376533,2881251,T,IEX,84.050000,100
2019-10-07 14:25:13.667909120,2019-10-07 14:25:13.667890235,2881536,T,IEX,84.050000,28
2019-10-07 14:25:32.271542016,2019-10-07 14:25:32.271521512,2892955,T,IEX,84.090000,100
2019-10-07 14:25:33.641334016,2019-10-07 14:25:33.641312534,2894094,T,IEX,84.090000,100
2019-10-07 14:26:41.285814016,2019-10-07 14:26:41.285789950,2942835,T,IEX,84.080000,100
2019-10-07 14:26:41.285824000,2019-10-07 14:26:41.285806220,2942836,T,IEX,84.080000,1600
2019-10-07 14:26:41.287304960,2019-10-07 14:26:41.287288270,2942843,T,IEX,84.080000,940
2019-10-07 14:26:41.291777024,2019-10-07 14:26:41.291758317,2942856,T,IEX,84.075000,100
2019-10-07 14:27:13.613144064,2019-10-07 14:27:13.613121923,2972515,T,IEX,84.110000,100
2019-10-07 14:27:42.809295104,2019-10-07 14:27:42.809278812,2988773,T,IEX,84.160000,100
2019-10-07 14:29:31.407601920,2019-10-07 14:29:31.407582947,3054806,T,IEX,84.140000,100
2019-10-07 14:29:31.408558080,2019-10-07 14:29:31.408537910,3054807,T,IEX,84.140000,175
2019-10-07 14:29:31.409531904,2019-10-07 14:29:31.409512513,3054808,T,IEX,84.140000,125
2019-10-07 14:29:57.425415936,2019-10-07 14:29:57.425398007,3069561,T,IEX,84.190000,100
2019-10-07 14:30:18.668467968,2019-10-07 14:30:18.668446661,3091480,T,IEX,84.145000,100
2019-10-07 14:30:23.978042880,2019-10-07 14:30:23.978026120,3095179,T,IEX,84.150000,100
2019-10-07 14:30:23.979058944,2019-10-07 14:30:23.979041692,3095180,T,IEX,84.150000,100
2019-10-07 14:30:23.979076096,2019-10-07 14:30:23.979058657,3095181,T,IEX,84.150000,100
2019-10-07 14:30:33.170195968,2019-10-07 14:30:33.170172895,3101243,T,IEX,84.130000,100
2019-10-07 14:30:33.496028928,2019-10-07 14:30:33.496010774,3101437,T,IEX,84.135000,100
2019-10-07 14:30:55.630451968,2019-10-07 14:30:55.630430769,3117989,T,IEX,84.125000,1
2019-10-07 14:30:58.177516032,2019-10-07 14:30:58.177500026,3119014,T,IEX,84.125000,100
2019-10-07 14:31:14.40342016,2019-10-07 14:31:14.40321628,3128663,T,IEX,84.160000,100
2019-10-07 14:31:14.40357120,2019-10-07 14:31:14.40338276,3128664,T,IEX,84.160000,100
2019-10-07 14:31:14.208937984,2019-10-07 14:31:14.208920795,3128732,T,IEX,84.165000,100
2019-10-07 14:31:22.195153920,2019-10-07 14:31:22.195133088,3135912,T,IEX,84.170000,16
2019-10-07 14:31:28.235095040,2019-10-07 14:31:28.235077093,3141583,T,IEX,84.180000,200
2019-10-07 14:31:36.6343936,2019-10-07 14:31:36.6325045,3148720,T,IEX,84.135000,100
2019-10-07 14:31:37.346214912,2019-10-07 14:31:37.346194781,3150013,T,IEX,84.145000,100
2019-10-07 14:31:47.51213056,2019-10-07 14:31:47.51193934,3157182,T,IEX,84.160000,100
2019-10-07 14:31:47.51232000,2019-10-07 14:31:47.51214244,3157183,T,IEX,84.160000,100
2019-10-07 14:31:51.486787072,2019-10-07 14:31:51.486768430,3159026,T,IEX,84.200000,100
2019-10-07 14:31:51.486798080,2019-10-07 14:31:51.486780532,3159027,T,IEX,84.200000,100
2019-10-07 14:32:15.68936960,2019-10-07 14:32:15.68919414,3175796,T,IEX,84.190000,100
2019-10-07 14:34:17.984508928,2019-10-07 14:34:17.984487897,3257644,T,IEX,84.175000,100
2019-10-07 14:34:30.206162944,2019-10-07 14:34:30.206141580,3265541,T,IEX,84.185000,100
2019-10-07 14:34:40.51600896,2019-10-07 14:34:40.51584239,3270404,T,IEX,84.185000,100
2019-10-07 14:34:50.676261120,2019-10-07 14:34:50.676240713,3279643,T,IEX,84.170000,100
2019-10-07 14:34:50.676278016,2019-10-07 14:34:50.676261425,3279644,T,IEX,84.170000,100
2019-10-07 14:34:58.780646912,2019-10-07 14:34:58.780631154,3285000,T,IEX,84.180000,100
2019-10-07 14:35:05.580905984,2019-10-07 14:35:05.580888089,3290645,T,IEX,84.190000,100
2019-10-07 14:35:43.255361024,2019-10-07 14:35:43.255342601,3315278,T,IEX,84.215000,3
2019-10-07 14:36:03.142768896,2019-10-07 14:36:03.142749931,3332811,T,IEX,84.205000,100
2019-10-07 14:36:16.726450944,2019-10-07 14:36:16.726435244,3342018,T,IEX,84.205000,100
2019-10-07 14:36:18.239553024,2019-10-07 14:36:18.239533836,3343752,T,IEX,84.185000,4
2019-10-07 14:36:23.321103872,2019-10-07 14:36:23.321082214,3348442,T,IEX,84.175000,1
2019-10-07 14:36:23.321116928,2019-10-07 14:36:23.321099600,3348443,T,IEX,84.175000,99
2019-10-07 14:36:24.136019968,2019-10-07 14:36:24.135999659,3348911,T,IEX,84.175000,3
2019-10-07 14:36:38.875502080,2019-10-07 14:36:38.875484402,3357813,T,IEX,84.240000,100
2019-10-07 14:37:42.47432960,2019-10-07 14:37:42.47415623,3417232,T,IEX,84.215000,100
2019-10-07 14:37:43.367277056,2019-10-07 14:37:43.367260986,3417960,T,IEX,84.215000,100
2019-10-07 14:37:43.966249984,2019-10-07 14:37:43.966231303,3418179,T,IEX,84.215000,100
2019-10-07 14:37:50.966734080,2019-10-07 14:37:50.966713586,3423108,T,IEX,84.215000,100
2019-10-07 14:37:51.66343936,2019-10-07 14:37:51.66327302,3423203,T,IEX,84.210000,100
2019-10-07 14:37:52.43074048,2019-10-07 14:37:52.43056255,3424018,T,IEX,84.195000,100
2019-10-07 14:38:02.734981888,2019-10-07 14:38:02.734963829,3431674,T,IEX,84.200000,100
2019-10-07 14:38:32.88410880,2019-10-07 14:38:32.88390305,3449744,T,IEX,84.215000,100
2019-10-07 14:38:49.146704896,2019-10-07 14:38:49.146687235,3459942,T,IEX,84.220000,100
2019-10-07 14:38:49.146722048,2019-10-07 14:38:49.146704974,3459943,T,IEX,84.220000,100
2019-10-07 14:38:49.156772096,2019-10-07 14:38:49.156754335,3459951,T,IEX,84.220000,100
2019-10-07 14:38:57.779910912,2019-10-07 14:38:57.779890318,3465686,T,IEX,84.215000,100
2019-10-07 14:39:16.408613888,2019-10-07 14:39:16.408597213,3479104,T,IEX,84.215000,100
2019-10-07 14:39:16.408632064,2019-10-07 14:39:16.408614376,3479105,T,IEX,84.215000,100
2019-10-07 14:39:16.417199104,2019-10-07 14:39:16.417177178,3479107,T,IEX,84.215000,3
2019-10-07 14:39:19.538774016,2019-10-07 14:39:19.538753664,3481093,T,IEX,84.215000,9
2019-10-07 14:40:16.362481920,2019-10-07 14:40:16.362466188,3518673,T,IEX,84.215000,100
2019-10-07 14:40:18.323350016,2019-10-07 14:40:18.323332460,3520304,T,IEX,84.220000,100
2019-10-07 14:40:47.240944896,2019-10-07 14:40:47.240925796,3543606,T,IEX,84.235000,100
2019-10-07 14:41:00.120231936,2019-10-07 14:41:00.120210683,3552174,T,IEX,84.240000,100
2019-10-07 14:41:16.58013952,2019-10-07 14:41:16.57995608,3566429,T,IEX,84.270000,100
2019-10-07 14:41:16.58031104,2019-10-07 14:41:16.58012606,3566430,T,IEX,84.270000,100
2019-10-07 14:41:35.962443008,2019-10-07 14:41:35.962424572,3578981,T,IEX,84.275000,100
2019-10-07 14:41:38.135276032,2019-10-07 14:41:38.135260908,3580183,T,IEX,84.280000,100
2019-10-07 14:41:45.881843968,2019-10-07 14:41:45.881826175,3585068,T,IEX,84.290000,100
2019-10-07 14:41:49.160769024,2019-10-07 14:41:49.160750974,3586559,T,IEX,84.300000,100
2019-10-07 14:41:55.702536960,2019-10-07 14:41:55.702516410,3593001,T,IEX,84.325000,100
2019-10-07 14:41:55.708615936,2019-10-07 14:41:55.708598724,3593005,T,IEX,84.325000,100
2019-10-07 14:41:57.38016000,2019-10-07 14:41:57.37997589,3594114,T,IEX,84.330000,1
2019-10-07 14:42:23.492761088,2019-10-07 14:42:23.492743750,3612796,T,IEX,84.340000,100
2019-10-07 14:42:23.509099008,2019-10-07 14:42:23.509080812,3612966,T,IEX,84.340000,3
2019-10-07 14:42:28.57822976,2019-10-07 14:42:28.57803930,3617726,T,IEX,84.310000,100
2019-10-07 14:43:00.816591872,2019-10-07 14:43:00.816570041,3639761,T,IEX,84.335000,100
2019-10-07 14:43:32.579608064,2019-10-07 14:43:32.579589025,3659594,T,IEX,84.335000,100
2019-10-07 14:43:34.765808128,2019-10-07 14:43:34.765789577,3660950,T,IEX,84.335000,100
2019-10-07 14:43:35.584006912,2019-10-07 14:43:35.583986656,3661475,T,IEX,84.335000,3
2019-10-07 14:43:40.515102976,2019-10-07 14:43:40.515082924,3664826,T,IEX,84.355000,100
2019-10-07 14:43:53.105542912,2019-10-07 14:43:53.105526791,3674508,T,IEX,84.365000,100
2019-10-07 14:44:28.142415872,2019-10-07 14:44:28.142397919,3707612,T,IEX,84.365000,100
2019-10-07 14:44:31.674827008,2019-10-07 14:44:31.674809116,3711892,T,IEX,84.345000,20
2019-10-07 14:45:20.913678080,2019-10-07 14:45:20.913658587,3746318,T,IEX,84.340000,100
2019-10-07 14:47:02.976424960,2019-10-07 14:47:02.976408860,3829036,T,IEX,84.285000,100
2019-10-07 14:47:03.379726080,2019-10-07 14:47:03.379704253,3829236,T,IEX,84.285000,1
2019-10-07 14:47:06.331052032,2019-10-07 14:47:06.331030887,3832457,T,IEX,84.275000,100
2019-10-07 14:47:34.211153920,2019-10-07 14:47:34.211136143,3853116,T,IEX,84.285000,1
2019-10-07 14:47:40.4311040,2019-10-07 14:47:40.4295880,3856917,T,IEX,84.280000,1
2019-10-07 14:48:29.330092032,2019-10-07 14:48:29.330074887,3885615,T,IEX,84.285000,100
2019-10-07 14:48:29.428073984,2019-10-07 14:48:29.428055069,3886124,T,IEX,84.285000,100
2019-10-07 14:48:57.330733056,2019-10-07 14:48:57.330710060,3901793,T,IEX,84.280000,100
2019-10-07 14:48:57.333091072,2019-10-07 14:48:57.333070657,3901794,T,IEX,84.280000,86
2019-10-07 14:48:57.333104896,2019-10-07 14:48:57.333087997,3901795,T,IEX,84.280000,14
2019-10-07 14:48:57.334223872,2019-10-07 14:48:57.334203673,3901796,T,IEX,84.280000,7
2019-10-07 14:50:05.666697984,2019-10-07 14:50:05.666678845,3937322,T,IEX,84.290000,4
2019-10-07 14:50:11.281895936,2019-10-07 14:50:11.281877370,3943739,T,IEX,84.305000,100
2019-10-07 14:50:11.287936000,2019-10-07 14:50:11.287916283,3943741,T,IEX,84.305000,100
2019-10-07 14:50:15.231149056,2019-10-07 14:50:15.231127882,3947375,T,IEX,84.305000,100
2019-10-07 14:51:52.401860096,2019-10-07 14:51:52.401838879,4009387,T,IEX,84.345000,100
2019-10-07 14:51:52.412421888,2019-10-07 14:51:52.412399876,4009389,T,IEX,84.345000,100
2019-10-07 14:52:08.30138880,2019-10-07 14:52:08.30123112,4018986,T,IEX,84.365000,100
2019-10-07 14:52:13.82804992,2019-10-07 14:52:13.82787086,4024336,T,IEX,84.370000,100
2019-10-07 14:52:13.89282048,2019-10-07 14:52:13.89262196,4024339,T,IEX,84.370000,100
2019-10-07 14:53:05.771972096,2019-10-07 14:53:05.771949632,4058957,T,IEX,84.370000,100
2019-10-07 14:53:25.614021120,2019-10-07 14:53:25.614001925,4071690,T,IEX,84.365000,100
2019-10-07 14:54:06.205676032,2019-10-07 14:54:06.205656583,4091569,T,IEX,84.375000,1
2019-10-07 14:54:06.926147072,2019-10-07 14:54:06.926129509,4092014,T,IEX,84.395000,100
2019-10-07 14:54:06.932635904,2019-10-07 14:54:06.932614380,4092016,T,IEX,84.395000,100
2019-10-07 14:54:08.76674048,2019-10-07 14:54:08.76655648,4093163,T,IEX,84.405000,100
2019-10-07 14:54:11.466190080,2019-10-07 14:54:11.466167790,4098278,T,IEX,84.405000,99
2019-10-07 14:54:16.31248896,2019-10-07 14:54:16.31230085,4101235,T,IEX,84.405000,48
2019-10-07 14:54:42.10043904,2019-10-07 14:54:42.10028042,4118015,T,IEX,84.420000,100
2019-10-07 14:54:42.10661120,2019-10-07 14:54:42.10644722,4118016,T,IEX,84.425000,100
2019-10-07 14:54:42.412054016,2019-10-07 14:54:42.412032828,4118283,T,IEX,84.435000,100
2019-10-07 14:54:47.434226944,2019-10-07 14:54:47.434208323,4120523,T,IEX,84.435000,100
2019-10-07 14:55:39.173850112,2019-10-07 14:55:39.173826928,4173445,T,IEX,84.520000,100
2019-10-07 14:56:01.708073984,2019-10-07 14:56:01.708055430,4193361,T,IEX,84.520000,100
2019-10-07 14:56:20.567348992,2019-10-07 14:56:20.567329878,4210381,T,IEX,84.500000,100
2019-10-07 14:56:29.968396032,2019-10-07 14:56:29.968379054,4218912,T,IEX,84.495000,100
2019-10-07 14:56:34.583748096,2019-10-07 14:56:34.583727708,4221493,T,IEX,84.495000,100
2019-10-07 14:57:14.863973120,2019-10-07 14:57:14.863951528,4245961,T,IEX,84.480000,100
2019-10-07 14:57:21.405040896,2019-10-07 14:57:21.405021911,4250653,T,IEX,84.480000,100
2019-10-07 14:57:32.498840064,2019-10-07 14:57:32.498820799,4256849,T,IEX,84.470000,100
2019-10-07 14:57:32.500093952,2019-10-07 14:57:32.500074458,4256850,T,IEX,84.470000,100
2019-10-07 14:57:33.567863040,2019-10-07 14:57:33.567844893,4257143,T,IEX,84.480000,100
2019-10-07 14:57:33.569216000,2019-10-07 14:57:33.569196306,4257144,T,IEX,84.480000,100
2019-10-07 14:57:36.632365056,2019-10-07 14:57:36.632346159,4260332,T,IEX,84.500000,100
2019-10-07 14:57:36.633615872,2019-10-07 14:57:36.633598255,4260333,T,IEX,84.500000,100
