2019-10-23 12:56:32.333946112,2019-10-23 12:56:32.333901364,36943,T,IEX,11.230000,500
2019-10-23 13:30:02.818974976,2019-10-23 13:30:02.818952054,80858,T,IEX,11.290000,7
2019-10-23 13:36:02.63044096,2019-10-23 13:36:02.63022888,485406,T,IEX,11.285000,700
2019-10-23 13:36:02.63085056,2019-10-23 13:36:02.63068939,485407,T,IEX,11.280000,1700
2019-10-23 13:39:02.791941120,2019-10-23 13:39:02.791924505,722939,T,IEX,11.320000,8
2019-10-23 13:39:14.321729024,2019-10-23 13:39:14.321709560,736541,T,IEX,11.330000,92
2019-10-23 13:39:14.390424064,2019-10-23 13:39:14.390403456,736627,T,IEX,11.330000,100
2019-10-23 13:39:36.315706112,2019-10-23 13:39:36.315687171,758796,T,IEX,11.325000,73
2019-10-23 13:39:36.326351872,2019-10-23 13:39:36.326332707,758808,T,IEX,11.330000,300
2019-10-23 13:39:36.349324032,2019-10-23 13:39:36.349306437,758857,T,IEX,11.330000,300
2019-10-23 13:39:57.606924032,2019-10-23 13:39:57.606905813,779355,T,IEX,11.325000,51
2019-10-23 13:39:57.617952000,2019-10-23 13:39:57.617931636,779362,T,IEX,11.330000,200
2019-10-23 13:39:58.12409088,2019-10-23 13:39:58.12392524,779776,T,IEX,11.325000,41
2019-10-23 13:39:58.22352896,2019-10-23 13:39:58.22334043,779792,T,IEX,11.330000,200
2019-10-23 13:40:31.450683904,2019-10-23 13:40:31.450666068,814933,T,IEX,11.330000,200
2019-10-23 13:45:50.918198016,2019-10-23 13:45:50.918176925,1100218,T,IEX,11.340000,100
2019-10-23 13:48:13.385771008,2019-10-23 13:48:13.385752049,1228307,T,IEX,11.340000,100
2019-10-23 13:49:45.662433024,2019-10-23 13:49:45.662412833,1298646,T,IEX,11.350000,600
2019-10-23 13:51:37.233853952,2019-10-23 13:51:37.233834266,1393970,T,IEX,11.340000,100
2019-10-23 13:56:15.822440960,2019-10-23 13:56:15.822421580,1654289,T,IEX,11.340000,441
2019-10-23 13:58:44.995442944,2019-10-23 13:58:44.995426599,1782688,T,IEX,11.330000,2300
2019-10-23 14:00:09.416811008,2019-10-23 14:00:09.416791942,1855621,T,IEX,11.340000,7
2019-10-23 14:04:58.765294080,2019-10-23 14:04:58.765277047,2136185,T,IEX,11.360000,100
2019-10-23 14:21:45.346202880,2019-10-23 14:21:45.346182425,2941720,T,IEX,11.390000,100
2019-10-23 14:30:00.153847040,2019-10-23 14:30:00.153822852,3257788,T,IEX,11.390000,500
2019-10-23 14:30:00.193965056,2019-10-23 14:30:00.193944726,3258327,T,IEX,11.410000,100
2019-10-23 14:30:00.193997056,2019-10-23 14:30:00.193978068,3258329,T,IEX,11.410000,100
2019-10-23 14:30:00.251418880,2019-10-23 14:30:00.251400210,3259628,T,IEX,11.440000,500
2019-10-23 14:30:00.600864000,2019-10-23 14:30:00.600843010,3262470,T,IEX,11.450000,500
2019-10-23 14:30:00.895255040,2019-10-23 14:30:00.895237279,3263781,T,IEX,11.460000,500
2019-10-23 14:30:01.294509056,2019-10-23 14:30:01.294492381,3265656,T,IEX,11.460000,500
2019-10-23 14:30:01.481891072,2019-10-23 14:30:01.481872800,3266342,T,IEX,11.460000,102
2019-10-23 14:30:01.485361920,2019-10-23 14:30:01.485342133,3266352,T,IEX,11.460000,102
2019-10-23 14:30:01.555781120,2019-10-23 14:30:01.555759732,3266488,T,IEX,11.450000,84
2019-10-23 14:30:01.691098112,2019-10-23 14:30:01.691079353,3267121,T,IEX,11.450000,37
2019-10-23 14:30:01.695315968,2019-10-23 14:30:01.695297304,3267163,T,IEX,11.450000,37
2019-10-23 14:30:01.930245888,2019-10-23 14:30:01.930226804,3267721,T,IEX,11.450000,25
2019-10-23 14:30:02.326912,2019-10-23 14:30:02.309765,3267871,T,IEX,11.450000,17
2019-10-23 14:30:02.14066944,2019-10-23 14:30:02.14045568,3267905,T,IEX,11.450000,17
2019-10-23 14:30:02.87655936,2019-10-23 14:30:02.87638117,3268105,T,IEX,11.450000,12
2019-10-23 14:30:02.468850944,2019-10-23 14:30:02.468831742,3268742,T,IEX,11.440000,150
2019-10-23 14:30:02.472322048,2019-10-23 14:30:02.472301773,3268746,T,IEX,11.440000,150
2019-10-23 14:30:06.551727104,2019-10-23 14:30:06.551705649,3274014,T,IEX,11.470000,500
2019-10-23 14:30:18.567165952,2019-10-23 14:30:18.567147530,3294613,T,IEX,11.470000,12
2019-10-23 14:30:30.771650048,2019-10-23 14:30:30.771626104,3309848,T,IEX,11.470000,500
2019-10-23 14:30:40.479904000,2019-10-23 14:30:40.479885734,3319920,T,IEX,11.500000,500
2019-10-23 14:30:40.748939008,2019-10-23 14:30:40.748920897,3320432,T,IEX,11.500000,1000
2019-10-23 14:32:09.88453120,2019-10-23 14:32:09.88430047,3418087,T,IEX,11.460000,1000
2019-10-23 14:32:17.596879104,2019-10-23 14:32:17.596860851,3426655,T,IEX,11.470000,200
2019-10-23 14:32:49.600290048,2019-10-23 14:32:49.600273800,3454958,T,IEX,11.475000,100
2019-10-23 14:35:52.374739968,2019-10-23 14:35:52.374711266,3609525,T,IEX,11.455000,700
2019-10-23 14:35:52.377293056,2019-10-23 14:35:52.377271676,3609526,T,IEX,11.455000,100
2019-10-23 14:35:52.379094016,2019-10-23 14:35:52.379074404,3609530,T,IEX,11.455000,100
2019-10-23 14:35:52.380420096,2019-10-23 14:35:52.380402225,3609532,T,IEX,11.455000,100
2019-10-23 14:35:52.382145024,2019-10-23 14:35:52.382125656,3609534,T,IEX,11.455000,100
2019-10-23 14:37:33.970874880,2019-10-23 14:37:33.970852998,3684561,T,IEX,11.465000,100
2019-10-23 14:38:05.989104128,2019-10-23 14:38:05.989083728,3706681,T,IEX,11.470000,100
2019-10-23 14:38:45.195017984,2019-10-23 14:38:45.195001088,3734787,T,IEX,11.450000,1000
2019-10-23 14:40:03.780385024,2019-10-23 14:40:03.780368659,3794022,T,IEX,11.455000,400
2019-10-23 14:40:14.933327872,2019-10-23 14:40:14.933306251,3801977,T,IEX,11.460000,400
2019-10-23 14:40:14.933338112,2019-10-23 14:40:14.933319579,3801978,T,IEX,11.460000,300
2019-10-23 14:46:08.609024000,2019-10-23 14:46:08.609008021,4069584,T,IEX,11.490000,100
2019-10-23 14:46:12.342073088,2019-10-23 14:46:12.342055177,4074124,T,IEX,11.490000,100
2019-10-23 14:46:12.352624128,2019-10-23 14:46:12.352605802,4074149,T,IEX,11.490000,1000
2019-10-23 14:46:12.352633088,2019-10-23 14:46:12.352615421,4074150,T,IEX,11.490000,100
2019-10-23 14:46:30.262398976,2019-10-23 14:46:30.262382655,4086394,T,IEX,11.475000,100
2019-10-23 14:46:31.133254912,2019-10-23 14:46:31.133234680,4087095,T,IEX,11.475000,1000
2019-10-23 14:48:32.52742912,2019-10-23 14:48:32.52721942,4171298,T,IEX,11.480000,32
2019-10-23 14:48:32.53270016,2019-10-23 14:48:32.53253757,4171302,T,IEX,11.480000,68
2019-10-23 14:48:58.970286080,2019-10-23 14:48:58.970266234,4185638,T,IEX,11.475000,100
2019-10-23 14:49:15.196886016,2019-10-23 14:49:15.196863276,4196556,T,IEX,11.475000,900
2019-10-23 14:49:15.198864896,2019-10-23 14:49:15.198843840,4196557,T,IEX,11.475000,200
2019-10-23 14:49:15.200909056,2019-10-23 14:49:15.200889996,4196558,T,IEX,11.475000,200
2019-10-23 14:49:15.202109952,2019-10-23 14:49:15.202090655,4196559,T,IEX,11.475000,200
2019-10-23 14:49:15.205807104,2019-10-23 14:49:15.205788065,4196561,T,IEX,11.475000,200
2019-10-23 14:49:15.207227904,2019-10-23 14:49:15.207207632,4196562,T,IEX,11.475000,200
2019-10-23 14:49:15.208467968,2019-10-23 14:49:15.208447428,4196563,T,IEX,11.475000,200
2019-10-23 14:49:15.209947904,2019-10-23 14:49:15.209928081,4196564,T,IEX,11.475000,200
2019-10-23 14:49:15.211191040,2019-10-23 14:49:15.211170080,4196565,T,IEX,11.475000,200
2019-10-23 14:49:15.212342016,2019-10-23 14:49:15.212321585,4196566,T,IEX,11.475000,200
2019-10-23 14:49:15.213579008,2019-10-23 14:49:15.213559531,4196567,T,IEX,11.475000,200
2019-10-23 14:49:15.214930944,2019-10-23 14:49:15.214910795,4196568,T,IEX,11.475000,200
2019-10-23 14:49:15.216271872,2019-10-23 14:49:15.216252825,4196569,T,IEX,11.475000,100
2019-10-23 14:49:15.217507072,2019-10-23 14:49:15.217486787,4196570,T,IEX,11.475000,100
2019-10-23 14:49:21.721414912,2019-10-23 14:49:21.721398251,4200580,T,IEX,11.480000,400
2019-10-23 14:49:40.622579968,2019-10-23 14:49:40.622557837,4210259,T,IEX,11.490000,400
2019-10-23 14:50:09.374418944,2019-10-23 14:50:09.374403788,4228056,T,IEX,11.495000,500
2019-10-23 14:50:13.315864064,2019-10-23 14:50:13.315844440,4232817,T,IEX,11.495000,600
2019-10-23 14:50:33.155538944,2019-10-23 14:50:33.155519038,4246707,T,IEX,11.500000,600
2019-10-23 14:50:52.209120000,2019-10-23 14:50:52.209101694,4257455,T,IEX,11.490000,300
2019-10-23 14:50:52.218968064,2019-10-23 14:50:52.218949553,4257464,T,IEX,11.490000,1200
2019-10-23 14:50:52.220419072,2019-10-23 14:50:52.220400574,4257470,T,IEX,11.490000,45
2019-10-23 14:56:49.854063104,2019-10-23 14:56:49.854042714,4512340,T,IEX,11.500000,1781
2019-10-23 15:01:33.526766080,2019-10-23 15:01:33.526747853,4705853,T,IEX,11.470000,300
2019-10-23 15:01:47.646704896,2019-10-23 15:01:47.646685293,4718993,T,IEX,11.470000,100
2019-10-23 15:01:52.678356992,2019-10-23 15:01:52.678338012,4722576,T,IEX,11.470000,100
2019-10-23 15:01:52.758350080,2019-10-23 15:01:52.758329639,4722633,T,IEX,11.470000,1800
2019-10-23 15:02:26.678450944,2019-10-23 15:02:26.678430479,4746503,T,IEX,11.470000,100
2019-10-23 15:02:27.431905024,2019-10-23 15:02:27.431888663,4747108,T,IEX,11.470000,300
2019-10-23 15:02:27.686190080,2019-10-23 15:02:27.686171379,4747275,T,IEX,11.470000,300
2019-10-23 15:05:29.716091904,2019-10-23 15:05:29.716074371,4850020,T,IEX,11.470000,100
2019-10-23 15:05:30.411674112,2019-10-23 15:05:30.411658179,4850383,T,IEX,11.470000,100
2019-10-23 15:05:30.773773056,2019-10-23 15:05:30.773750936,4850483,T,IEX,11.470000,100
2019-10-23 15:05:30.775421952,2019-10-23 15:05:30.775399935,4850486,T,IEX,11.470000,100
2019-10-23 15:06:09.474663936,2019-10-23 15:06:09.474645834,4872506,T,IEX,11.460000,250
2019-10-23 15:17:05.406406912,2019-10-23 15:17:05.406385429,5258488,T,IEX,11.510000,100
2019-10-23 15:18:46.191077888,2019-10-23 15:18:46.191059093,5317099,T,IEX,11.510000,171
2019-10-23 15:18:46.191096064,2019-10-23 15:18:46.191079004,5317100,T,IEX,11.510000,41
2019-10-23 15:19:52.200888064,2019-10-23 15:19:52.200867618,5351479,T,IEX,11.510000,100
2019-10-23 15:20:03.351438080,2019-10-23 15:20:03.351418421,5359436,T,IEX,11.515000,900
2019-10-23 15:20:03.353534976,2019-10-23 15:20:03.353509543,5359520,T,IEX,11.515000,400
2019-10-23 15:20:03.354796032,2019-10-23 15:20:03.354772292,5359576,T,IEX,11.515000,300
2019-10-23 15:20:03.356147968,2019-10-23 15:20:03.356122456,5359617,T,IEX,11.515000,300
2019-10-23 15:20:03.357180928,2019-10-23 15:20:03.357161569,5359642,T,IEX,11.515000,300
2019-10-23 15:20:03.358228992,2019-10-23 15:20:03.358207505,5359664,T,IEX,11.515000,300
2019-10-23 15:20:03.359514112,2019-10-23 15:20:03.359496465,5359692,T,IEX,11.515000,300
2019-10-23 15:20:03.360630016,2019-10-23 15:20:03.360612548,5359708,T,IEX,11.515000,300
2019-10-23 15:20:03.361691904,2019-10-23 15:20:03.361673753,5359720,T,IEX,11.515000,300
2019-10-23 15:20:03.362931968,2019-10-23 15:20:03.362913952,5359732,T,IEX,11.515000,300
2019-10-23 15:20:03.363977984,2019-10-23 15:20:03.363961618,5359743,T,IEX,11.515000,300
2019-10-23 15:20:03.365274880,2019-10-23 15:20:03.365257964,5359755,T,IEX,11.515000,300
2019-10-23 15:20:03.367439104,2019-10-23 15:20:03.367420246,5359766,T,IEX,11.515000,300
2019-10-23 15:20:03.369755904,2019-10-23 15:20:03.369736342,5359784,T,IEX,11.515000,300
2019-10-23 15:20:03.370771968,2019-10-23 15:20:03.370750403,5359788,T,IEX,11.515000,300
2019-10-23 15:20:03.371836928,2019-10-23 15:20:03.371817571,5359790,T,IEX,11.515000,300
2019-10-23 15:20:03.372941056,2019-10-23 15:20:03.372921864,5359797,T,IEX,11.515000,291
2019-10-23 15:20:03.374074880,2019-10-23 15:20:03.374056340,5359811,T,IEX,11.515000,200
2019-10-23 15:20:03.375158016,2019-10-23 15:20:03.375140539,5359825,T,IEX,11.515000,100
2019-10-23 15:20:03.376645120,2019-10-23 15:20:03.376626718,5359837,T,IEX,11.515000,100
2019-10-23 15:20:03.377678080,2019-10-23 15:20:03.377660929,5359841,T,IEX,11.515000,100
2019-10-23 15:20:03.378683904,2019-10-23 15:20:03.378665148,5359853,T,IEX,11.515000,100
2019-10-23 15:20:03.379974912,2019-10-23 15:20:03.379957969,5359860,T,IEX,11.515000,100
2019-10-23 15:20:03.381144064,2019-10-23 15:20:03.381121376,5359871,T,IEX,11.515000,100
2019-10-23 15:20:03.382355968,2019-10-23 15:20:03.382338438,5359875,T,IEX,11.515000,100
2019-10-23 15:20:03.383417088,2019-10-23 15:20:03.383399747,5359880,T,IEX,11.515000,100
2019-10-23 15:20:03.384550912,2019-10-23 15:20:03.384532377,5359885,T,IEX,11.515000,100
2019-10-23 15:20:03.387422976,2019-10-23 15:20:03.387404038,5359897,T,IEX,11.515000,100
2019-10-23 15:20:03.390001920,2019-10-23 15:20:03.389981929,5359910,T,IEX,11.515000,100
2019-10-23 15:20:03.391098880,2019-10-23 15:20:03.391080789,5359918,T,IEX,11.515000,100
2019-10-23 15:20:03.392183040,2019-10-23 15:20:03.392165885,5359921,T,IEX,11.515000,100
2019-10-23 15:20:03.393414912,2019-10-23 15:20:03.393397409,5359924,T,IEX,11.515000,100
2019-10-23 15:22:02.323232000,2019-10-23 15:22:02.323210058,5428377,T,IEX,11.520000,12000
2019-10-23 15:24:41.192001024,2019-10-23 15:24:41.191981458,5511139,T,IEX,11.530000,500
2019-10-23 15:24:57.543380992,2019-10-23 15:24:57.543362600,5522155,T,IEX,11.515000,1
2019-10-23 15:25:07.331635968,2019-10-23 15:25:07.331618276,5529555,T,IEX,11.520000,10000
2019-10-23 15:28:56.113392128,2019-10-23 15:28:56.113372848,5661738,T,IEX,11.510000,80
2019-10-23 15:32:02.277477120,2019-10-23 15:32:02.277454892,5767609,T,IEX,11.520000,100
2019-10-23 15:37:00.50011904,2019-10-23 15:37:00.49991574,5940170,T,IEX,11.485000,100
2019-10-23 15:38:50.525321984,2019-10-23 15:38:50.525304333,5987679,T,IEX,11.485000,100
2019-10-23 15:48:39.708912128,2019-10-23 15:48:39.708893092,6277393,T,IEX,11.515000,100
2019-10-23 15:51:24.354836992,2019-10-23 15:51:24.354815802,6356159,T,IEX,11.530000,400
2019-10-23 15:56:35.285455872,2019-10-23 15:56:35.285438536,6500617,T,IEX,11.540000,100
2019-10-23 15:56:45.5562112,2019-10-23 15:56:45.5544996,6505852,T,IEX,11.530000,400
2019-10-23 16:05:58.887294976,2019-10-23 16:05:58.887278248,6755729,T,IEX,11.510000,400
2019-10-23 16:15:45.474701056,2019-10-23 16:15:45.474681955,6998734,T,IEX,11.530000,100
2019-10-23 16:20:42.147951104,2019-10-23 16:20:42.147929776,7115258,T,IEX,11.540000,100
2019-10-23 16:20:48.761381888,2019-10-23 16:20:48.761361045,7116958,T,IEX,11.540000,100
2019-10-23 16:20:48.771972096,2019-10-23 16:20:48.771950110,7116966,T,IEX,11.540000,100
2019-10-23 16:20:59.601094912,2019-10-23 16:20:59.601074914,7122865,T,IEX,11.545000,100
2019-10-23 16:21:46.501459968,2019-10-23 16:21:46.501439037,7142922,T,IEX,11.540000,10000
2019-10-23 16:21:46.501480960,2019-10-23 16:21:46.501455149,7142923,T,IEX,11.540000,100
2019-10-23 16:21:46.514458880,2019-10-23 16:21:46.514438217,7142933,T,IEX,11.545000,1600
2019-10-23 16:22:45.916557056,2019-10-23 16:22:45.916540606,7166601,T,IEX,11.550000,200
2019-10-23 16:25:31.688978944,2019-10-23 16:25:31.688960711,7226171,T,IEX,11.560000,600
2019-10-23 16:25:44.751578880,2019-10-23 16:25:44.751559289,7232682,T,IEX,11.550000,400
2019-10-23 16:25:50.431506944,2019-10-23 16:25:50.431487636,7235314,T,IEX,11.550000,800
2019-10-23 16:26:42.524896000,2019-10-23 16:26:42.524873409,7255356,T,IEX,11.540000,300
2019-10-23 16:26:53.262803968,2019-10-23 16:26:53.262781557,7259079,T,IEX,11.540000,100
2019-10-23 16:26:53.497009920,2019-10-23 16:26:53.496991526,7259120,T,IEX,11.540000,100
2019-10-23 16:27:23.844248064,2019-10-23 16:27:23.844227482,7271625,T,IEX,11.550000,400
2019-10-23 16:27:30.552624128,2019-10-23 16:27:30.552606146,7275921,T,IEX,11.545000,100
2019-10-23 16:27:30.586049024,2019-10-23 16:27:30.586030197,7276030,T,IEX,11.540000,200
2019-10-23 16:27:32.976477952,2019-10-23 16:27:32.976457855,7277450,T,IEX,11.545000,500
2019-10-23 16:27:32.984453120,2019-10-23 16:27:32.984433521,7277455,T,IEX,11.545000,100
2019-10-23 16:27:34.562022912,2019-10-23 16:27:34.562001810,7277910,T,IEX,11.540000,500
2019-10-23 16:28:47.729358080,2019-10-23 16:28:47.729337265,7313474,T,IEX,11.540000,400
2019-10-23 16:30:06.914971904,2019-10-23 16:30:06.914950992,7346623,T,IEX,11.550000,100
2019-10-23 16:30:06.914980096,2019-10-23 16:30:06.914960511,7346624,T,IEX,11.550000,800
2019-10-23 16:38:11.34654976,2019-10-23 16:38:11.34639702,7550049,T,IEX,11.545000,16
2019-10-23 16:39:37.59549952,2019-10-23 16:39:37.59530395,7588376,T,IEX,11.560000,100
2019-10-23 16:58:10.604653056,2019-10-23 16:58:10.604629941,7995726,T,IEX,11.555000,112
2019-10-23 17:15:08.465860096,2019-10-23 17:15:08.465840087,8387773,T,IEX,11.560000,100
2019-10-23 17:18:45.436775936,2019-10-23 17:18:45.436754034,8458531,T,IEX,11.570000,100
2019-10-23 17:30:14.852918016,2019-10-23 17:30:14.852898388,8683741,T,IEX,11.600000,100
2019-10-23 17:30:17.228121088,2019-10-23 17:30:17.228101542,8684791,T,IEX,11.600000,100
2019-10-23 17:30:55.588252928,2019-10-23 17:30:55.588237335,8695254,T,IEX,11.595000,400
2019-10-23 17:32:00.343684096,2019-10-23 17:32:00.343663929,8717961,T,IEX,11.580000,300
2019-10-23 17:35:04.859564032,2019-10-23 17:35:04.859544808,8778013,T,IEX,11.600000,100
2019-10-23 17:35:05.863531008,2019-10-23 17:35:05.863509509,8778617,T,IEX,11.600000,100
2019-10-23 17:35:07.173445120,2019-10-23 17:35:07.173416375,8779206,T,IEX,11.600000,100
2019-10-23 17:36:02.250065920,2019-10-23 17:36:02.250049299,8798900,T,IEX,11.610000,100
2019-10-23 17:40:32.132785920,2019-10-23 17:40:32.132767292,8883972,T,IEX,11.620000,100
2019-10-23 17:41:12.48963072,2019-10-23 17:41:12.48940138,8894520,T,IEX,11.615000,100
2019-10-23 17:44:42.16784896,2019-10-23 17:44:42.16764806,8960483,T,IEX,11.610000,100
2019-10-23 17:48:08.259791104,2019-10-23 17:48:08.259770143,9033275,T,IEX,11.620000,300
2019-10-23 17:55:18.194742016,2019-10-23 17:55:18.194722905,9167455,T,IEX,11.630000,16
2019-10-23 17:56:01.510779904,2019-10-23 17:56:01.510761828,9180679,T,IEX,11.630000,100
2019-10-23 17:56:25.520569088,2019-10-23 17:56:25.520546232,9186439,T,IEX,11.630000,300
2019-10-23 17:57:00.48060928,2019-10-23 17:57:00.48040596,9195325,T,IEX,11.630000,10
2019-10-23 17:57:57.310350080,2019-10-23 17:57:57.310334978,9212964,T,IEX,11.635000,30
2019-10-23 17:59:27.69946112,2019-10-23 17:59:27.69929109,9243225,T,IEX,11.640000,1300
2019-10-23 17:59:27.69971968,2019-10-23 17:59:27.69955354,9243227,T,IEX,11.640000,1300
2019-10-23 17:59:27.963973120,2019-10-23 17:59:27.963952463,9243575,T,IEX,11.640000,7400
2019-10-23 18:02:42.547453952,2019-10-23 18:02:42.547433590,9331111,T,IEX,11.645000,300
2019-10-23 18:12:41.442682880,2019-10-23 18:12:41.442660064,9554797,T,IEX,11.685000,100
2019-10-23 18:24:38.969897984,2019-10-23 18:24:38.969877734,9857555,T,IEX,11.655000,150
2019-10-23 18:24:59.54464000,2019-10-23 18:24:59.54441743,9866010,T,IEX,11.655000,100
2019-10-23 18:35:34.488788992,2019-10-23 18:35:34.488766660,10133333,T,IEX,11.670000,100
2019-10-23 18:35:53.36730112,2019-10-23 18:35:53.36708436,10141462,T,IEX,11.670000,300
2019-10-23 18:35:53.47233024,2019-10-23 18:35:53.47215560,10141465,T,IEX,11.670000,300
2019-10-23 18:39:02.566734080,2019-10-23 18:39:02.566712016,10246576,T,IEX,11.670000,100
2019-10-23 18:40:03.816839936,2019-10-23 18:40:03.816817203,10279000,T,IEX,11.665000,100
2019-10-23 18:40:03.904465920,2019-10-23 18:40:03.904444727,10279017,T,IEX,11.665000,100
2019-10-23 18:40:03.924672000,2019-10-23 18:40:03.924646896,10279019,T,IEX,11.665000,100
2019-10-23 18:40:06.639395072,2019-10-23 18:40:06.639378227,10280217,T,IEX,11.665000,100
2019-10-23 18:40:06.646481920,2019-10-23 18:40:06.646464152,10280245,T,IEX,11.665000,200
2019-10-23 18:40:40.269456896,2019-10-23 18:40:40.269439696,10294251,T,IEX,11.665000,200
2019-10-23 18:42:25.124165888,2019-10-23 18:42:25.124148855,10338117,T,IEX,11.655000,100
2019-10-23 18:43:11.697487104,2019-10-23 18:43:11.697466869,10356289,T,IEX,11.655000,100
2019-10-23 18:43:38.766796032,2019-10-23 18:43:38.766774169,10365624,T,IEX,11.655000,100
2019-10-23 18:43:38.773082880,2019-10-23 18:43:38.773062157,10365626,T,IEX,11.655000,100
2019-10-23 18:43:43.307951104,2019-10-23 18:43:43.307930539,10367111,T,IEX,11.650000,100
2019-10-23 18:43:48.160546048,2019-10-23 18:43:48.160523942,10369326,T,IEX,11.655000,100
2019-10-23 18:44:15.512044032,2019-10-23 18:44:15.512024600,10379621,T,IEX,11.655000,200
2019-10-23 18:45:37.386604032,2019-10-23 18:45:37.386586192,10416454,T,IEX,11.665000,1100
2019-10-23 18:45:37.392481024,2019-10-23 18:45:37.392462513,10416472,T,IEX,11.665000,600
2019-10-23 18:45:40.194674944,2019-10-23 18:45:40.194652918,10417281,T,IEX,11.665000,100
2019-10-23 18:45:44.125562880,2019-10-23 18:45:44.125541652,10418409,T,IEX,11.665000,300
2019-10-23 18:45:44.131604992,2019-10-23 18:45:44.131584635,10418411,T,IEX,11.665000,300
2019-10-23 18:46:29.820899072,2019-10-23 18:46:29.820881754,10437188,T,IEX,11.655000,200
2019-10-23 18:46:29.829075968,2019-10-23 18:46:29.829055316,10437200,T,IEX,11.655000,200
2019-10-23 18:46:59.117488896,2019-10-23 18:46:59.117470917,10450135,T,IEX,11.655000,100
2019-10-23 18:47:04.559869952,2019-10-23 18:47:04.559848661,10453124,T,IEX,11.655000,300
2019-10-23 18:47:04.565850112,2019-10-23 18:47:04.565829938,10453127,T,IEX,11.655000,300
2019-10-23 18:47:07.607379968,2019-10-23 18:47:07.607359218,10454183,T,IEX,11.655000,300
2019-10-23 18:47:07.613276928,2019-10-23 18:47:07.613257802,10454184,T,IEX,11.655000,300
2019-10-23 18:50:02.962536960,2019-10-23 18:50:02.962518755,10520917,T,IEX,11.655000,500
2019-10-23 18:50:18.845936128,2019-10-23 18:50:18.845915024,10526803,T,IEX,11.655000,300
2019-10-23 18:50:18.852101888,2019-10-23 18:50:18.852081003,10526804,T,IEX,11.655000,300
2019-10-23 18:50:21.944403968,2019-10-23 18:50:21.944382275,10528025,T,IEX,11.655000,300
2019-10-23 18:50:21.950810880,2019-10-23 18:50:21.950792021,10528037,T,IEX,11.655000,300
2019-10-23 18:50:30.562369024,2019-10-23 18:50:30.562351710,10531113,T,IEX,11.655000,300
2019-10-23 18:50:30.568603904,2019-10-23 18:50:30.568584330,10531116,T,IEX,11.655000,300
2019-10-23 18:51:24.153189120,2019-10-23 18:51:24.153171310,10551835,T,IEX,11.645000,200
2019-10-23 18:51:36.136061952,2019-10-23 18:51:36.136044429,10556577,T,IEX,11.645000,200
2019-10-23 18:51:40.667636992,2019-10-23 18:51:40.667619911,10557898,T,IEX,11.650000,1000
2019-10-23 18:51:49.353463040,2019-10-23 18:51:49.353446564,10561328,T,IEX,11.645000,250
2019-10-23 18:52:02.885361920,2019-10-23 18:52:02.885341046,10566028,T,IEX,11.645000,250
2019-10-23 18:52:17.821905920,2019-10-23 18:52:17.821884431,10574684,T,IEX,11.640000,100
2019-10-23 18:52:36.522366976,2019-10-23 18:52:36.522344917,10582138,T,IEX,11.645000,100
2019-10-23 18:52:40.800802048,2019-10-23 18:52:40.800785161,10584729,T,IEX,11.645000,500
2019-10-23 18:53:54.685682944,2019-10-23 18:53:54.685662597,10614881,T,IEX,11.645000,100
2019-10-23 18:55:04.629824000,2019-10-23 18:55:04.629804463,10640837,T,IEX,11.655000,300
2019-10-23 18:55:15.19297024,2019-10-23 18:55:15.19275574,10643788,T,IEX,11.655000,300
2019-10-23 18:55:15.26658048,2019-10-23 18:55:15.26638140,10643790,T,IEX,11.655000,300
2019-10-23 18:55:15.518849024,2019-10-23 18:55:15.518829796,10643998,T,IEX,11.655000,200
2019-10-23 18:55:15.524334080,2019-10-23 18:55:15.524312735,10644001,T,IEX,11.655000,100
2019-10-23 19:01:24.144774912,2019-10-23 19:01:24.144753681,10785928,T,IEX,11.640000,100
2019-10-23 19:03:05.795344896,2019-10-23 19:03:05.795327773,10826154,T,IEX,11.635000,300
2019-10-23 19:04:25.691316992,2019-10-23 19:04:25.691298370,10858637,T,IEX,11.640000,1000
2019-10-23 19:04:27.785072896,2019-10-23 19:04:27.785054547,10860164,T,IEX,11.640000,1000
2019-10-23 19:06:05.808782080,2019-10-23 19:06:05.808762885,10891335,T,IEX,11.635000,5100
2019-10-23 19:09:57.24802048,2019-10-23 19:09:57.24780374,10973185,T,IEX,11.650000,100
2019-10-23 19:12:32.788317952,2019-10-23 19:12:32.788297344,11035313,T,IEX,11.650000,3100
2019-10-23 19:17:36.549501952,2019-10-23 19:17:36.549485319,11152952,T,IEX,11.650000,2400
2019-10-23 19:20:04.722176000,2019-10-23 19:20:04.722159424,11198536,T,IEX,11.645000,300
2019-10-23 19:26:35.67835904,2019-10-23 19:26:35.67815022,11344792,T,IEX,11.635000,700
2019-10-23 19:26:35.77742080,2019-10-23 19:26:35.77720229,11344799,T,IEX,11.635000,400
2019-10-23 19:26:35.87027968,2019-10-23 19:26:35.87005679,11344801,T,IEX,11.640000,3100
2019-10-23 19:28:32.851026944,2019-10-23 19:28:32.851007379,11387931,T,IEX,11.640000,900
2019-10-23 19:28:32.851038976,2019-10-23 19:28:32.851022889,11387932,T,IEX,11.640000,200
2019-10-23 19:29:21.814664960,2019-10-23 19:29:21.814641762,11404989,T,IEX,11.645000,100
2019-10-23 19:30:41.419661056,2019-10-23 19:30:41.419643125,11449346,T,IEX,11.650000,100
2019-10-23 19:36:39.884384000,2019-10-23 19:36:39.884359938,11628548,T,IEX,11.650000,2500
2019-10-23 19:38:16.509032960,2019-10-23 19:38:16.509010929,11680174,T,IEX,11.650000,500
2019-10-23 19:38:16.509042944,2019-10-23 19:38:16.509026208,11680175,T,IEX,11.650000,100
2019-10-23 19:38:16.509057024,2019-10-23 19:38:16.509041002,11680176,T,IEX,11.650000,2400
2019-10-23 19:40:36.72572928,2019-10-23 19:40:36.72555739,11754553,T,IEX,11.645000,700
2019-10-23 19:42:41.62522112,2019-10-23 19:42:41.62505165,11816054,T,IEX,11.645000,44
2019-10-23 19:43:14.68751104,2019-10-23 19:43:14.68729512,11831958,T,IEX,11.650000,1600
2019-10-23 19:43:15.270085888,2019-10-23 19:43:15.270064770,11832432,T,IEX,11.645000,100
2019-10-23 19:43:32.417990912,2019-10-23 19:43:32.417969735,11839222,T,IEX,11.650000,1000
2019-10-23 19:43:47.275053056,2019-10-23 19:43:47.275031485,11847554,T,IEX,11.650000,1100
2019-10-23 19:45:22.487365120,2019-10-23 19:45:22.487349542,11903261,T,IEX,11.645000,700
2019-10-23 19:46:08.940740096,2019-10-23 19:46:08.940720488,11934232,T,IEX,11.645000,6900
2019-10-23 19:46:36.288399104,2019-10-23 19:46:36.288378590,11950589,T,IEX,11.635000,100
2019-10-23 19:49:05.10439936,2019-10-23 19:49:05.10419113,12042830,T,IEX,11.640000,1100
2019-10-23 19:54:14.3024896,2019-10-23 19:54:14.3006089,12293088,T,IEX,11.645000,78
2019-10-23 19:57:01.254339072,2019-10-23 19:57:01.254321766,12461646,T,IEX,11.635000,3200
2019-10-23 19:57:25.821267968,2019-10-23 19:57:25.821249165,12487929,T,IEX,11.640000,1000
2019-10-23 19:59:21.563557120,2019-10-23 19:59:21.563538837,12629383,T,IEX,11.645000,100
