2019-10-23 13:30:20.735874048,2019-10-23 13:30:20.735850118,109888,T,IEX,21.120000,100
2019-10-23 13:31:42.670970880,2019-10-23 13:31:42.670948437,198573,T,IEX,21.030000,100
2019-10-23 13:33:29.861364992,2019-10-23 13:33:29.861348755,316104,T,IEX,21.060000,100
2019-10-23 13:33:29.874352896,2019-10-23 13:33:29.874333096,316123,T,IEX,21.060000,3
2019-10-23 13:33:31.451744000,2019-10-23 13:33:31.451724105,317868,T,IEX,21.060000,100
2019-10-23 13:33:31.451790080,2019-10-23 13:33:31.451774087,317871,T,IEX,21.060000,97
2019-10-23 13:33:57.532943872,2019-10-23 13:33:57.532924659,343461,T,IEX,21.090000,100
2019-10-23 13:34:09.339972096,2019-10-23 13:34:09.339953736,357999,T,IEX,21.070000,100
2019-10-23 13:34:35.852239104,2019-10-23 13:34:35.852223390,387242,T,IEX,21.030000,100
2019-10-23 13:35:00.744804096,2019-10-23 13:35:00.744786014,412246,T,IEX,21.080000,100
2019-10-23 13:35:00.744857088,2019-10-23 13:35:00.744840490,412247,T,IEX,21.080000,100
2019-10-23 13:35:01.870950912,2019-10-23 13:35:01.870931632,414554,T,IEX,21.070000,127
2019-10-23 13:35:01.871222016,2019-10-23 13:35:01.871204648,414567,T,IEX,21.070000,73
2019-10-23 13:35:04.673876992,2019-10-23 13:35:04.673858314,420458,T,IEX,21.080000,98
2019-10-23 13:35:05.759964928,2019-10-23 13:35:05.759941715,422015,T,IEX,21.075000,100
2019-10-23 13:35:05.760026112,2019-10-23 13:35:05.760008336,422017,T,IEX,21.075000,400
2019-10-23 13:35:42.572253952,2019-10-23 13:35:42.572233130,462069,T,IEX,21.095000,100
2019-10-23 13:35:50.12403968,2019-10-23 13:35:50.12386428,469979,T,IEX,21.100000,100
2019-10-23 13:36:09.665025024,2019-10-23 13:36:09.665005725,497544,T,IEX,21.100000,100
2019-10-23 13:36:09.665072896,2019-10-23 13:36:09.665055274,497549,T,IEX,21.100000,100
2019-10-23 13:36:28.90247936,2019-10-23 13:36:28.90228095,520802,T,IEX,21.095000,100
2019-10-23 13:36:38.871796992,2019-10-23 13:36:38.871778213,533172,T,IEX,21.110000,200
2019-10-23 13:36:46.575181056,2019-10-23 13:36:46.575163109,545154,T,IEX,21.150000,100
2019-10-23 13:36:48.704098048,2019-10-23 13:36:48.704081016,550487,T,IEX,21.165000,100
2019-10-23 13:36:50.23735040,2019-10-23 13:36:50.23715501,552823,T,IEX,21.155000,100
2019-10-23 13:36:50.994340096,2019-10-23 13:36:50.994323348,554093,T,IEX,21.160000,97
2019-10-23 13:36:51.345673984,2019-10-23 13:36:51.345654116,554603,T,IEX,21.165000,10
2019-10-23 13:36:51.362462976,2019-10-23 13:36:51.362443608,554611,T,IEX,21.165000,50
2019-10-23 13:36:51.976985088,2019-10-23 13:36:51.976968190,555130,T,IEX,21.160000,400
2019-10-23 13:37:02.273302016,2019-10-23 13:37:02.273281077,568873,T,IEX,21.170000,100
2019-10-23 13:37:02.273350912,2019-10-23 13:37:02.273334978,568874,T,IEX,21.170000,94
2019-10-23 13:37:28.215878912,2019-10-23 13:37:28.215859287,608305,T,IEX,21.085000,100
2019-10-23 13:37:40.995442944,2019-10-23 13:37:40.995425604,623282,T,IEX,21.080000,100
2019-10-23 13:38:20.90084096,2019-10-23 13:38:20.90061675,670111,T,IEX,21.045000,100
2019-10-23 13:38:33.181603072,2019-10-23 13:38:33.181585095,689547,T,IEX,21.020000,100
2019-10-23 13:38:35.843971072,2019-10-23 13:38:35.843952170,692760,T,IEX,21.025000,100
2019-10-23 13:38:35.844207104,2019-10-23 13:38:35.844191346,692763,T,IEX,21.025000,100
2019-10-23 13:39:05.597541888,2019-10-23 13:39:05.597523429,726653,T,IEX,20.980000,300
2019-10-23 13:39:16.853128960,2019-10-23 13:39:16.853112090,740324,T,IEX,20.970000,300
2019-10-23 13:39:16.853157120,2019-10-23 13:39:16.853139522,740325,T,IEX,20.970000,200
2019-10-23 13:39:42.432030976,2019-10-23 13:39:42.432013796,765027,T,IEX,20.985000,200
2019-10-23 13:39:55.431475968,2019-10-23 13:39:55.431453680,777403,T,IEX,20.995000,200
2019-10-23 13:39:55.790533888,2019-10-23 13:39:55.790513209,777627,T,IEX,20.995000,150
2019-10-23 13:39:55.790554880,2019-10-23 13:39:55.790538564,777628,T,IEX,20.995000,50
2019-10-23 13:40:01.177991936,2019-10-23 13:40:01.177971728,783701,T,IEX,20.990000,300
2019-10-23 13:40:01.178016000,2019-10-23 13:40:01.177998743,783702,T,IEX,20.990000,120
2019-10-23 13:40:09.110334976,2019-10-23 13:40:09.110315718,793084,T,IEX,20.995000,100
2019-10-23 13:40:09.115543040,2019-10-23 13:40:09.115523039,793088,T,IEX,20.995000,56
2019-10-23 13:42:07.365816064,2019-10-23 13:42:07.365797945,898669,T,IEX,20.960000,200
2019-10-23 13:42:21.350464000,2019-10-23 13:42:21.350447801,912945,T,IEX,20.960000,300
2019-10-23 13:42:21.350493952,2019-10-23 13:42:21.350477464,912946,T,IEX,20.960000,300
2019-10-23 13:43:02.263673088,2019-10-23 13:43:02.263655541,945648,T,IEX,20.960000,300
2019-10-23 13:43:02.263700992,2019-10-23 13:43:02.263684432,945649,T,IEX,20.960000,80
2019-10-23 13:43:25.251089920,2019-10-23 13:43:25.251070237,966047,T,IEX,20.960000,100
2019-10-23 13:44:05.851862016,2019-10-23 13:44:05.851842371,1002707,T,IEX,20.910000,100
2019-10-23 13:44:23.345161984,2019-10-23 13:44:23.345143850,1018227,T,IEX,20.920000,300
2019-10-23 13:45:00.682795008,2019-10-23 13:45:00.682774974,1048406,T,IEX,20.910000,300
2019-10-23 13:45:00.682820096,2019-10-23 13:45:00.682803397,1048407,T,IEX,20.910000,300
2019-10-23 13:45:14.671813888,2019-10-23 13:45:14.671777721,1064734,T,IEX,20.890000,200
2019-10-23 13:45:40.881362944,2019-10-23 13:45:40.881342914,1092163,T,IEX,20.890000,100
2019-10-23 13:45:44.670878976,2019-10-23 13:45:44.670861464,1094994,T,IEX,20.890000,200
2019-10-23 13:45:50.1228032,2019-10-23 13:45:50.1208015,1099221,T,IEX,20.890000,100
2019-10-23 13:45:56.57297920,2019-10-23 13:45:56.57276579,1104749,T,IEX,20.895000,100
2019-10-23 13:46:12.497914880,2019-10-23 13:46:12.497891119,1117365,T,IEX,20.870000,300
2019-10-23 13:46:29.187608064,2019-10-23 13:46:29.187588689,1132599,T,IEX,20.865000,100
2019-10-23 13:46:29.942252032,2019-10-23 13:46:29.942230900,1133195,T,IEX,20.865000,100
2019-10-23 13:46:29.942266880,2019-10-23 13:46:29.942250688,1133196,T,IEX,20.865000,200
2019-10-23 13:46:30.470094080,2019-10-23 13:46:30.470073678,1133801,T,IEX,20.865000,100
2019-10-23 13:46:37.3990016,2019-10-23 13:46:37.3962033,1138556,T,IEX,20.865000,200
2019-10-23 13:46:42.973016064,2019-10-23 13:46:42.972995163,1145387,T,IEX,20.855000,100
2019-10-23 13:47:03.254245888,2019-10-23 13:47:03.254226881,1162921,T,IEX,20.855000,100
2019-10-23 13:47:31.942135040,2019-10-23 13:47:31.942115602,1190299,T,IEX,20.845000,300
2019-10-23 13:47:31.942153984,2019-10-23 13:47:31.942134792,1190300,T,IEX,20.850000,300
2019-10-23 13:47:31.942169088,2019-10-23 13:47:31.942152725,1190301,T,IEX,20.850000,300
2019-10-23 13:47:48.842966016,2019-10-23 13:47:48.842948838,1207753,T,IEX,20.865000,300
2019-10-23 13:48:03.899965952,2019-10-23 13:48:03.899945043,1218763,T,IEX,20.890000,300
2019-10-23 13:48:03.899979008,2019-10-23 13:48:03.899961374,1218764,T,IEX,20.890000,300
2019-10-23 13:48:09.573624064,2019-10-23 13:48:09.573607348,1223897,T,IEX,20.885000,91
2019-10-23 13:48:11.598587904,2019-10-23 13:48:11.598570347,1225659,T,IEX,20.890000,100
2019-10-23 13:48:51.600174080,2019-10-23 13:48:51.600152257,1257739,T,IEX,20.900000,300
2019-10-23 13:48:51.600183040,2019-10-23 13:48:51.600165333,1257740,T,IEX,20.900000,300
2019-10-23 13:49:00.257963008,2019-10-23 13:49:00.257941412,1263610,T,IEX,20.900000,300
2019-10-23 13:49:30.191492096,2019-10-23 13:49:30.191473033,1286647,T,IEX,20.910000,300
2019-10-23 13:49:30.191505920,2019-10-23 13:49:30.191489402,1286648,T,IEX,20.910000,100
2019-10-23 13:49:49.998112000,2019-10-23 13:49:49.998090425,1302383,T,IEX,20.915000,200
2019-10-23 13:49:49.998120960,2019-10-23 13:49:49.998103220,1302384,T,IEX,20.915000,200
2019-10-23 13:49:49.998146048,2019-10-23 13:49:49.998128109,1302385,T,IEX,20.915000,100
2019-10-23 13:49:50.6569984,2019-10-23 13:49:50.6551661,1302395,T,IEX,20.915000,200
2019-10-23 13:49:56.99631104,2019-10-23 13:49:56.99613774,1306231,T,IEX,20.915000,20
2019-10-23 13:50:49.128229120,2019-10-23 13:50:49.128212469,1348404,T,IEX,20.910000,300
2019-10-23 13:50:49.128249088,2019-10-23 13:50:49.128231672,1348405,T,IEX,20.910000,300
2019-10-23 13:50:53.87688960,2019-10-23 13:50:53.87668334,1353941,T,IEX,20.900000,300
2019-10-23 13:51:13.635016960,2019-10-23 13:51:13.634997151,1374571,T,IEX,20.910000,100
2019-10-23 13:52:13.323804928,2019-10-23 13:52:13.323787307,1432989,T,IEX,20.865000,100
2019-10-23 13:52:14.51902976,2019-10-23 13:52:14.51884334,1433803,T,IEX,20.870000,100
2019-10-23 13:52:20.601240064,2019-10-23 13:52:20.601224150,1440423,T,IEX,20.890000,200
2019-10-23 13:52:25.528971008,2019-10-23 13:52:25.528952938,1444814,T,IEX,20.895000,200
2019-10-23 13:53:12.14989056,2019-10-23 13:53:12.14964607,1482531,T,IEX,20.875000,91
2019-10-23 13:53:37.58656000,2019-10-23 13:53:37.58640013,1503956,T,IEX,20.875000,300
2019-10-23 13:53:58.59857920,2019-10-23 13:53:58.59837292,1518474,T,IEX,20.875000,300
2019-10-23 13:54:01.230587904,2019-10-23 13:54:01.230570008,1522380,T,IEX,20.880000,100
2019-10-23 13:54:10.209420032,2019-10-23 13:54:10.209396575,1535358,T,IEX,20.855000,100
2019-10-23 13:54:23.86068992,2019-10-23 13:54:23.86046740,1549834,T,IEX,20.865000,155
2019-10-23 13:54:23.86081024,2019-10-23 13:54:23.86063394,1549835,T,IEX,20.860000,145
2019-10-23 13:54:29.84914944,2019-10-23 13:54:29.84894291,1554482,T,IEX,20.865000,100
2019-10-23 13:55:47.74685952,2019-10-23 13:55:47.74664531,1627186,T,IEX,20.895000,80
2019-10-23 13:55:48.51578880,2019-10-23 13:55:48.51562858,1627859,T,IEX,20.895000,43
2019-10-23 13:55:48.84687104,2019-10-23 13:55:48.84664601,1627886,T,IEX,20.895000,47
2019-10-23 13:55:57.62865920,2019-10-23 13:55:57.62845850,1634124,T,IEX,20.895000,200
2019-10-23 13:55:57.64976896,2019-10-23 13:55:57.64960465,1634128,T,IEX,20.895000,25
2019-10-23 13:55:57.81008896,2019-10-23 13:55:57.80990454,1634139,T,IEX,20.895000,75
2019-10-23 13:55:57.81027072,2019-10-23 13:55:57.81009881,1634140,T,IEX,20.895000,225
2019-10-23 13:57:11.93735936,2019-10-23 13:57:11.93706137,1702610,T,IEX,20.865000,200
2019-10-23 13:57:23.791015936,2019-10-23 13:57:23.790998641,1714640,T,IEX,20.875000,300
2019-10-23 13:57:44.111128064,2019-10-23 13:57:44.111111569,1734091,T,IEX,20.875000,300
2019-10-23 13:58:02.112023040,2019-10-23 13:58:02.112002990,1746655,T,IEX,20.870000,300
2019-10-23 13:58:53.998162944,2019-10-23 13:58:53.998142268,1789546,T,IEX,20.880000,300
2019-10-23 13:58:56.838077952,2019-10-23 13:58:56.838056210,1791345,T,IEX,20.875000,100
2019-10-23 13:59:02.117481984,2019-10-23 13:59:02.117465666,1795984,T,IEX,20.875000,200
2019-10-23 13:59:02.117502976,2019-10-23 13:59:02.117485676,1795985,T,IEX,20.870000,100
2019-10-23 13:59:37.139666944,2019-10-23 13:59:37.139649802,1830551,T,IEX,20.875000,100
2019-10-23 13:59:45.49755904,2019-10-23 13:59:45.49737334,1836684,T,IEX,20.870000,200
2019-10-23 14:00:04.5646080,2019-10-23 14:00:04.5624024,1851956,T,IEX,20.825000,100
2019-10-23 14:00:04.6867968,2019-10-23 14:00:04.6847759,1851984,T,IEX,20.825000,200
2019-10-23 14:00:04.8049920,2019-10-23 14:00:04.8030898,1851991,T,IEX,20.825000,100
2019-10-23 14:00:48.51792896,2019-10-23 14:00:48.51771403,1897831,T,IEX,20.860000,43
2019-10-23 14:01:02.490240000,2019-10-23 14:01:02.490220618,1913569,T,IEX,20.870000,300
2019-10-23 14:02:17.43105024,2019-10-23 14:02:17.43087172,1988311,T,IEX,20.845000,1100
2019-10-23 14:02:17.43123968,2019-10-23 14:02:17.43107448,1988312,T,IEX,20.845000,300
2019-10-23 14:02:17.43140096,2019-10-23 14:02:17.43122997,1988313,T,IEX,20.845000,400
2019-10-23 14:04:25.561095936,2019-10-23 14:04:25.561073882,2109719,T,IEX,20.805000,300
2019-10-23 14:04:25.561108992,2019-10-23 14:04:25.561091789,2109720,T,IEX,20.805000,200
2019-10-23 14:07:06.371101952,2019-10-23 14:07:06.371078902,2247538,T,IEX,20.850000,229
2019-10-23 14:07:52.525464064,2019-10-23 14:07:52.525447681,2276973,T,IEX,20.835000,200
2019-10-23 14:07:52.525485056,2019-10-23 14:07:52.525467803,2276974,T,IEX,20.835000,600
2019-10-23 14:08:04.204603904,2019-10-23 14:08:04.204583764,2288038,T,IEX,20.855000,92
2019-10-23 14:09:05.549458944,2019-10-23 14:09:05.549438921,2336612,T,IEX,20.865000,200
2019-10-23 14:09:08.654509056,2019-10-23 14:09:08.654487401,2340754,T,IEX,20.870000,300
2019-10-23 14:09:08.654519040,2019-10-23 14:09:08.654500903,2340755,T,IEX,20.870000,300
2019-10-23 14:10:03.507764992,2019-10-23 14:10:03.507747306,2387487,T,IEX,20.865000,121
2019-10-23 14:10:51.61918976,2019-10-23 14:10:51.61902456,2426564,T,IEX,20.850000,43
2019-10-23 14:10:51.986606080,2019-10-23 14:10:51.986590291,2427079,T,IEX,20.850000,300
2019-10-23 14:10:55.51002112,2019-10-23 14:10:55.50980469,2428696,T,IEX,20.845000,25
2019-10-23 14:11:21.420166912,2019-10-23 14:11:21.420149853,2452309,T,IEX,20.855000,200
2019-10-23 14:12:09.670466048,2019-10-23 14:12:09.670445577,2491856,T,IEX,20.840000,99
2019-10-23 14:15:02.58576896,2019-10-23 14:15:02.58558542,2619348,T,IEX,20.875000,100
2019-10-23 14:15:42.13163008,2019-10-23 14:15:42.13144187,2651795,T,IEX,20.865000,200
2019-10-23 14:15:42.13214976,2019-10-23 14:15:42.13195087,2651797,T,IEX,20.880000,300
2019-10-23 14:15:42.13229056,2019-10-23 14:15:42.13211064,2651798,T,IEX,20.880000,300
2019-10-23 14:15:42.31650048,2019-10-23 14:15:42.31632706,2651977,T,IEX,20.905000,100
2019-10-23 14:15:42.32779008,2019-10-23 14:15:42.32759905,2651982,T,IEX,20.905000,100
2019-10-23 14:15:42.38287104,2019-10-23 14:15:42.38267333,2651986,T,IEX,20.905000,100
2019-10-23 14:16:02.68307968,2019-10-23 14:16:02.68288055,2673417,T,IEX,20.915000,43
2019-10-23 14:16:06.157681920,2019-10-23 14:16:06.157652298,2676292,T,IEX,20.915000,700
2019-10-23 14:16:06.158287104,2019-10-23 14:16:06.158270068,2676307,T,IEX,20.915000,300
2019-10-23 14:16:06.158351872,2019-10-23 14:16:06.158334365,2676308,T,IEX,20.915000,100
2019-10-23 14:16:06.158845952,2019-10-23 14:16:06.158828985,2676324,T,IEX,20.915000,700
2019-10-23 14:16:06.159209984,2019-10-23 14:16:06.159193549,2676328,T,IEX,20.915000,400
2019-10-23 14:16:06.159271936,2019-10-23 14:16:06.159255763,2676330,T,IEX,20.915000,200
2019-10-23 14:16:08.899777024,2019-10-23 14:16:08.899755660,2678347,T,IEX,20.915000,700
2019-10-23 14:16:08.900089088,2019-10-23 14:16:08.900061767,2678365,T,IEX,20.915000,350
2019-10-23 14:16:09.763111936,2019-10-23 14:16:09.763092605,2679208,T,IEX,20.915000,700
2019-10-23 14:17:17.892250880,2019-10-23 14:17:17.892229106,2738497,T,IEX,20.965000,300
2019-10-23 14:17:22.119544064,2019-10-23 14:17:22.119524455,2741439,T,IEX,20.965000,200
2019-10-23 14:17:22.119557888,2019-10-23 14:17:22.119541501,2741440,T,IEX,20.965000,100
2019-10-23 14:17:27.526579968,2019-10-23 14:17:27.526562857,2744758,T,IEX,20.975000,200
2019-10-23 14:17:32.867686912,2019-10-23 14:17:32.867669575,2748091,T,IEX,20.970000,85
2019-10-23 14:17:32.883539968,2019-10-23 14:17:32.883518256,2748097,T,IEX,20.970000,215
2019-10-23 14:17:32.883550976,2019-10-23 14:17:32.883533735,2748098,T,IEX,20.970000,285
2019-10-23 14:17:34.79449088,2019-10-23 14:17:34.79419304,2749081,T,IEX,20.975000,200
2019-10-23 14:17:34.578268928,2019-10-23 14:17:34.578247392,2749850,T,IEX,20.975000,100
2019-10-23 14:17:40.772976896,2019-10-23 14:17:40.772959739,2752990,T,IEX,20.975000,200
2019-10-23 14:17:40.772994048,2019-10-23 14:17:40.772974980,2752991,T,IEX,20.970000,300
2019-10-23 14:17:40.773009920,2019-10-23 14:17:40.772992698,2752992,T,IEX,20.970000,85
2019-10-23 14:17:48.730091008,2019-10-23 14:17:48.730073803,2759439,T,IEX,20.970000,100
2019-10-23 14:17:48.732491008,2019-10-23 14:17:48.732473382,2759450,T,IEX,20.970000,10
2019-10-23 14:17:48.733412096,2019-10-23 14:17:48.733394536,2759455,T,IEX,20.970000,100
2019-10-23 14:18:09.361144064,2019-10-23 14:18:09.361126800,2776094,T,IEX,20.980000,300
2019-10-23 14:18:12.873648128,2019-10-23 14:18:12.873629803,2778423,T,IEX,20.980000,300
2019-10-23 14:18:12.873659904,2019-10-23 14:18:12.873642817,2778424,T,IEX,20.980000,300
2019-10-23 14:18:57.210443008,2019-10-23 14:18:57.210425146,2807453,T,IEX,20.945000,200
2019-10-23 14:18:57.210455040,2019-10-23 14:18:57.210438188,2807454,T,IEX,20.945000,200
2019-10-23 14:18:57.210475008,2019-10-23 14:18:57.210457738,2807455,T,IEX,20.945000,500
2019-10-23 14:19:12.935241984,2019-10-23 14:19:12.935222868,2818588,T,IEX,20.950000,300
2019-10-23 14:19:12.935277056,2019-10-23 14:19:12.935251842,2818590,T,IEX,20.950000,100
2019-10-23 14:19:23.276858112,2019-10-23 14:19:23.276840344,2826781,T,IEX,20.930000,85
2019-10-23 14:21:26.179422976,2019-10-23 14:21:26.179400206,2925838,T,IEX,20.900000,300
2019-10-23 14:21:26.179481088,2019-10-23 14:21:26.179459489,2925842,T,IEX,20.900000,100
2019-10-23 14:25:50.930180096,2019-10-23 14:25:50.930154922,3100086,T,IEX,20.915000,200
2019-10-23 14:25:50.930188032,2019-10-23 14:25:50.930169889,3100087,T,IEX,20.915000,500
2019-10-23 14:25:50.930204928,2019-10-23 14:25:50.930189364,3100088,T,IEX,20.915000,200
2019-10-23 14:26:38.378203904,2019-10-23 14:26:38.378187454,3134119,T,IEX,20.955000,200
2019-10-23 14:27:33.94255104,2019-10-23 14:27:33.94233800,3167429,T,IEX,20.920000,200
2019-10-23 14:27:34.846544896,2019-10-23 14:27:34.846524052,3168095,T,IEX,20.920000,300
2019-10-23 14:27:47.162042112,2019-10-23 14:27:47.162020810,3176865,T,IEX,20.920000,200
2019-10-23 14:28:31.317597952,2019-10-23 14:28:31.317579844,3209324,T,IEX,20.905000,100
2019-10-23 14:28:33.55621888,2019-10-23 14:28:33.55603644,3210967,T,IEX,20.905000,200
2019-10-23 14:28:36.491586048,2019-10-23 14:28:36.491564559,3212416,T,IEX,20.905000,500
2019-10-23 14:28:59.47271936,2019-10-23 14:28:59.47251778,3223717,T,IEX,20.900000,300
2019-10-23 14:29:14.174362112,2019-10-23 14:29:14.174345496,3232263,T,IEX,20.925000,100
2019-10-23 14:29:38.47005952,2019-10-23 14:29:38.46985201,3247337,T,IEX,20.910000,300
2019-10-23 14:29:48.424653056,2019-10-23 14:29:48.424634304,3252285,T,IEX,20.905000,200
2019-10-23 14:29:56.59419904,2019-10-23 14:29:56.59397345,3256624,T,IEX,20.910000,200
2019-10-23 14:30:06.49892096,2019-10-23 14:30:06.49873691,3273512,T,IEX,20.900000,200
2019-10-23 14:30:45.251923968,2019-10-23 14:30:45.251906021,3325096,T,IEX,20.885000,300
2019-10-23 14:30:45.251942912,2019-10-23 14:30:45.251925653,3325097,T,IEX,20.885000,200
2019-10-23 14:30:48.49582080,2019-10-23 14:30:48.49560643,3327770,T,IEX,20.890000,43
2019-10-23 14:31:20.798458880,2019-10-23 14:31:20.798442657,3361199,T,IEX,20.930000,200
2019-10-23 14:33:32.629935104,2019-10-23 14:33:32.629914807,3487923,T,IEX,20.930000,84
2019-10-23 14:33:38.172370944,2019-10-23 14:33:38.172349959,3492683,T,IEX,20.935000,200
2019-10-23 14:34:23.248935936,2019-10-23 14:34:23.248917215,3531185,T,IEX,20.930000,31
2019-10-23 14:35:03.78586112,2019-10-23 14:35:03.78561610,3563345,T,IEX,20.950000,300
2019-10-23 14:35:47.194413056,2019-10-23 14:35:47.194395823,3603854,T,IEX,20.995000,100
2019-10-23 14:35:49.588892928,2019-10-23 14:35:49.588877168,3605817,T,IEX,20.995000,428
2019-10-23 14:35:49.588920064,2019-10-23 14:35:49.588897194,3605820,T,IEX,21.000000,300
2019-10-23 14:35:49.588933888,2019-10-23 14:35:49.588915358,3605821,T,IEX,21.000000,200
2019-10-23 14:36:17.702561024,2019-10-23 14:36:17.702542990,3629789,T,IEX,21.010000,100
2019-10-23 14:36:29.86016,2019-10-23 14:36:29.69053,3637814,T,IEX,21.000000,83
2019-10-23 14:36:29.7878912,2019-10-23 14:36:29.7858668,3637832,T,IEX,21.000000,200
2019-10-23 14:36:33.447770880,2019-10-23 14:36:33.447749322,3641087,T,IEX,20.995000,200
2019-10-23 14:36:36.510554112,2019-10-23 14:36:36.510533352,3643038,T,IEX,20.990000,300
2019-10-23 14:36:44.323576064,2019-10-23 14:36:44.323555081,3647314,T,IEX,20.995000,100
2019-10-23 14:36:44.347363072,2019-10-23 14:36:44.347343008,3647322,T,IEX,21.000000,200
2019-10-23 14:36:44.351930880,2019-10-23 14:36:44.351911176,3647328,T,IEX,21.000000,100
2019-10-23 14:36:44.351947008,2019-10-23 14:36:44.351929815,3647329,T,IEX,21.000000,200
2019-10-23 14:36:44.354091008,2019-10-23 14:36:44.354071476,3647332,T,IEX,21.000000,100
2019-10-23 14:37:05.233500928,2019-10-23 14:37:05.233481685,3665299,T,IEX,20.990000,300
2019-10-23 14:37:16.825366016,2019-10-23 14:37:16.825346575,3674987,T,IEX,21.000000,16
2019-10-23 14:37:16.832474880,2019-10-23 14:37:16.832457017,3674992,T,IEX,21.000000,16
2019-10-23 14:37:16.841427968,2019-10-23 14:37:16.841408005,3674997,T,IEX,21.000000,16
2019-10-23 14:37:16.848680960,2019-10-23 14:37:16.848660710,3675001,T,IEX,21.000000,8
2019-10-23 14:37:16.856297984,2019-10-23 14:37:16.856278348,3675006,T,IEX,21.000000,8
2019-10-23 14:37:21.185007104,2019-10-23 14:37:21.184984530,3677728,T,IEX,21.000000,300
2019-10-23 14:37:21.185018112,2019-10-23 14:37:21.185000822,3677729,T,IEX,21.000000,100
2019-10-23 14:37:52.701025024,2019-10-23 14:37:52.701002744,3696248,T,IEX,21.000000,100
2019-10-23 14:39:25.40316928,2019-10-23 14:39:25.40296377,3765006,T,IEX,20.990000,300
2019-10-23 14:39:25.40327936,2019-10-23 14:39:25.40311572,3765007,T,IEX,20.990000,100
2019-10-23 14:39:40.90855936,2019-10-23 14:39:40.90833489,3777470,T,IEX,20.970000,100
2019-10-23 14:39:40.93582080,2019-10-23 14:39:40.93562404,3777473,T,IEX,20.970000,46
2019-10-23 14:39:45.407827968,2019-10-23 14:39:45.407809325,3782186,T,IEX,20.995000,100
2019-10-23 14:39:45.407840000,2019-10-23 14:39:45.407822465,3782187,T,IEX,20.995000,100
2019-10-23 14:39:45.407856128,2019-10-23 14:39:45.407839014,3782188,T,IEX,20.995000,200
2019-10-23 14:39:55.135344896,2019-10-23 14:39:55.135323978,3787603,T,IEX,21.000000,300
2019-10-23 14:39:55.135354880,2019-10-23 14:39:55.135337024,3787604,T,IEX,21.000000,300
2019-10-23 14:40:58.384604928,2019-10-23 14:40:58.384587834,3837492,T,IEX,20.990000,300
2019-10-23 14:40:58.384627968,2019-10-23 14:40:58.384604631,3837494,T,IEX,20.990000,300
2019-10-23 14:42:18.520442112,2019-10-23 14:42:18.520423693,3898022,T,IEX,20.935000,100
2019-10-23 14:42:21.39463936,2019-10-23 14:42:21.39446941,3899749,T,IEX,20.935000,100
2019-10-23 14:42:21.39478016,2019-10-23 14:42:21.39455836,3899750,T,IEX,20.935000,100
2019-10-23 14:42:21.39492096,2019-10-23 14:42:21.39475382,3899751,T,IEX,20.935000,100
2019-10-23 14:43:09.583319040,2019-10-23 14:43:09.583302644,3931695,T,IEX,20.925000,200
2019-10-23 14:43:12.503950080,2019-10-23 14:43:12.503931696,3933637,T,IEX,20.925000,100
2019-10-23 14:43:12.503973888,2019-10-23 14:43:12.503955336,3933639,T,IEX,20.925000,100
2019-10-23 14:43:12.504632064,2019-10-23 14:43:12.504614015,3933656,T,IEX,20.925000,100
2019-10-23 14:43:12.505620992,2019-10-23 14:43:12.505601936,3933683,T,IEX,20.925000,100
2019-10-23 14:43:12.506971904,2019-10-23 14:43:12.506953867,3933716,T,IEX,20.925000,100
2019-10-23 14:43:12.508047104,2019-10-23 14:43:12.508029994,3933726,T,IEX,20.925000,100
2019-10-23 14:43:12.509071104,2019-10-23 14:43:12.509053481,3933734,T,IEX,20.925000,100
2019-10-23 14:43:13.973586944,2019-10-23 14:43:13.973564613,3934623,T,IEX,20.925000,100
2019-10-23 14:43:25.913221120,2019-10-23 14:43:25.913203345,3941569,T,IEX,20.940000,39
2019-10-23 14:43:32.41527040,2019-10-23 14:43:32.41509576,3944533,T,IEX,20.930000,300
2019-10-23 14:43:32.41541120,2019-10-23 14:43:32.41525055,3944534,T,IEX,20.930000,100
2019-10-23 14:43:59.61164032,2019-10-23 14:43:59.61143487,3969186,T,IEX,20.940000,207
2019-10-23 14:44:10.41954048,2019-10-23 14:44:10.41935716,3976184,T,IEX,20.930000,300
2019-10-23 14:44:10.41971968,2019-10-23 14:44:10.41955230,3976185,T,IEX,20.930000,300
2019-10-23 14:44:17.676858880,2019-10-23 14:44:17.676838648,3981070,T,IEX,20.935000,200
2019-10-23 14:44:52.42950912,2019-10-23 14:44:52.42932920,4006504,T,IEX,20.910000,300
2019-10-23 14:45:01.380360960,2019-10-23 14:45:01.380335285,4011767,T,IEX,20.915000,100
2019-10-23 14:45:01.537496064,2019-10-23 14:45:01.537476544,4012128,T,IEX,20.915000,100
2019-10-23 14:45:07.986789888,2019-10-23 14:45:07.986763114,4019287,T,IEX,20.900000,300
2019-10-23 14:45:09.472617984,2019-10-23 14:45:09.472599272,4021696,T,IEX,20.885000,100
2019-10-23 14:46:08.642415104,2019-10-23 14:46:08.642397580,4070219,T,IEX,20.865000,200
2019-10-23 14:46:08.643604992,2019-10-23 14:46:08.643586572,4070226,T,IEX,20.865000,100
2019-10-23 14:46:13.725035008,2019-10-23 14:46:13.725014633,4075174,T,IEX,20.870000,100
2019-10-23 14:46:13.725307904,2019-10-23 14:46:13.725290422,4075175,T,IEX,20.870000,100
2019-10-23 14:46:13.726787072,2019-10-23 14:46:13.726766786,4075176,T,IEX,20.870000,100
2019-10-23 14:46:48.443588096,2019-10-23 14:46:48.443569758,4097983,T,IEX,20.885000,200
2019-10-23 14:48:16.536645888,2019-10-23 14:48:16.536626411,4160930,T,IEX,20.880000,92
2019-10-23 14:48:31.857897984,2019-10-23 14:48:31.857877608,4171246,T,IEX,20.870000,200
2019-10-23 14:48:35.50857984,2019-10-23 14:48:35.50836784,4172919,T,IEX,20.870000,100
2019-10-23 14:48:35.50874880,2019-10-23 14:48:35.50856768,4172920,T,IEX,20.870000,300
2019-10-23 14:49:07.265424896,2019-10-23 14:49:07.265408308,4191109,T,IEX,20.865000,100
2019-10-23 14:49:11.569059072,2019-10-23 14:49:11.569037338,4194792,T,IEX,20.860000,300
2019-10-23 14:49:13.254408960,2019-10-23 14:49:13.254387754,4195667,T,IEX,20.860000,200
2019-10-23 14:49:16.758938112,2019-10-23 14:49:16.758917249,4197801,T,IEX,20.860000,100
2019-10-23 14:49:42.778541056,2019-10-23 14:49:42.778520143,4211767,T,IEX,20.860000,100
2019-10-23 14:49:47.120750080,2019-10-23 14:49:47.120730558,4214351,T,IEX,20.860000,200
2019-10-23 14:49:53.914420992,2019-10-23 14:49:53.914401602,4217775,T,IEX,20.860000,100
2019-10-23 14:50:00.952188928,2019-10-23 14:50:00.952168880,4221467,T,IEX,20.870000,12
2019-10-23 14:50:00.952697088,2019-10-23 14:50:00.952676963,4221469,T,IEX,20.870000,88
2019-10-23 14:50:09.105520896,2019-10-23 14:50:09.105504629,4227879,T,IEX,20.880000,100
2019-10-23 14:51:09.920636928,2019-10-23 14:51:09.920621174,4269827,T,IEX,20.880000,92
2019-10-23 14:51:44.50170112,2019-10-23 14:51:44.50151418,4294050,T,IEX,20.855000,100
2019-10-23 14:52:08.900193024,2019-10-23 14:52:08.900174859,4311490,T,IEX,20.850000,60
2019-10-23 14:52:11.33412096,2019-10-23 14:52:11.33395125,4313310,T,IEX,20.860000,100
2019-10-23 14:52:44.73906944,2019-10-23 14:52:44.73886758,4336116,T,IEX,20.825000,200
2019-10-23 14:52:51.86616064,2019-10-23 14:52:51.86597752,4341688,T,IEX,20.825000,500
2019-10-23 14:54:13.821420032,2019-10-23 14:54:13.821401470,4407117,T,IEX,20.800000,13
2019-10-23 14:54:13.821549056,2019-10-23 14:54:13.821531326,4407123,T,IEX,20.800000,287
2019-10-23 14:54:13.821585920,2019-10-23 14:54:13.821550327,4407128,T,IEX,20.800000,300
2019-10-23 14:54:27.883297024,2019-10-23 14:54:27.883274955,4420009,T,IEX,20.805000,600
2019-10-23 14:54:27.883312128,2019-10-23 14:54:27.883294606,4420010,T,IEX,20.805000,100
2019-10-23 14:55:02.34394112,2019-10-23 14:55:02.34378231,4441748,T,IEX,20.800000,300
2019-10-23 14:55:02.34411008,2019-10-23 14:55:02.34394487,4441749,T,IEX,20.800000,200
2019-10-23 14:55:08.976823040,2019-10-23 14:55:08.976802122,4451254,T,IEX,20.815000,41
2019-10-23 14:56:12.948459008,2019-10-23 14:56:12.948440006,4491160,T,IEX,20.820000,100
2019-10-23 14:56:30.550899968,2019-10-23 14:56:30.550879182,4503860,T,IEX,20.845000,100
2019-10-23 14:56:40.503739904,2019-10-23 14:56:40.503721770,4508467,T,IEX,20.855000,100
2019-10-23 14:56:41.46192128,2019-10-23 14:56:41.46171552,4508635,T,IEX,20.855000,100
2019-10-23 14:56:41.46202112,2019-10-23 14:56:41.46181348,4508636,T,IEX,20.860000,300
2019-10-23 14:57:00.357409024,2019-10-23 14:57:00.357387911,4518673,T,IEX,20.850000,60
2019-10-23 14:57:07.968409088,2019-10-23 14:57:07.968385903,4523669,T,IEX,20.855000,50
2019-10-23 14:57:15.45602048,2019-10-23 14:57:15.45580618,4526689,T,IEX,20.855000,50
2019-10-23 14:57:15.45609984,2019-10-23 14:57:15.45589862,4526690,T,IEX,20.855000,50
2019-10-23 14:57:15.45620992,2019-10-23 14:57:15.45602966,4526691,T,IEX,20.855000,200
2019-10-23 14:57:55.42679040,2019-10-23 14:57:55.42658158,4553392,T,IEX,20.815000,200
2019-10-23 14:57:55.42694912,2019-10-23 14:57:55.42678042,4553393,T,IEX,20.815000,100
2019-10-23 14:58:25.538601984,2019-10-23 14:58:25.538580837,4579295,T,IEX,20.800000,92
2019-10-23 14:58:55.884108032,2019-10-23 14:58:55.884092107,4595656,T,IEX,20.805000,200
2019-10-23 14:59:02.780054016,2019-10-23 14:59:02.780033783,4600673,T,IEX,20.810000,300
2019-10-23 14:59:02.780064000,2019-10-23 14:59:02.780046477,4600674,T,IEX,20.810000,300
2019-10-23 14:59:12.44047104,2019-10-23 14:59:12.44026405,4607155,T,IEX,20.815000,100
2019-10-23 14:59:12.44064000,2019-10-23 14:59:12.44046566,4607156,T,IEX,20.820000,200
2019-10-23 14:59:34.47113984,2019-10-23 14:59:34.47095962,4620299,T,IEX,20.820000,300
2019-10-23 14:59:34.47131904,2019-10-23 14:59:34.47115837,4620300,T,IEX,20.820000,100
2019-10-23 15:00:52.43760896,2019-10-23 15:00:52.43741021,4678583,T,IEX,20.820000,100
2019-10-23 15:01:11.912589056,2019-10-23 15:01:11.912571170,4692303,T,IEX,20.830000,300
2019-10-23 15:03:03.285579008,2019-10-23 15:03:03.285561419,4765255,T,IEX,20.815000,100
2019-10-23 15:03:03.285619968,2019-10-23 15:03:03.285602972,4765256,T,IEX,20.815000,100
2019-10-23 15:04:16.817785088,2019-10-23 15:04:16.817766136,4808795,T,IEX,20.805000,100
2019-10-23 15:04:16.817803008,2019-10-23 15:04:16.817785628,4808796,T,IEX,20.805000,200
2019-10-23 15:04:16.817811968,2019-10-23 15:04:16.817794413,4808797,T,IEX,20.805000,400
2019-10-23 15:04:32.392518912,2019-10-23 15:04:32.392501095,4817379,T,IEX,20.815000,300
2019-10-23 15:04:38.41586944,2019-10-23 15:04:38.41565865,4820697,T,IEX,20.815000,100
2019-10-23 15:04:56.581861888,2019-10-23 15:04:56.581844127,4829939,T,IEX,20.805000,1
2019-10-23 15:06:49.994130944,2019-10-23 15:06:49.994111853,4891607,T,IEX,20.815000,100
2019-10-23 15:08:20.913145088,2019-10-23 15:08:20.913122781,4942163,T,IEX,20.820000,91
2019-10-23 15:08:51.768432128,2019-10-23 15:08:51.768414907,4958822,T,IEX,20.820000,9
2019-10-23 15:08:55.503662080,2019-10-23 15:08:55.503645000,4960100,T,IEX,20.830000,100
2019-10-23 15:11:28.636165120,2019-10-23 15:11:28.636132552,5050430,T,IEX,20.825000,200
2019-10-23 15:11:28.637638912,2019-10-23 15:11:28.637621284,5050487,T,IEX,20.825000,200
2019-10-23 15:11:28.665040896,2019-10-23 15:11:28.665019606,5050567,T,IEX,20.825000,300
2019-10-23 15:11:29.224271872,2019-10-23 15:11:29.224255998,5051192,T,IEX,20.825000,200
2019-10-23 15:11:29.811300096,2019-10-23 15:11:29.811282770,5051584,T,IEX,20.825000,200
2019-10-23 15:11:33.914877952,2019-10-23 15:11:33.914856887,5055012,T,IEX,20.825000,200
2019-10-23 15:13:08.738238976,2019-10-23 15:13:08.738218983,5108946,T,IEX,20.815000,100
2019-10-23 15:14:24.461720064,2019-10-23 15:14:24.461699318,5159243,T,IEX,20.815000,100
2019-10-23 15:14:24.461736960,2019-10-23 15:14:24.461719238,5159244,T,IEX,20.810000,300
2019-10-23 15:14:24.461755904,2019-10-23 15:14:24.461739247,5159245,T,IEX,20.810000,300
2019-10-23 15:14:24.461768960,2019-10-23 15:14:24.461752009,5159246,T,IEX,20.810000,100
2019-10-23 15:14:44.574330112,2019-10-23 15:14:44.574311033,5168797,T,IEX,20.815000,100
2019-10-23 15:15:50.254866944,2019-10-23 15:15:50.254848703,5209564,T,IEX,20.805000,100
2019-10-23 15:15:50.308160000,2019-10-23 15:15:50.308139977,5209596,T,IEX,20.810000,92
2019-10-23 15:15:56.51397120,2019-10-23 15:15:56.51378621,5212930,T,IEX,20.805000,100
2019-10-23 15:16:10.308576000,2019-10-23 15:16:10.308560489,5222134,T,IEX,20.795000,100
2019-10-23 15:16:21.39750912,2019-10-23 15:16:21.39727694,5227807,T,IEX,20.790000,100
2019-10-23 15:16:24.51671040,2019-10-23 15:16:24.51648753,5229014,T,IEX,20.790000,300
2019-10-23 15:16:37.170512896,2019-10-23 15:16:37.170493806,5236308,T,IEX,20.780000,200
2019-10-23 15:16:49.328519936,2019-10-23 15:16:49.328500160,5244790,T,IEX,20.745000,800
2019-10-23 15:16:49.328538880,2019-10-23 15:16:49.328521355,5244791,T,IEX,20.745000,100
2019-10-23 15:17:15.84154112,2019-10-23 15:17:15.84137160,5263826,T,IEX,20.755000,100
2019-10-23 15:17:48.600788992,2019-10-23 15:17:48.600765316,5285462,T,IEX,20.755000,100
2019-10-23 15:17:48.600803072,2019-10-23 15:17:48.600785952,5285463,T,IEX,20.755000,700
2019-10-23 15:18:00.747424000,2019-10-23 15:18:00.747402239,5292273,T,IEX,20.755000,100
2019-10-23 15:18:31.350405120,2019-10-23 15:18:31.350387458,5310493,T,IEX,20.740000,100
2019-10-23 15:18:31.350425088,2019-10-23 15:18:31.350408088,5310494,T,IEX,20.740000,100
2019-10-23 15:18:31.350439936,2019-10-23 15:18:31.350423316,5310495,T,IEX,20.740000,800
2019-10-23 15:18:31.858546944,2019-10-23 15:18:31.858526415,5310813,T,IEX,20.735000,100
2019-10-23 15:18:35.510942976,2019-10-23 15:18:35.510919533,5312221,T,IEX,20.740000,300
2019-10-23 15:18:35.510950912,2019-10-23 15:18:35.510932654,5312222,T,IEX,20.740000,300
2019-10-23 15:18:36.100084992,2019-10-23 15:18:36.100063710,5312520,T,IEX,20.740000,300
2019-10-23 15:18:36.100094976,2019-10-23 15:18:36.100076775,5312521,T,IEX,20.740000,300
2019-10-23 15:18:46.285765120,2019-10-23 15:18:46.285746167,5317135,T,IEX,20.745000,100
2019-10-23 15:19:13.830472960,2019-10-23 15:19:13.830456331,5332260,T,IEX,20.755000,100
2019-10-23 15:19:25.135931904,2019-10-23 15:19:25.135911621,5338109,T,IEX,20.765000,100
2019-10-23 15:20:30.248622080,2019-10-23 15:20:30.248602362,5374140,T,IEX,20.795000,400
2019-10-23 15:20:35.327042048,2019-10-23 15:20:35.327020970,5376860,T,IEX,20.775000,100
2019-10-23 15:20:52.981612032,2019-10-23 15:20:52.981593588,5388454,T,IEX,20.785000,200
2019-10-23 15:20:52.981626112,2019-10-23 15:20:52.981610100,5388455,T,IEX,20.780000,300
2019-10-23 15:20:52.981641984,2019-10-23 15:20:52.981623338,5388456,T,IEX,20.780000,300
2019-10-23 15:20:55.328306944,2019-10-23 15:20:55.328289846,5390260,T,IEX,20.775000,200
2019-10-23 15:20:55.328316928,2019-10-23 15:20:55.328299447,5390261,T,IEX,20.775000,200
2019-10-23 15:21:01.948190976,2019-10-23 15:21:01.948172188,5395037,T,IEX,20.765000,200
2019-10-23 15:21:14.144807936,2019-10-23 15:21:14.144781038,5401497,T,IEX,20.765000,200
2019-10-23 15:21:50.502927872,2019-10-23 15:21:50.502906430,5420271,T,IEX,20.765000,200
2019-10-23 15:21:52.564642048,2019-10-23 15:21:52.564623210,5421949,T,IEX,20.765000,100
2019-10-23 15:21:52.565135104,2019-10-23 15:21:52.565114959,5421965,T,IEX,20.770000,100
2019-10-23 15:21:52.565148928,2019-10-23 15:21:52.565130100,5421966,T,IEX,20.770000,100
2019-10-23 15:22:27.930556928,2019-10-23 15:22:27.930537462,5442603,T,IEX,20.785000,200
2019-10-23 15:22:27.930577920,2019-10-23 15:22:27.930557152,5442606,T,IEX,20.785000,800
2019-10-23 15:22:27.930587904,2019-10-23 15:22:27.930566358,5442607,T,IEX,20.785000,60
2019-10-23 15:22:27.930604032,2019-10-23 15:22:27.930585624,5442608,T,IEX,20.785000,200
2019-10-23 15:22:27.930612992,2019-10-23 15:22:27.930596267,5442609,T,IEX,20.780000,300
2019-10-23 15:22:27.930632960,2019-10-23 15:22:27.930615587,5442611,T,IEX,20.780000,300
2019-10-23 15:22:27.946106880,2019-10-23 15:22:27.946085507,5442703,T,IEX,20.780000,4
2019-10-23 15:22:47.335702016,2019-10-23 15:22:47.335681704,5453014,T,IEX,20.765000,200
2019-10-23 15:22:52.589038080,2019-10-23 15:22:52.589021110,5455014,T,IEX,20.765000,200
2019-10-23 15:23:14.883539968,2019-10-23 15:23:14.883522170,5467588,T,IEX,20.765000,100
2019-10-23 15:23:48.843681024,2019-10-23 15:23:48.843663298,5483418,T,IEX,20.770000,100
2019-10-23 15:24:22.420624896,2019-10-23 15:24:22.420607112,5501338,T,IEX,20.795000,73
2019-10-23 15:25:01.640733952,2019-10-23 15:25:01.640715280,5525620,T,IEX,20.815000,60
2019-10-23 15:25:03.660357120,2019-10-23 15:25:03.660338009,5526919,T,IEX,20.815000,340
2019-10-23 15:25:17.823695872,2019-10-23 15:25:17.823678868,5536113,T,IEX,20.815000,100
2019-10-23 15:25:19.493421056,2019-10-23 15:25:19.493401365,5536641,T,IEX,20.815000,100
2019-10-23 15:25:25.207943936,2019-10-23 15:25:25.207923569,5540571,T,IEX,20.815000,100
2019-10-23 15:25:26.375063040,2019-10-23 15:25:26.375044505,5541696,T,IEX,20.815000,100
2019-10-23 15:25:26.376224000,2019-10-23 15:25:26.376207113,5541722,T,IEX,20.815000,100
2019-10-23 15:25:26.381476096,2019-10-23 15:25:26.381457606,5541753,T,IEX,20.815000,100
2019-10-23 15:25:32.502733056,2019-10-23 15:25:32.502710061,5546003,T,IEX,20.815000,200
2019-10-23 15:25:32.502769920,2019-10-23 15:25:32.502743756,5546006,T,IEX,20.815000,60
2019-10-23 15:25:34.869249024,2019-10-23 15:25:34.869231820,5548431,T,IEX,20.825000,300
2019-10-23 15:25:38.146814976,2019-10-23 15:25:38.146790554,5550830,T,IEX,20.825000,200
2019-10-23 15:25:38.149617920,2019-10-23 15:25:38.149600463,5550875,T,IEX,20.825000,100
2019-10-23 15:25:38.151033088,2019-10-23 15:25:38.151013714,5550879,T,IEX,20.825000,100
2019-10-23 15:25:38.468762112,2019-10-23 15:25:38.468734424,5551204,T,IEX,20.825000,200
2019-10-23 15:25:38.471589888,2019-10-23 15:25:38.471572326,5551294,T,IEX,20.825000,100
2019-10-23 15:25:39.556765952,2019-10-23 15:25:39.556745434,5552201,T,IEX,20.825000,200
2019-10-23 15:25:44.153406976,2019-10-23 15:25:44.153390812,5555069,T,IEX,20.825000,100
2019-10-23 15:25:45.678956032,2019-10-23 15:25:45.678935084,5556866,T,IEX,20.815000,100
2019-10-23 15:26:30.430726912,2019-10-23 15:26:30.430709395,5584020,T,IEX,20.795000,200
2019-10-23 15:26:53.998652928,2019-10-23 15:26:53.998635842,5596781,T,IEX,20.800000,100
2019-10-23 15:27:54.69392896,2019-10-23 15:27:54.69370364,5628919,T,IEX,20.805000,60
2019-10-23 15:27:54.69399040,2019-10-23 15:27:54.69379731,5628920,T,IEX,20.805000,40
2019-10-23 15:28:27.857554944,2019-10-23 15:28:27.857533843,5646384,T,IEX,20.815000,100
2019-10-23 15:28:48.310055936,2019-10-23 15:28:48.310038658,5657021,T,IEX,20.800000,40
2019-10-23 15:28:53.930946048,2019-10-23 15:28:53.930923265,5660436,T,IEX,20.795000,100
2019-10-23 15:29:36.856868096,2019-10-23 15:29:36.856845387,5680833,T,IEX,20.805000,100
2019-10-23 15:29:59.600539904,2019-10-23 15:29:59.600520197,5694027,T,IEX,20.795000,100
2019-10-23 15:31:00.464176896,2019-10-23 15:31:00.464156083,5738629,T,IEX,20.805000,100
2019-10-23 15:31:00.472687104,2019-10-23 15:31:00.472666166,5738631,T,IEX,20.805000,100
2019-10-23 15:31:00.472696064,2019-10-23 15:31:00.472675533,5738632,T,IEX,20.805000,200
2019-10-23 15:34:11.817203968,2019-10-23 15:34:11.817187612,5847902,T,IEX,20.800000,183
2019-10-23 15:35:42.375686912,2019-10-23 15:35:42.375668707,5904183,T,IEX,20.775000,200
2019-10-23 15:36:03.137204992,2019-10-23 15:36:03.137187512,5915200,T,IEX,20.770000,91
2019-10-23 15:36:37.312665088,2019-10-23 15:36:37.312645564,5930614,T,IEX,20.775000,600
2019-10-23 15:36:48.745651968,2019-10-23 15:36:48.745633610,5935668,T,IEX,20.780000,200
2019-10-23 15:37:53.211852032,2019-10-23 15:37:53.211825090,5961634,T,IEX,20.775000,400
2019-10-23 15:37:57.517467904,2019-10-23 15:37:57.517437655,5963568,T,IEX,20.775000,300
2019-10-23 15:38:05.146451968,2019-10-23 15:38:05.146434448,5966836,T,IEX,20.770000,300
2019-10-23 15:38:05.146465024,2019-10-23 15:38:05.146447971,5966837,T,IEX,20.770000,100
2019-10-23 15:42:29.477393920,2019-10-23 15:42:29.477368023,6101626,T,IEX,20.750000,40
2019-10-23 15:44:43.174163968,2019-10-23 15:44:43.174147010,6168230,T,IEX,20.770000,81
2019-10-23 15:44:43.174264064,2019-10-23 15:44:43.174247352,6168233,T,IEX,20.770000,19
2019-10-23 15:45:35.609364992,2019-10-23 15:45:35.609348728,6196714,T,IEX,20.750000,92
2019-10-23 15:45:48.187211008,2019-10-23 15:45:48.187189466,6201349,T,IEX,20.750000,300
2019-10-23 15:46:47.661626880,2019-10-23 15:46:47.661608853,6224418,T,IEX,20.745000,300
2019-10-23 15:46:47.661637888,2019-10-23 15:46:47.661622408,6224419,T,IEX,20.745000,100
2019-10-23 15:47:37.613989888,2019-10-23 15:47:37.613967491,6245289,T,IEX,20.745000,91
2019-10-23 15:48:14.202979072,2019-10-23 15:48:14.202957634,6261492,T,IEX,20.750000,37
2019-10-23 15:48:16.194661888,2019-10-23 15:48:16.194644707,6263066,T,IEX,20.750000,263
2019-10-23 15:48:16.194674944,2019-10-23 15:48:16.194657696,6263067,T,IEX,20.750000,237
2019-10-23 15:51:35.56485888,2019-10-23 15:51:35.56466016,6360986,T,IEX,20.770000,37
2019-10-23 15:51:48.248064,2019-10-23 15:51:48.228993,6366418,T,IEX,20.780000,300
2019-10-23 15:51:48.2576896,2019-10-23 15:51:48.2559050,6366465,T,IEX,20.770000,300
2019-10-23 15:51:48.2595072,2019-10-23 15:51:48.2572799,6366467,T,IEX,20.770000,100
2019-10-23 15:52:12.787275008,2019-10-23 15:52:12.787256047,6378917,T,IEX,20.800000,300
2019-10-23 15:52:12.787288064,2019-10-23 15:52:12.787269062,6378918,T,IEX,20.800000,300
2019-10-23 15:52:56.436985088,2019-10-23 15:52:56.436964082,6399585,T,IEX,20.815000,200
2019-10-23 15:52:56.437001984,2019-10-23 15:52:56.436983436,6399586,T,IEX,20.810000,300
2019-10-23 15:52:56.437015040,2019-10-23 15:52:56.436997719,6399587,T,IEX,20.810000,100
2019-10-23 15:52:56.446926080,2019-10-23 15:52:56.446907762,6399593,T,IEX,20.810000,200
2019-10-23 15:54:30.269425920,2019-10-23 15:54:30.269405191,6442979,T,IEX,20.815000,200
2019-10-23 15:54:50.591776000,2019-10-23 15:54:50.591754873,6452702,T,IEX,20.820000,300
2019-10-23 15:54:50.591792128,2019-10-23 15:54:50.591774425,6452703,T,IEX,20.820000,300
2019-10-23 15:54:56.542170880,2019-10-23 15:54:56.542153594,6455084,T,IEX,20.820000,300
2019-10-23 15:54:56.542183936,2019-10-23 15:54:56.542166600,6455085,T,IEX,20.820000,187
2019-10-23 15:54:56.549138944,2019-10-23 15:54:56.549119233,6455089,T,IEX,20.820000,113
2019-10-23 15:54:56.549148928,2019-10-23 15:54:56.549128496,6455090,T,IEX,20.820000,187
2019-10-23 15:57:11.398192896,2019-10-23 15:57:11.398170955,6517632,T,IEX,20.810000,100
2019-10-23 15:57:11.398209024,2019-10-23 15:57:11.398188601,6517633,T,IEX,20.810000,100
2019-10-23 15:57:43.796453120,2019-10-23 15:57:43.796435725,6532547,T,IEX,20.815000,100
2019-10-23 15:58:23.145334016,2019-10-23 15:58:23.145316078,6549040,T,IEX,20.815000,100
2019-10-23 15:58:23.145351936,2019-10-23 15:58:23.145335204,6549041,T,IEX,20.815000,100
2019-10-23 15:59:01.375842048,2019-10-23 15:59:01.375824573,6564776,T,IEX,20.820000,300
2019-10-23 15:59:01.375860992,2019-10-23 15:59:01.375844805,6564777,T,IEX,20.820000,300
2019-10-23 15:59:39.959069952,2019-10-23 15:59:39.959052192,6584252,T,IEX,20.835000,100
2019-10-23 15:59:43.854753024,2019-10-23 15:59:43.854733151,6587528,T,IEX,20.835000,50
2019-10-23 16:00:33.685952000,2019-10-23 16:00:33.685930492,6614263,T,IEX,20.835000,150
2019-10-23 16:00:45.287101952,2019-10-23 16:00:45.287081675,6618303,T,IEX,20.830000,300
2019-10-23 16:00:50.997647104,2019-10-23 16:00:50.997626796,6620661,T,IEX,20.830000,300
2019-10-23 16:04:14.83311104,2019-10-23 16:04:14.83291350,6714791,T,IEX,20.805000,200
2019-10-23 16:04:14.83329024,2019-10-23 16:04:14.83310280,6714792,T,IEX,20.805000,100
2019-10-23 16:05:02.37647872,2019-10-23 16:05:02.37629450,6732853,T,IEX,20.815000,300
2019-10-23 16:06:55.791496960,2019-10-23 16:06:55.791476448,6781816,T,IEX,20.835000,100
2019-10-23 16:08:01.638658048,2019-10-23 16:08:01.638640836,6808817,T,IEX,20.830000,100
2019-10-23 16:08:01.781733120,2019-10-23 16:08:01.781711170,6809056,T,IEX,20.840000,64
2019-10-23 16:08:01.783075072,2019-10-23 16:08:01.783053094,6809086,T,IEX,20.845000,36
2019-10-23 16:10:05.732114944,2019-10-23 16:10:05.732097040,6862505,T,IEX,20.865000,100
2019-10-23 16:10:05.774757888,2019-10-23 16:10:05.774739968,6862559,T,IEX,20.870000,100
2019-10-23 16:10:55.403247104,2019-10-23 16:10:55.403226279,6883845,T,IEX,20.855000,200
2019-10-23 16:13:20.211462912,2019-10-23 16:13:20.211444826,6941516,T,IEX,20.830000,200
2019-10-23 16:13:47.688122112,2019-10-23 16:13:47.688093138,6950861,T,IEX,20.855000,100
2019-10-23 16:13:58.164742912,2019-10-23 16:13:58.164723164,6956479,T,IEX,20.830000,200
2019-10-23 16:13:58.164751104,2019-10-23 16:13:58.164729763,6956480,T,IEX,20.830000,200
2019-10-23 16:15:14.698544896,2019-10-23 16:15:14.698528358,6986677,T,IEX,20.805000,100
2019-10-23 16:16:04.928283904,2019-10-23 16:16:04.928265077,7006820,T,IEX,20.815000,100
2019-10-23 16:17:53.119656960,2019-10-23 16:17:53.119638093,7051994,T,IEX,20.805000,100
2019-10-23 16:20:58.632975872,2019-10-23 16:20:58.632953024,7122456,T,IEX,20.805000,200
2019-10-23 16:22:27.32923904,2019-10-23 16:22:27.32902859,7159432,T,IEX,20.840000,65
2019-10-23 16:23:08.31140096,2019-10-23 16:23:08.31119061,7175007,T,IEX,20.845000,200
2019-10-23 16:25:44.62859008,2019-10-23 16:25:44.62837615,7232354,T,IEX,20.855000,100
2019-10-23 16:27:30.595577088,2019-10-23 16:27:30.595558925,7276132,T,IEX,20.880000,92
2019-10-23 16:28:29.357181952,2019-10-23 16:28:29.357165258,7305389,T,IEX,20.890000,400
2019-10-23 16:28:52.387930880,2019-10-23 16:28:52.387913381,7315023,T,IEX,20.890000,1
2019-10-23 16:29:19.408773120,2019-10-23 16:29:19.408754002,7325883,T,IEX,20.890000,300
2019-10-23 16:29:19.518302976,2019-10-23 16:29:19.518281304,7326018,T,IEX,20.890000,384
2019-10-23 16:29:41.59798016,2019-10-23 16:29:41.59776520,7333798,T,IEX,20.890000,300
2019-10-23 16:29:41.59808000,2019-10-23 16:29:41.59789502,7333799,T,IEX,20.890000,285
2019-10-23 16:29:50.296605952,2019-10-23 16:29:50.296584585,7337955,T,IEX,20.885000,300
2019-10-23 16:30:49.988250112,2019-10-23 16:30:49.988231559,7369112,T,IEX,20.850000,300
2019-10-23 16:30:52.755653888,2019-10-23 16:30:52.755637410,7370943,T,IEX,20.840000,300
2019-10-23 16:30:52.755667968,2019-10-23 16:30:52.755650487,7370944,T,IEX,20.840000,100
2019-10-23 16:31:16.470788096,2019-10-23 16:31:16.470767535,7381030,T,IEX,20.825000,200
2019-10-23 16:31:55.237218048,2019-10-23 16:31:55.237197847,7400928,T,IEX,20.820000,100
2019-10-23 16:33:07.879232000,2019-10-23 16:33:07.879210363,7430628,T,IEX,20.825000,100
2019-10-23 16:33:17.812340992,2019-10-23 16:33:17.812319754,7434804,T,IEX,20.820000,200
2019-10-23 16:33:24.208506880,2019-10-23 16:33:24.208486447,7437194,T,IEX,20.820000,200
2019-10-23 16:33:56.138585088,2019-10-23 16:33:56.138563919,7450383,T,IEX,20.810000,200
2019-10-23 16:34:22.811544064,2019-10-23 16:34:22.811524960,7459536,T,IEX,20.815000,200
2019-10-23 16:34:34.223425024,2019-10-23 16:34:34.223408769,7464997,T,IEX,20.810000,50
2019-10-23 16:34:55.39172096,2019-10-23 16:34:55.39151179,7473303,T,IEX,20.810000,300
2019-10-23 16:34:55.39180032,2019-10-23 16:34:55.39160947,7473304,T,IEX,20.810000,100
2019-10-23 16:35:02.39557120,2019-10-23 16:35:02.39535842,7476752,T,IEX,20.815000,100
2019-10-23 16:35:34.530435072,2019-10-23 16:35:34.530415277,7489471,T,IEX,20.810000,300
2019-10-23 16:35:34.530448896,2019-10-23 16:35:34.530431493,7489472,T,IEX,20.810000,300
2019-10-23 16:35:34.530464000,2019-10-23 16:35:34.530446306,7489473,T,IEX,20.810000,200
2019-10-23 16:35:44.216167936,2019-10-23 16:35:44.216151187,7494277,T,IEX,20.810000,300
2019-10-23 16:35:44.216187904,2019-10-23 16:35:44.216171154,7494278,T,IEX,20.810000,300
2019-10-23 16:37:24.225577984,2019-10-23 16:37:24.225557375,7533618,T,IEX,20.810000,100
2019-10-23 16:38:00.625442048,2019-10-23 16:38:00.625421919,7545438,T,IEX,20.810000,92
2019-10-23 16:39:21.568119040,2019-10-23 16:39:21.568098594,7582492,T,IEX,20.785000,300
2019-10-23 16:40:13.100335104,2019-10-23 16:40:13.100318823,7608417,T,IEX,20.770000,300
2019-10-23 16:40:13.100357120,2019-10-23 16:40:13.100340676,7608418,T,IEX,20.770000,120
2019-10-23 16:40:13.129276928,2019-10-23 16:40:13.129255977,7608439,T,IEX,20.770000,100
2019-10-23 16:41:14.515962880,2019-10-23 16:41:14.515945479,7636883,T,IEX,20.775000,100
2019-10-23 16:41:37.384198912,2019-10-23 16:41:37.384177823,7643767,T,IEX,20.775000,100
2019-10-23 16:41:59.647597056,2019-10-23 16:41:59.647576457,7652281,T,IEX,20.770000,60
2019-10-23 16:43:29.683634944,2019-10-23 16:43:29.683616793,7686848,T,IEX,20.815000,300
2019-10-23 16:43:46.367219968,2019-10-23 16:43:46.367199633,7692588,T,IEX,20.815000,100
2019-10-23 16:44:52.695631872,2019-10-23 16:44:52.695610276,7716740,T,IEX,20.800000,100
2019-10-23 16:45:50.56740096,2019-10-23 16:45:50.56718939,7740042,T,IEX,20.800000,43
2019-10-23 16:47:27.308242944,2019-10-23 16:47:27.308221307,7773977,T,IEX,20.800000,100
2019-10-23 16:47:34.830575104,2019-10-23 16:47:34.830553044,7776059,T,IEX,20.800000,157
2019-10-23 16:47:34.830584064,2019-10-23 16:47:34.830565672,7776060,T,IEX,20.800000,43
2019-10-23 16:48:38.407162880,2019-10-23 16:48:38.407142459,7796462,T,IEX,20.805000,100
2019-10-23 16:48:38.414639104,2019-10-23 16:48:38.414617413,7796464,T,IEX,20.805000,100
2019-10-23 16:49:35.475272960,2019-10-23 16:49:35.475257343,7815943,T,IEX,20.805000,200
2019-10-23 16:49:35.482012928,2019-10-23 16:49:35.481991926,7815946,T,IEX,20.810000,100
2019-10-23 16:49:35.482023936,2019-10-23 16:49:35.482007307,7815947,T,IEX,20.810000,100
2019-10-23 16:49:50.782216960,2019-10-23 16:49:50.782196262,7820005,T,IEX,20.805000,100
2019-10-23 16:49:50.782241024,2019-10-23 16:49:50.782224120,7820006,T,IEX,20.805000,100
2019-10-23 16:50:32.644873984,2019-10-23 16:50:32.644856293,7834067,T,IEX,20.800000,60
2019-10-23 16:50:49.173308928,2019-10-23 16:50:49.173292563,7839886,T,IEX,20.805000,100
2019-10-23 16:52:47.919451904,2019-10-23 16:52:47.919434785,7877854,T,IEX,20.815000,100
2019-10-23 16:54:13.483450112,2019-10-23 16:54:13.483431609,7910527,T,IEX,20.785000,46
2019-10-23 16:54:23.24775936,2019-10-23 16:54:23.24758838,7914548,T,IEX,20.785000,200
2019-10-23 16:55:18.576602112,2019-10-23 16:55:18.576584061,7939086,T,IEX,20.815000,100
2019-10-23 16:55:32.202830080,2019-10-23 16:55:32.202811022,7944340,T,IEX,20.825000,100
2019-10-23 16:57:03.586416896,2019-10-23 16:57:03.586399082,7972119,T,IEX,20.825000,100
2019-10-23 17:00:01.845435904,2019-10-23 17:00:01.845415356,8033592,T,IEX,20.810000,300
2019-10-23 17:00:01.845452032,2019-10-23 17:00:01.845435447,8033593,T,IEX,20.810000,300
2019-10-23 17:01:33.153298944,2019-10-23 17:01:33.153281060,8067753,T,IEX,20.795000,100
2019-10-23 17:02:31.620666112,2019-10-23 17:02:31.620644892,8092224,T,IEX,20.810000,100
2019-10-23 17:04:39.97316096,2019-10-23 17:04:39.97298329,8133879,T,IEX,20.800000,300
2019-10-23 17:04:39.97328128,2019-10-23 17:04:39.97311543,8133880,T,IEX,20.800000,82
2019-10-23 17:04:41.832076032,2019-10-23 17:04:41.832054130,8135607,T,IEX,20.790000,40
2019-10-23 17:04:52.111750912,2019-10-23 17:04:52.111733521,8138876,T,IEX,20.795000,100
2019-10-23 17:04:57.153849088,2019-10-23 17:04:57.153821763,8140484,T,IEX,20.800000,100
2019-10-23 17:05:08.4476928,2019-10-23 17:05:08.4456721,8145591,T,IEX,20.795000,200
2019-10-23 17:05:20.606086912,2019-10-23 17:05:20.606065913,8150738,T,IEX,20.790000,60
2019-10-23 17:05:44.287218944,2019-10-23 17:05:44.287199292,8160142,T,IEX,20.785000,200
2019-10-23 17:06:18.685669120,2019-10-23 17:06:18.685652368,8172351,T,IEX,20.785000,100
2019-10-23 17:06:18.686202880,2019-10-23 17:06:18.686186182,8172355,T,IEX,20.780000,300
2019-10-23 17:10:52.343784960,2019-10-23 17:10:52.343763558,8276020,T,IEX,20.810000,9
2019-10-23 17:13:15.784421120,2019-10-23 17:13:15.784403266,8332566,T,IEX,20.880000,420
2019-10-23 17:16:12.439794944,2019-10-23 17:16:12.439776204,8411438,T,IEX,20.900000,300
2019-10-23 17:16:12.439814912,2019-10-23 17:16:12.439798005,8411440,T,IEX,20.900000,113
2019-10-23 17:17:24.440044032,2019-10-23 17:17:24.440026185,8433736,T,IEX,20.870000,200
2019-10-23 17:18:17.109969920,2019-10-23 17:18:17.109948912,8450013,T,IEX,20.860000,200
2019-10-23 17:18:24.636689920,2019-10-23 17:18:24.636667684,8451841,T,IEX,20.860000,100
2019-10-23 17:20:09.256079104,2019-10-23 17:20:09.256058630,8484969,T,IEX,20.880000,112
2019-10-23 17:21:03.184076032,2019-10-23 17:21:03.184056669,8503305,T,IEX,20.880000,8
2019-10-23 17:24:06.369170944,2019-10-23 17:24:06.369149498,8565589,T,IEX,20.885000,194
2019-10-23 17:27:23.489144064,2019-10-23 17:27:23.489125419,8628169,T,IEX,20.865000,200
2019-10-23 17:27:23.496370944,2019-10-23 17:27:23.496349168,8628170,T,IEX,20.865000,100
2019-10-23 17:28:59.587373056,2019-10-23 17:28:59.587357299,8656122,T,IEX,20.840000,6
2019-10-23 17:29:04.140180992,2019-10-23 17:29:04.140162130,8658130,T,IEX,20.840000,300
2019-10-23 17:30:51.77217024,2019-10-23 17:30:51.77197216,8693516,T,IEX,20.850000,300
2019-10-23 17:30:51.77230080,2019-10-23 17:30:51.77213663,8693517,T,IEX,20.850000,100
2019-10-23 17:31:15.487147008,2019-10-23 17:31:15.487126858,8702393,T,IEX,20.850000,100
2019-10-23 17:31:37.483582976,2019-10-23 17:31:37.483566704,8711183,T,IEX,20.870000,100
2019-10-23 17:31:47.102083072,2019-10-23 17:31:47.102064995,8713683,T,IEX,20.870000,200
2019-10-23 17:31:47.102100992,2019-10-23 17:31:47.102083981,8713684,T,IEX,20.870000,300
2019-10-23 17:32:06.12331008,2019-10-23 17:32:06.12312040,8720286,T,IEX,20.860000,300
2019-10-23 17:33:04.887813120,2019-10-23 17:33:04.887790176,8738825,T,IEX,20.840000,300
2019-10-23 17:33:04.887821056,2019-10-23 17:33:04.887803964,8738826,T,IEX,20.840000,300
2019-10-23 17:33:27.822757120,2019-10-23 17:33:27.822734661,8745964,T,IEX,20.850000,300
2019-10-23 17:33:27.822765056,2019-10-23 17:33:27.822747497,8745965,T,IEX,20.850000,100
2019-10-23 17:34:01.362914048,2019-10-23 17:34:01.362894576,8756250,T,IEX,20.845000,100
2019-10-23 17:34:22.702124032,2019-10-23 17:34:22.702104778,8764667,T,IEX,20.840000,300
2019-10-23 17:34:22.702138880,2019-10-23 17:34:22.702122042,8764668,T,IEX,20.840000,300
2019-10-23 17:34:22.704741120,2019-10-23 17:34:22.704719873,8764673,T,IEX,20.840000,41
2019-10-23 17:35:04.926114048,2019-10-23 17:35:04.926092370,8778056,T,IEX,20.840000,100
2019-10-23 17:35:21.697777920,2019-10-23 17:35:21.697756877,8784782,T,IEX,20.840000,200
2019-10-23 17:37:31.339497984,2019-10-23 17:37:31.339481701,8827699,T,IEX,20.820000,300
2019-10-23 17:37:31.339521024,2019-10-23 17:37:31.339502590,8827700,T,IEX,20.820000,100
2019-10-23 17:39:05.67419904,2019-10-23 17:39:05.67397061,8858076,T,IEX,20.815000,200
2019-10-23 17:41:44.678118912,2019-10-23 17:41:44.678097519,8905215,T,IEX,20.810000,91
2019-10-23 17:43:01.787448064,2019-10-23 17:43:01.787425693,8928050,T,IEX,20.785000,100
2019-10-23 17:43:18.200698880,2019-10-23 17:43:18.200680704,8933877,T,IEX,20.790000,100
2019-10-23 17:44:11.163472896,2019-10-23 17:44:11.163453333,8952804,T,IEX,20.800000,300
2019-10-23 17:44:11.163482880,2019-10-23 17:44:11.163466313,8952805,T,IEX,20.800000,300
2019-10-23 17:44:14.3644928,2019-10-23 17:44:14.3624577,8953279,T,IEX,20.795000,300
2019-10-23 17:46:17.242615040,2019-10-23 17:46:17.242595382,8995168,T,IEX,20.790000,300
2019-10-23 17:47:49.836100096,2019-10-23 17:47:49.836081198,9027490,T,IEX,20.790000,300
2019-10-23 17:48:07.712871936,2019-10-23 17:48:07.712850885,9033166,T,IEX,20.795000,300
2019-10-23 17:49:22.751495936,2019-10-23 17:49:22.751474209,9060153,T,IEX,20.790000,300
2019-10-23 17:49:22.751504896,2019-10-23 17:49:22.751487552,9060154,T,IEX,20.790000,100
2019-10-23 17:49:42.466073088,2019-10-23 17:49:42.466050214,9065197,T,IEX,20.790000,200
2019-10-23 17:49:42.466081024,2019-10-23 17:49:42.466063141,9065198,T,IEX,20.790000,200
2019-10-23 17:50:10.233323008,2019-10-23 17:50:10.233305919,9072541,T,IEX,20.790000,300
2019-10-23 17:50:10.233338880,2019-10-23 17:50:10.233322177,9072542,T,IEX,20.790000,100
2019-10-23 17:50:14.541319936,2019-10-23 17:50:14.541298470,9073662,T,IEX,20.790000,200
2019-10-23 17:50:14.541329920,2019-10-23 17:50:14.541311038,9073663,T,IEX,20.790000,100
2019-10-23 17:51:04.596032000,2019-10-23 17:51:04.596011080,9090325,T,IEX,20.780000,200
2019-10-23 17:52:10.58918912,2019-10-23 17:52:10.58897615,9111151,T,IEX,20.780000,200
2019-10-23 17:52:13.78383104,2019-10-23 17:52:13.78362790,9112334,T,IEX,20.790000,100
2019-10-23 17:52:17.7051008,2019-10-23 17:52:17.7031525,9113458,T,IEX,20.790000,300
2019-10-23 17:52:40.657242112,2019-10-23 17:52:40.657221917,9119871,T,IEX,20.800000,91
2019-10-23 17:53:28.699695104,2019-10-23 17:53:28.699675219,9133590,T,IEX,20.790000,300
2019-10-23 17:53:28.699716096,2019-10-23 17:53:28.699695150,9133591,T,IEX,20.790000,100
2019-10-23 17:53:49.252492032,2019-10-23 17:53:49.252473661,9139191,T,IEX,20.800000,100
2019-10-23 17:53:49.252509952,2019-10-23 17:53:49.252491386,9139192,T,IEX,20.800000,100
2019-10-23 17:54:19.133684992,2019-10-23 17:54:19.133667076,9148394,T,IEX,20.810000,485
2019-10-23 17:55:39.667058944,2019-10-23 17:55:39.667038920,9173330,T,IEX,20.830000,100
2019-10-23 17:56:17.796912896,2019-10-23 17:56:17.796891436,9184570,T,IEX,20.810000,300
2019-10-23 17:57:40.580570880,2019-10-23 17:57:40.580550262,9207920,T,IEX,20.800000,300
2019-10-23 17:57:40.580587008,2019-10-23 17:57:40.580570367,9207921,T,IEX,20.800000,120
2019-10-23 17:57:57.310033920,2019-10-23 17:57:57.310013073,9212962,T,IEX,20.820000,92
2019-10-23 17:59:13.426397952,2019-10-23 17:59:13.426381004,9237377,T,IEX,20.820000,300
2019-10-23 17:59:13.426417920,2019-10-23 17:59:13.426400084,9237378,T,IEX,20.820000,8
2019-10-23 18:02:23.74513920,2019-10-23 18:02:23.74492079,9321649,T,IEX,20.875000,100
2019-10-23 18:03:12.356787968,2019-10-23 18:03:12.356767870,9342214,T,IEX,20.855000,100
2019-10-23 18:03:45.83886080,2019-10-23 18:03:45.83868537,9354424,T,IEX,20.855000,100
2019-10-23 18:04:02.978251008,2019-10-23 18:04:02.978234903,9359701,T,IEX,20.855000,100
2019-10-23 18:04:25.448027904,2019-10-23 18:04:25.448008783,9367245,T,IEX,20.860000,100
2019-10-23 18:04:35.83602944,2019-10-23 18:04:35.83582522,9371050,T,IEX,20.865000,100
2019-10-23 18:05:52.66199040,2019-10-23 18:05:52.66179124,9397962,T,IEX,20.890000,100
2019-10-23 18:06:09.70652928,2019-10-23 18:06:09.70630718,9404987,T,IEX,20.890000,300
2019-10-23 18:06:18.92868096,2019-10-23 18:06:18.92847853,9408539,T,IEX,20.920000,300
2019-10-23 18:06:18.92924928,2019-10-23 18:06:18.92908271,9408541,T,IEX,20.920000,300
2019-10-23 18:06:39.134836992,2019-10-23 18:06:39.134808850,9417064,T,IEX,20.915000,300
2019-10-23 18:07:02.58886912,2019-10-23 18:07:02.58865633,9427011,T,IEX,20.930000,300
2019-10-23 18:07:37.66750976,2019-10-23 18:07:37.66731117,9438616,T,IEX,20.910000,300
2019-10-23 18:08:13.65778944,2019-10-23 18:08:13.65758467,9452956,T,IEX,20.885000,200
2019-10-23 18:08:30.747499008,2019-10-23 18:08:30.747478428,9459311,T,IEX,20.880000,1
2019-10-23 18:08:31.427249920,2019-10-23 18:08:31.427233468,9459693,T,IEX,20.880000,126
2019-10-23 18:08:32.312307968,2019-10-23 18:08:32.312288451,9460038,T,IEX,20.880000,173
2019-10-23 18:09:16.59058944,2019-10-23 18:09:16.59041689,9477255,T,IEX,20.880000,300
2019-10-23 18:09:35.541186048,2019-10-23 18:09:35.541166058,9483816,T,IEX,20.875000,200
2019-10-23 18:09:47.939621120,2019-10-23 18:09:47.939599693,9488341,T,IEX,20.870000,300
2019-10-23 18:09:59.21558016,2019-10-23 18:09:59.21537973,9493485,T,IEX,20.870000,100
2019-10-23 18:10:04.69399040,2019-10-23 18:10:04.69378667,9496379,T,IEX,20.875000,300
2019-10-23 18:10:17.12359936,2019-10-23 18:10:17.12339572,9501572,T,IEX,20.865000,200
2019-10-23 18:10:17.12378112,2019-10-23 18:10:17.12360978,9501573,T,IEX,20.865000,100
2019-10-23 18:12:19.739405056,2019-10-23 18:12:19.739384947,9546282,T,IEX,20.890000,92
2019-10-23 18:12:42.55817984,2019-10-23 18:12:42.55796907,9554955,T,IEX,20.890000,8
2019-10-23 18:14:38.563139072,2019-10-23 18:14:38.563118702,9598179,T,IEX,20.915000,100
2019-10-23 18:15:54.211170048,2019-10-23 18:15:54.211148434,9623352,T,IEX,20.915000,300
2019-10-23 18:16:03.29152000,2019-10-23 18:16:03.29131576,9627574,T,IEX,20.935000,300
2019-10-23 18:17:35.885519872,2019-10-23 18:17:35.885502154,9665487,T,IEX,20.935000,100
2019-10-23 18:18:44.94035968,2019-10-23 18:18:44.94018178,9700628,T,IEX,20.950000,200
2019-10-23 18:18:44.94050048,2019-10-23 18:18:44.94032016,9700629,T,IEX,20.950000,60
2019-10-23 18:19:02.58377984,2019-10-23 18:19:02.58357656,9710111,T,IEX,20.955000,100
2019-10-23 18:19:32.697722112,2019-10-23 18:19:32.697698815,9727580,T,IEX,20.970000,300
2019-10-23 18:19:32.708978944,2019-10-23 18:19:32.708958482,9727586,T,IEX,20.970000,48
2019-10-23 18:19:40.511653120,2019-10-23 18:19:40.511634739,9731947,T,IEX,20.990000,300
2019-10-23 18:19:40.511666944,2019-10-23 18:19:40.511648625,9731948,T,IEX,20.990000,120
2019-10-23 18:19:58.59225088,2019-10-23 18:19:58.59204041,9743285,T,IEX,20.965000,41
2019-10-23 18:21:11.782568960,2019-10-23 18:21:11.782548759,9777474,T,IEX,20.990000,300
2019-10-23 18:21:16.867609088,2019-10-23 18:21:16.867587969,9779690,T,IEX,20.985000,100
2019-10-23 18:22:31.821769984,2019-10-23 18:22:31.821746957,9808274,T,IEX,20.965000,300
2019-10-23 18:22:49.990976000,2019-10-23 18:22:49.990957672,9816008,T,IEX,20.975000,300
2019-10-23 18:23:36.41371904,2019-10-23 18:23:36.41355325,9833454,T,IEX,20.960000,100
2019-10-23 18:23:39.994022912,2019-10-23 18:23:39.993997567,9835064,T,IEX,20.965000,100
2019-10-23 18:23:40.583112960,2019-10-23 18:23:40.583094902,9835684,T,IEX,20.975000,100
2019-10-23 18:23:41.391710976,2019-10-23 18:23:41.391692683,9836383,T,IEX,20.975000,100
2019-10-23 18:23:41.392794112,2019-10-23 18:23:41.392774910,9836392,T,IEX,20.975000,100
2019-10-23 18:24:27.101047040,2019-10-23 18:24:27.101023765,9852438,T,IEX,20.980000,100
2019-10-23 18:25:00.265611008,2019-10-23 18:25:00.265593095,9866395,T,IEX,20.975000,100
2019-10-23 18:26:09.698206976,2019-10-23 18:26:09.698183869,9890552,T,IEX,20.990000,200
2019-10-23 18:26:35.935334912,2019-10-23 18:26:35.935308028,9900283,T,IEX,21.000000,100
2019-10-23 18:26:49.93978880,2019-10-23 18:26:49.93956824,9904619,T,IEX,21.005000,300
2019-10-23 18:27:15.94781952,2019-10-23 18:27:15.94764285,9917780,T,IEX,21.025000,100
2019-10-23 18:27:15.94800896,2019-10-23 18:27:15.94784239,9917781,T,IEX,21.025000,100
2019-10-23 18:27:38.908009984,2019-10-23 18:27:38.907981167,9929742,T,IEX,21.035000,200
2019-10-23 18:27:51.49129984,2019-10-23 18:27:51.49109573,9935922,T,IEX,21.025000,100
2019-10-23 18:27:54.64003072,2019-10-23 18:27:54.63986187,9937484,T,IEX,21.030000,200
2019-10-23 18:28:12.92709120,2019-10-23 18:28:12.92687190,9946252,T,IEX,21.030000,200
2019-10-23 18:28:46.61338880,2019-10-23 18:28:46.61321450,9963339,T,IEX,21.010000,300
2019-10-23 18:28:46.61351936,2019-10-23 18:28:46.61334650,9963340,T,IEX,21.010000,100
2019-10-23 18:28:55.60759040,2019-10-23 18:28:55.60738154,9967152,T,IEX,21.005000,300
2019-10-23 18:29:11.322223104,2019-10-23 18:29:11.322203637,9975395,T,IEX,20.995000,100
2019-10-23 18:29:23.118427904,2019-10-23 18:29:23.118406321,9981167,T,IEX,21.005000,100
2019-10-23 18:29:33.63567872,2019-10-23 18:29:33.63546703,9985644,T,IEX,21.000000,300
2019-10-23 18:29:33.63578112,2019-10-23 18:29:33.63559761,9985645,T,IEX,21.000000,300
2019-10-23 18:29:53.309519872,2019-10-23 18:29:53.309498443,9993367,T,IEX,20.995000,200
2019-10-23 18:29:54.785868032,2019-10-23 18:29:54.785843123,9993990,T,IEX,20.995000,100
2019-10-23 18:29:59.44105984,2019-10-23 18:29:59.44084208,9996901,T,IEX,20.985000,600
2019-10-23 18:30:53.357029888,2019-10-23 18:30:53.357009902,10021666,T,IEX,20.980000,200
2019-10-23 18:33:33.586657024,2019-10-23 18:33:33.586639862,10086663,T,IEX,20.985000,100
2019-10-23 18:35:51.51074048,2019-10-23 18:35:51.51054883,10140725,T,IEX,20.960000,42
2019-10-23 18:36:09.424034048,2019-10-23 18:36:09.424016477,10148215,T,IEX,20.945000,100
2019-10-23 18:36:31.113110016,2019-10-23 18:36:31.113091588,10157706,T,IEX,20.960000,100
2019-10-23 18:36:44.456787968,2019-10-23 18:36:44.456765942,10169973,T,IEX,20.965000,300
2019-10-23 18:36:44.456829952,2019-10-23 18:36:44.456800876,10169978,T,IEX,20.965000,200
2019-10-23 18:38:54.113805056,2019-10-23 18:38:54.113784654,10242933,T,IEX,20.985000,100
2019-10-23 18:39:00.932500992,2019-10-23 18:39:00.932481890,10245277,T,IEX,20.960000,100
2019-10-23 18:39:23.495344896,2019-10-23 18:39:23.495326448,10257259,T,IEX,20.950000,328
2019-10-23 18:39:23.554226944,2019-10-23 18:39:23.554208892,10257354,T,IEX,20.950000,400
2019-10-23 18:39:25.911226112,2019-10-23 18:39:25.911206576,10258601,T,IEX,20.945000,100
2019-10-23 18:39:28.967698944,2019-10-23 18:39:28.967674844,10260157,T,IEX,20.960000,400
2019-10-23 18:39:28.967709952,2019-10-23 18:39:28.967687617,10260158,T,IEX,20.960000,400
2019-10-23 18:40:01.685795072,2019-10-23 18:40:01.685772975,10277996,T,IEX,20.980000,1
2019-10-23 18:40:38.555136000,2019-10-23 18:40:38.555115389,10293534,T,IEX,20.960000,400
2019-10-23 18:40:46.53859072,2019-10-23 18:40:46.53839172,10296401,T,IEX,20.960000,71
2019-10-23 18:41:21.776421888,2019-10-23 18:41:21.776398547,10311996,T,IEX,20.960000,86
2019-10-23 18:42:39.395497984,2019-10-23 18:42:39.395479135,10343215,T,IEX,20.960000,400
2019-10-23 18:42:48.95879936,2019-10-23 18:42:48.95858931,10347655,T,IEX,20.960000,400
2019-10-23 18:42:48.95896064,2019-10-23 18:42:48.95878303,10347656,T,IEX,20.960000,259
2019-10-23 18:42:53.35343872,2019-10-23 18:42:53.35327621,10349719,T,IEX,20.960000,141
2019-10-23 18:42:53.35364096,2019-10-23 18:42:53.35347507,10349720,T,IEX,20.960000,359
2019-10-23 18:42:53.538140928,2019-10-23 18:42:53.538121819,10350015,T,IEX,20.960000,400
2019-10-23 18:44:10.437319936,2019-10-23 18:44:10.437297263,10377901,T,IEX,20.950000,400
2019-10-23 18:44:14.995639040,2019-10-23 18:44:14.995616387,10379421,T,IEX,20.950000,200
2019-10-23 18:44:18.854619904,2019-10-23 18:44:18.854603682,10380497,T,IEX,20.950000,200
2019-10-23 18:44:18.854641920,2019-10-23 18:44:18.854623805,10380498,T,IEX,20.950000,200
2019-10-23 18:44:25.16480000,2019-10-23 18:44:25.16460690,10382436,T,IEX,20.955000,400
2019-10-23 18:44:40.849775104,2019-10-23 18:44:40.849755781,10392054,T,IEX,20.960000,400
2019-10-23 18:44:40.849792000,2019-10-23 18:44:40.849775686,10392055,T,IEX,20.960000,400
2019-10-23 18:44:56.284790016,2019-10-23 18:44:56.284767643,10398723,T,IEX,20.950000,200
2019-10-23 18:45:11.95810048,2019-10-23 18:45:11.95790085,10404842,T,IEX,20.960000,129
2019-10-23 18:45:46.88732928,2019-10-23 18:45:46.88714400,10419006,T,IEX,20.955000,71
2019-10-23 18:46:13.216486912,2019-10-23 18:46:13.216469125,10430844,T,IEX,20.940000,400
2019-10-23 18:46:14.252722944,2019-10-23 18:46:14.252703330,10431123,T,IEX,20.940000,400
2019-10-23 18:46:15.338055936,2019-10-23 18:46:15.338035919,10431456,T,IEX,20.940000,329
2019-10-23 18:46:24.908890112,2019-10-23 18:46:24.908871717,10435330,T,IEX,20.940000,400
2019-10-23 18:46:28.646086912,2019-10-23 18:46:28.646069381,10436709,T,IEX,20.940000,319
2019-10-23 18:47:22.412103936,2019-10-23 18:47:22.412080657,10459102,T,IEX,20.940000,200
2019-10-23 18:47:31.649867008,2019-10-23 18:47:31.649847043,10462574,T,IEX,20.940000,100
2019-10-23 18:47:40.756199936,2019-10-23 18:47:40.756181159,10465672,T,IEX,20.940000,100
2019-10-23 18:47:40.756211968,2019-10-23 18:47:40.756190265,10465673,T,IEX,20.940000,200
2019-10-23 18:47:43.483507968,2019-10-23 18:47:43.483486368,10466626,T,IEX,20.940000,200
2019-10-23 18:48:00.765737984,2019-10-23 18:48:00.765716794,10472255,T,IEX,20.930000,66
2019-10-23 18:48:03.281841920,2019-10-23 18:48:03.281822265,10473437,T,IEX,20.940000,30
2019-10-23 18:48:13.478117888,2019-10-23 18:48:13.478100888,10476614,T,IEX,20.940000,400
2019-10-23 18:48:13.478145024,2019-10-23 18:48:13.478127495,10476615,T,IEX,20.940000,100
2019-10-23 18:48:18.122656000,2019-10-23 18:48:18.122634350,10478921,T,IEX,20.930000,400
2019-10-23 18:49:33.365100032,2019-10-23 18:49:33.365077827,10508142,T,IEX,20.960000,400
2019-10-23 18:53:30.147514112,2019-10-23 18:53:30.147495967,10606792,T,IEX,21.000000,200
2019-10-23 18:53:42.489209088,2019-10-23 18:53:42.489188734,10610451,T,IEX,21.000000,200
2019-10-23 18:53:42.489219072,2019-10-23 18:53:42.489201850,10610452,T,IEX,21.000000,200
2019-10-23 18:53:43.966024960,2019-10-23 18:53:43.966004777,10611109,T,IEX,21.000000,99
2019-10-23 18:53:53.769390080,2019-10-23 18:53:53.769368313,10614603,T,IEX,21.000000,301
2019-10-23 18:53:53.769400064,2019-10-23 18:53:53.769384064,10614604,T,IEX,21.000000,99
2019-10-23 18:54:16.465323008,2019-10-23 18:54:16.465302883,10624659,T,IEX,20.990000,30
2019-10-23 18:54:35.732865024,2019-10-23 18:54:35.732847759,10632376,T,IEX,20.990000,15
2019-10-23 18:54:38.390728960,2019-10-23 18:54:38.390707323,10633392,T,IEX,20.985000,325
2019-10-23 18:54:40.437873920,2019-10-23 18:54:40.437852972,10634100,T,IEX,20.985000,100
2019-10-23 18:54:50.388806912,2019-10-23 18:54:50.388786434,10636916,T,IEX,20.985000,100
2019-10-23 18:54:50.388823040,2019-10-23 18:54:50.388806473,10636917,T,IEX,20.980000,100
2019-10-23 18:54:54.779520000,2019-10-23 18:54:54.779498479,10638121,T,IEX,20.985000,100
2019-10-23 18:55:20.574853888,2019-10-23 18:55:20.574833192,10645420,T,IEX,20.980000,400
2019-10-23 18:55:33.679158016,2019-10-23 18:55:33.679140096,10651120,T,IEX,20.980000,40
2019-10-23 18:55:36.551581952,2019-10-23 18:55:36.551561843,10652239,T,IEX,20.965000,100
2019-10-23 18:55:36.551603968,2019-10-23 18:55:36.551582478,10652241,T,IEX,20.960000,300
2019-10-23 18:55:36.553192960,2019-10-23 18:55:36.553173306,10652281,T,IEX,20.970000,400
2019-10-23 18:56:17.699015936,2019-10-23 18:56:17.698993611,10666196,T,IEX,20.980000,400
2019-10-23 18:56:22.611188992,2019-10-23 18:56:22.611170297,10667700,T,IEX,20.980000,300
2019-10-23 18:56:29.264324096,2019-10-23 18:56:29.264302232,10670317,T,IEX,20.980000,100
2019-10-23 18:56:29.264335104,2019-10-23 18:56:29.264315515,10670318,T,IEX,20.980000,300
2019-10-23 18:56:34.104727040,2019-10-23 18:56:34.104705494,10672014,T,IEX,20.980000,300
2019-10-23 18:56:59.522223104,2019-10-23 18:56:59.522205630,10681138,T,IEX,20.970000,400
2019-10-23 18:56:59.522238976,2019-10-23 18:56:59.522219221,10681139,T,IEX,20.970000,400
2019-10-23 18:57:31.403149056,2019-10-23 18:57:31.403130861,10694726,T,IEX,20.970000,400
2019-10-23 18:57:31.403162112,2019-10-23 18:57:31.403144657,10694727,T,IEX,20.970000,160
2019-10-23 18:57:43.734327040,2019-10-23 18:57:43.734311156,10699969,T,IEX,20.970000,400
2019-10-23 18:57:43.734347008,2019-10-23 18:57:43.734330014,10699970,T,IEX,20.970000,400
2019-10-23 18:57:46.3181056,2019-10-23 18:57:46.3163895,10700989,T,IEX,20.965000,200
2019-10-23 18:57:46.11239936,2019-10-23 18:57:46.11219024,10700991,T,IEX,20.965000,200
2019-10-23 18:57:59.986145024,2019-10-23 18:57:59.986126278,10706822,T,IEX,20.980000,300
2019-10-23 18:58:38.224006912,2019-10-23 18:58:38.223986103,10721912,T,IEX,20.985000,200
2019-10-23 18:59:08.746052096,2019-10-23 18:59:08.746029980,10732777,T,IEX,20.990000,74
2019-10-23 18:59:31.782840064,2019-10-23 18:59:31.782819736,10742980,T,IEX,20.970000,400
2019-10-23 18:59:31.782853888,2019-10-23 18:59:31.782825033,10742982,T,IEX,20.970000,400
2019-10-23 18:59:32.875343872,2019-10-23 18:59:32.875327797,10743706,T,IEX,20.970000,400
2019-10-23 19:00:40.426854912,2019-10-23 19:00:40.426830420,10771632,T,IEX,20.960000,116
2019-10-23 19:01:13.163056128,2019-10-23 19:01:13.163038539,10782749,T,IEX,20.970000,400
2019-10-23 19:01:37.585572096,2019-10-23 19:01:37.585555705,10790661,T,IEX,20.960000,200
2019-10-23 19:01:48.118181120,2019-10-23 19:01:48.118163183,10793507,T,IEX,20.970000,400
2019-10-23 19:01:52.894770944,2019-10-23 19:01:52.894751011,10795160,T,IEX,20.970000,400
2019-10-23 19:02:00.140322048,2019-10-23 19:02:00.140304340,10796980,T,IEX,20.970000,400
2019-10-23 19:02:43.559052032,2019-10-23 19:02:43.559024931,10815605,T,IEX,20.975000,300
2019-10-23 19:02:55.4416000,2019-10-23 19:02:55.4397470,10821414,T,IEX,20.975000,300
2019-10-23 19:03:19.250564096,2019-10-23 19:03:19.250540068,10830783,T,IEX,20.965000,300
2019-10-23 19:04:18.339898112,2019-10-23 19:04:18.339878904,10855282,T,IEX,20.990000,500
2019-10-23 19:04:35.809250048,2019-10-23 19:04:35.809232282,10863217,T,IEX,20.990000,400
2019-10-23 19:04:58.426341888,2019-10-23 19:04:58.426315613,10870224,T,IEX,20.990000,200
2019-10-23 19:05:55.55063040,2019-10-23 19:05:55.55044547,10888650,T,IEX,21.005000,42
2019-10-23 19:06:08.268179968,2019-10-23 19:06:08.268162343,10892808,T,IEX,21.000000,60
2019-10-23 19:06:10.676879104,2019-10-23 19:06:10.676860337,10893428,T,IEX,21.000000,300
2019-10-23 19:06:41.915960064,2019-10-23 19:06:41.915941591,10903080,T,IEX,20.995000,200
2019-10-23 19:06:55.553751040,2019-10-23 19:06:55.553729968,10907466,T,IEX,21.000000,1
2019-10-23 19:08:54.709043968,2019-10-23 19:08:54.709026088,10949460,T,IEX,20.985000,100
2019-10-23 19:09:00.197437952,2019-10-23 19:09:00.197418097,10951867,T,IEX,20.990000,400
2019-10-23 19:09:00.197455104,2019-10-23 19:09:00.197437444,10951868,T,IEX,20.990000,400
2019-10-23 19:09:06.592068096,2019-10-23 19:09:06.592049916,10954547,T,IEX,21.000000,100
2019-10-23 19:12:01.452504064,2019-10-23 19:12:01.452486524,11025098,T,IEX,21.035000,1
2019-10-23 19:12:39.955298048,2019-10-23 19:12:39.955276445,11039002,T,IEX,21.040000,400
2019-10-23 19:12:39.955312128,2019-10-23 19:12:39.955285993,11039004,T,IEX,21.040000,400
2019-10-23 19:12:45.767475968,2019-10-23 19:12:45.767455925,11041267,T,IEX,21.040000,400
2019-10-23 19:13:05.838894080,2019-10-23 19:13:05.838875652,11050891,T,IEX,21.040000,100
2019-10-23 19:13:10.844258048,2019-10-23 19:13:10.844230225,11052482,T,IEX,21.040000,400
2019-10-23 19:13:10.844282112,2019-10-23 19:13:10.844247472,11052485,T,IEX,21.040000,400
2019-10-23 19:13:56.785099008,2019-10-23 19:13:56.785078622,11066276,T,IEX,21.015000,100
2019-10-23 19:13:56.791985920,2019-10-23 19:13:56.791966699,11066278,T,IEX,21.015000,100
2019-10-23 19:14:00.651888128,2019-10-23 19:14:00.651868194,11067452,T,IEX,21.020000,400
2019-10-23 19:14:12.658967040,2019-10-23 19:14:12.658949182,11073384,T,IEX,21.035000,200
2019-10-23 19:15:26.259595008,2019-10-23 19:15:26.259573541,11106992,T,IEX,21.065000,200
2019-10-23 19:16:14.288655872,2019-10-23 19:16:14.288640511,11123570,T,IEX,21.060000,400
2019-10-23 19:17:00.656832000,2019-10-23 19:17:00.656811353,11142327,T,IEX,21.015000,400
2019-10-23 19:20:27.76677888,2019-10-23 19:20:27.76661453,11209030,T,IEX,20.970000,400
2019-10-23 19:21:31.215859968,2019-10-23 19:21:31.215837770,11237577,T,IEX,20.955000,300
2019-10-23 19:21:31.215868928,2019-10-23 19:21:31.215850726,11237578,T,IEX,20.955000,100
2019-10-23 19:23:54.495611904,2019-10-23 19:23:54.495591410,11287474,T,IEX,20.945000,700
2019-10-23 19:24:56.474168064,2019-10-23 19:24:56.474146972,11307730,T,IEX,20.970000,300
2019-10-23 19:27:22.522235904,2019-10-23 19:27:22.522215155,11363109,T,IEX,20.955000,1000
2019-10-23 19:27:22.522245888,2019-10-23 19:27:22.522228177,11363110,T,IEX,20.955000,600
2019-10-23 19:28:11.635968000,2019-10-23 19:28:11.635949928,11381047,T,IEX,20.945000,100
2019-10-23 19:30:49.497072896,2019-10-23 19:30:49.497052222,11453485,T,IEX,20.940000,400
2019-10-23 19:30:49.497083904,2019-10-23 19:30:49.497065410,11453486,T,IEX,20.940000,400
2019-10-23 19:30:50.56293120,2019-10-23 19:30:50.56272626,11453672,T,IEX,20.945000,72
2019-10-23 19:31:15.322251008,2019-10-23 19:31:15.322229828,11467081,T,IEX,20.935000,100
2019-10-23 19:32:12.274768896,2019-10-23 19:32:12.274749785,11494582,T,IEX,20.935000,100
2019-10-23 19:32:12.274924032,2019-10-23 19:32:12.274906362,11494586,T,IEX,20.940000,300
2019-10-23 19:32:12.274942976,2019-10-23 19:32:12.274925444,11494587,T,IEX,20.940000,100
2019-10-23 19:32:13.662790912,2019-10-23 19:32:13.662769921,11495637,T,IEX,20.940000,400
2019-10-23 19:32:17.884303872,2019-10-23 19:32:17.884282736,11497802,T,IEX,20.930000,400
2019-10-23 19:32:17.884318976,2019-10-23 19:32:17.884302401,11497803,T,IEX,20.930000,400
2019-10-23 19:32:43.174296064,2019-10-23 19:32:43.174273315,11514230,T,IEX,20.925000,200
2019-10-23 19:33:07.355833088,2019-10-23 19:33:07.355815681,11526563,T,IEX,20.905000,100
2019-10-23 19:33:13.526126080,2019-10-23 19:33:13.526105667,11528967,T,IEX,20.930000,150
2019-10-23 19:33:54.545053952,2019-10-23 19:33:54.545034983,11547218,T,IEX,20.935000,800
2019-10-23 19:33:54.572963072,2019-10-23 19:33:54.572943727,11547310,T,IEX,20.940000,22
2019-10-23 19:34:09.9917952,2019-10-23 19:34:09.9897726,11554502,T,IEX,20.940000,400
2019-10-23 19:34:09.9928960,2019-10-23 19:34:09.9910896,11554503,T,IEX,20.940000,400
2019-10-23 19:36:12.719739904,2019-10-23 19:36:12.719719886,11615982,T,IEX,20.925000,600
2019-10-23 19:36:12.719751936,2019-10-23 19:36:12.719731571,11615983,T,IEX,20.920000,400
2019-10-23 19:37:27.615224064,2019-10-23 19:37:27.615202106,11650047,T,IEX,20.915000,500
2019-10-23 19:37:27.615232000,2019-10-23 19:37:27.615211101,11650048,T,IEX,20.915000,700
2019-10-23 19:37:32.158478080,2019-10-23 19:37:32.158457654,11651999,T,IEX,20.915000,500
2019-10-23 19:38:06.497947904,2019-10-23 19:38:06.497929476,11669517,T,IEX,20.905000,100
2019-10-23 19:38:43.295024896,2019-10-23 19:38:43.295007293,11695746,T,IEX,20.890000,400
2019-10-23 19:38:45.759227904,2019-10-23 19:38:45.759206473,11697060,T,IEX,20.900000,36
2019-10-23 19:40:33.422364928,2019-10-23 19:40:33.422341043,11752847,T,IEX,20.925000,100
2019-10-23 19:40:53.39792896,2019-10-23 19:40:53.39771656,11763784,T,IEX,20.905000,42
2019-10-23 19:44:39.386802944,2019-10-23 19:44:39.386784160,11873361,T,IEX,20.895000,500
2019-10-23 19:45:39.672558080,2019-10-23 19:45:39.672538866,11913984,T,IEX,20.870000,73
2019-10-23 19:45:49.141957888,2019-10-23 19:45:49.141936376,11919577,T,IEX,20.875000,100
2019-10-23 19:46:04.29286912,2019-10-23 19:46:04.29263350,11929126,T,IEX,20.880000,400
2019-10-23 19:46:04.29345024,2019-10-23 19:46:04.29324732,11929132,T,IEX,20.880000,400
2019-10-23 19:46:36.485694976,2019-10-23 19:46:36.485673198,11950719,T,IEX,20.895000,471
2019-10-23 19:46:36.485707008,2019-10-23 19:46:36.485688656,11950720,T,IEX,20.895000,102
2019-10-23 19:46:42.821889024,2019-10-23 19:46:42.821871508,11954938,T,IEX,20.895000,498
2019-10-23 19:47:00.44438016,2019-10-23 19:47:00.44417180,11964063,T,IEX,20.890000,100
2019-10-23 19:48:09.504653056,2019-10-23 19:48:09.504633138,12004199,T,IEX,20.885000,600
2019-10-23 19:48:24.64428032,2019-10-23 19:48:24.64406518,12012459,T,IEX,20.885000,200
2019-10-23 19:48:24.64487936,2019-10-23 19:48:24.64453763,12012463,T,IEX,20.885000,300
2019-10-23 19:49:13.94214912,2019-10-23 19:49:13.94186299,12048046,T,IEX,20.875000,700
2019-10-23 19:49:13.94246912,2019-10-23 19:49:13.94216447,12048048,T,IEX,20.875000,119
2019-10-23 19:49:18.163694080,2019-10-23 19:49:18.163672398,12051587,T,IEX,20.875000,172
2019-10-23 19:50:01.250107904,2019-10-23 19:50:01.250078093,12081197,T,IEX,20.865000,100
2019-10-23 19:50:01.250123008,2019-10-23 19:50:01.250103696,12081200,T,IEX,20.865000,400
2019-10-23 19:50:01.255730944,2019-10-23 19:50:01.255708904,12081472,T,IEX,20.850000,100
2019-10-23 19:50:01.255749888,2019-10-23 19:50:01.255731972,12081473,T,IEX,20.850000,300
2019-10-23 19:50:01.262195968,2019-10-23 19:50:01.262177002,12081720,T,IEX,20.850000,100
2019-10-23 19:50:19.518241024,2019-10-23 19:50:19.518222124,12111532,T,IEX,20.850000,400
2019-10-23 19:50:23.71207936,2019-10-23 19:50:23.71187899,12113494,T,IEX,20.845000,500
2019-10-23 19:50:46.184673024,2019-10-23 19:50:46.184653662,12128029,T,IEX,20.830000,400
2019-10-23 19:50:46.184685056,2019-10-23 19:50:46.184667349,12128030,T,IEX,20.830000,400
2019-10-23 19:50:49.4935936,2019-10-23 19:50:49.4917176,12131235,T,IEX,20.830000,400
2019-10-23 19:50:49.4946944,2019-10-23 19:50:49.4930018,12131236,T,IEX,20.830000,400
2019-10-23 19:50:55.140439040,2019-10-23 19:50:55.140419918,12135644,T,IEX,20.825000,100
2019-10-23 19:51:04.417837056,2019-10-23 19:51:04.417817460,12141560,T,IEX,20.825000,200
2019-10-23 19:51:11.323350016,2019-10-23 19:51:11.323330227,12147809,T,IEX,20.825000,100
2019-10-23 19:51:11.323409920,2019-10-23 19:51:11.323389654,12147813,T,IEX,20.825000,100
2019-10-23 19:51:12.644462080,2019-10-23 19:51:12.644445681,12149622,T,IEX,20.820000,100
2019-10-23 19:51:30.907166976,2019-10-23 19:51:30.907146872,12161193,T,IEX,20.825000,100
2019-10-23 19:52:19.44979968,2019-10-23 19:52:19.44957353,12195344,T,IEX,20.810000,100
2019-10-23 19:52:24.637588992,2019-10-23 19:52:24.637568022,12198876,T,IEX,20.810000,300
2019-10-23 19:52:24.637603072,2019-10-23 19:52:24.637584835,12198877,T,IEX,20.810000,400
2019-10-23 19:52:24.639304960,2019-10-23 19:52:24.639286448,12198906,T,IEX,20.805000,200
2019-10-23 19:52:24.655590912,2019-10-23 19:52:24.655573007,12198938,T,IEX,20.810000,400
2019-10-23 19:52:54.43397888,2019-10-23 19:52:54.43380282,12219841,T,IEX,20.810000,300
2019-10-23 19:53:01.163449088,2019-10-23 19:53:01.163428423,12224997,T,IEX,20.815000,100
2019-10-23 19:53:01.319013120,2019-10-23 19:53:01.318994647,12225141,T,IEX,20.815000,200
2019-10-23 19:53:05.69721088,2019-10-23 19:53:05.69701132,12228671,T,IEX,20.810000,100
2019-10-23 19:53:18.235535872,2019-10-23 19:53:18.235519033,12238808,T,IEX,20.815000,484
2019-10-23 19:53:32.53349120,2019-10-23 19:53:32.53327908,12249010,T,IEX,20.815000,100
2019-10-23 19:53:50.384792064,2019-10-23 19:53:50.384773660,12262558,T,IEX,20.815000,100
2019-10-23 19:53:58.903689984,2019-10-23 19:53:58.903665061,12269485,T,IEX,20.825000,571
2019-10-23 19:54:00.379058944,2019-10-23 19:54:00.379041940,12272412,T,IEX,20.830000,339
2019-10-23 19:54:00.422503936,2019-10-23 19:54:00.422487377,12274178,T,IEX,20.830000,400
2019-10-23 19:54:00.422525952,2019-10-23 19:54:00.422507070,12274180,T,IEX,20.830000,400
2019-10-23 19:54:00.422536960,2019-10-23 19:54:00.422515451,12274181,T,IEX,20.830000,400
2019-10-23 19:54:00.423322880,2019-10-23 19:54:00.423305993,12274216,T,IEX,20.830000,400
2019-10-23 19:54:00.430371072,2019-10-23 19:54:00.430352759,12274557,T,IEX,20.845000,200
2019-10-23 19:54:00.459184128,2019-10-23 19:54:00.459165678,12275553,T,IEX,20.840000,60
2019-10-23 19:54:01.781771008,2019-10-23 19:54:01.781752456,12280403,T,IEX,20.840000,300
2019-10-23 19:54:07.427727872,2019-10-23 19:54:07.427709807,12287152,T,IEX,20.850000,200
2019-10-23 19:54:27.42158080,2019-10-23 19:54:27.42141309,12305611,T,IEX,20.865000,100
2019-10-23 19:54:38.599151104,2019-10-23 19:54:38.599121676,12314776,T,IEX,20.865000,692
2019-10-23 19:54:46.139281920,2019-10-23 19:54:46.139261036,12322408,T,IEX,20.865000,200
2019-10-23 19:54:52.338321920,2019-10-23 19:54:52.338303886,12328535,T,IEX,20.870000,300
2019-10-23 19:54:53.374493952,2019-10-23 19:54:53.374477304,12329275,T,IEX,20.870000,200
2019-10-23 19:55:50.580066048,2019-10-23 19:55:50.580045026,12396120,T,IEX,20.830000,400
2019-10-23 19:55:51.56359936,2019-10-23 19:55:51.56338593,12396470,T,IEX,20.830000,300
2019-10-23 19:55:51.87782912,2019-10-23 19:55:51.87763898,12396501,T,IEX,20.830000,100
2019-10-23 19:55:51.164692992,2019-10-23 19:55:51.164675996,12396598,T,IEX,20.830000,400
2019-10-23 19:55:53.41314048,2019-10-23 19:55:53.41295655,12398392,T,IEX,20.830000,100
2019-10-23 19:55:53.93629952,2019-10-23 19:55:53.93608208,12398446,T,IEX,20.830000,200
2019-10-23 19:55:54.714380032,2019-10-23 19:55:54.714357897,12400221,T,IEX,20.830000,100
2019-10-23 19:55:54.714388992,2019-10-23 19:55:54.714367462,12400222,T,IEX,20.830000,200
2019-10-23 19:55:55.117240064,2019-10-23 19:55:55.117220394,12400558,T,IEX,20.830000,200
2019-10-23 19:55:56.766508032,2019-10-23 19:55:56.766487273,12402141,T,IEX,20.830000,400
2019-10-23 19:55:59.30247936,2019-10-23 19:55:59.30226010,12403889,T,IEX,20.830000,400
2019-10-23 19:55:59.30259968,2019-10-23 19:55:59.30242612,12403890,T,IEX,20.830000,100
2019-10-23 19:56:00.3849984,2019-10-23 19:56:00.3827377,12404693,T,IEX,20.825000,100
2019-10-23 19:56:00.14365952,2019-10-23 19:56:00.14345152,12404731,T,IEX,20.825000,60
2019-10-23 19:56:00.468804096,2019-10-23 19:56:00.468786698,12405575,T,IEX,20.825000,100
2019-10-23 19:56:00.474821120,2019-10-23 19:56:00.474802313,12405590,T,IEX,20.820000,400
2019-10-23 19:56:00.482561024,2019-10-23 19:56:00.482540724,12405607,T,IEX,20.825000,200
2019-10-23 19:56:07.462244096,2019-10-23 19:56:07.462227394,12412730,T,IEX,20.830000,300
2019-10-23 19:56:08.539986944,2019-10-23 19:56:08.539966821,12413617,T,IEX,20.830000,300
2019-10-23 19:56:10.814115072,2019-10-23 19:56:10.814094196,12415996,T,IEX,20.830000,100
2019-10-23 19:56:10.814130944,2019-10-23 19:56:10.814113625,12415997,T,IEX,20.830000,100
2019-10-23 19:56:10.814149120,2019-10-23 19:56:10.814132176,12415998,T,IEX,20.830000,200
2019-10-23 19:56:14.93623040,2019-10-23 19:56:14.93605100,12419581,T,IEX,20.825000,200
2019-10-23 19:56:17.373262080,2019-10-23 19:56:17.373241762,12422390,T,IEX,20.830000,68
2019-10-23 19:56:20.5863936,2019-10-23 19:56:20.5845275,12424611,T,IEX,20.825000,600
2019-10-23 19:56:26.896911872,2019-10-23 19:56:26.896890633,12430476,T,IEX,20.830000,132
2019-10-23 19:56:26.896921088,2019-10-23 19:56:26.896899832,12430477,T,IEX,20.830000,268
2019-10-23 19:56:27.945393920,2019-10-23 19:56:27.945372122,12431319,T,IEX,20.830000,132
2019-10-23 19:56:27.945409024,2019-10-23 19:56:27.945392252,12431320,T,IEX,20.830000,268
2019-10-23 19:56:29.83538944,2019-10-23 19:56:29.83519624,12432240,T,IEX,20.830000,132
2019-10-23 19:56:29.83552000,2019-10-23 19:56:29.83535495,12432241,T,IEX,20.830000,268
2019-10-23 19:56:30.10371072,2019-10-23 19:56:30.10351553,12432915,T,IEX,20.825000,59
2019-10-23 19:56:33.731106048,2019-10-23 19:56:33.731085134,12436780,T,IEX,20.825000,400
2019-10-23 19:56:35.93457920,2019-10-23 19:56:35.93441192,12437768,T,IEX,20.830000,132
2019-10-23 19:56:35.93470976,2019-10-23 19:56:35.93450034,12437769,T,IEX,20.830000,68
2019-10-23 19:56:35.662274048,2019-10-23 19:56:35.662251683,12438410,T,IEX,20.830000,332
2019-10-23 19:56:35.662283008,2019-10-23 19:56:35.662264270,12438411,T,IEX,20.830000,68
2019-10-23 19:56:44.94907904,2019-10-23 19:56:44.94888004,12445484,T,IEX,20.825000,100
2019-10-23 19:56:50.4583936,2019-10-23 19:56:50.4562434,12450647,T,IEX,20.820000,200
2019-10-23 19:56:52.55739904,2019-10-23 19:56:52.55720612,12452869,T,IEX,20.825000,100
2019-10-23 19:56:58.75835904,2019-10-23 19:56:58.75818162,12458431,T,IEX,20.825000,100
2019-10-23 19:57:01.114275072,2019-10-23 19:57:01.114254205,12461460,T,IEX,20.825000,100
2019-10-23 19:57:06.842505984,2019-10-23 19:57:06.842487323,12467869,T,IEX,20.830000,100
2019-10-23 19:57:08.17242880,2019-10-23 19:57:08.17222517,12469094,T,IEX,20.830000,100
2019-10-23 19:57:08.245268992,2019-10-23 19:57:08.245251498,12469717,T,IEX,20.830000,92
2019-10-23 19:57:10.84280064,2019-10-23 19:57:10.84261588,12471747,T,IEX,20.830000,200
2019-10-23 19:57:12.56832000,2019-10-23 19:57:12.56809985,12473561,T,IEX,20.830000,100
2019-10-23 19:57:14.64282112,2019-10-23 19:57:14.64264913,12475583,T,IEX,20.830000,200
2019-10-23 19:57:15.116461056,2019-10-23 19:57:15.116440100,12476563,T,IEX,20.830000,200
2019-10-23 19:57:18.208510976,2019-10-23 19:57:18.208489714,12479916,T,IEX,20.830000,200
2019-10-23 19:57:20.3272960,2019-10-23 19:57:20.3250207,12481472,T,IEX,20.825000,100
2019-10-23 19:57:20.861028096,2019-10-23 19:57:20.861010484,12482410,T,IEX,20.825000,100
2019-10-23 19:57:20.861036032,2019-10-23 19:57:20.861018822,12482411,T,IEX,20.825000,100
2019-10-23 19:57:20.861056000,2019-10-23 19:57:20.861039551,12482412,T,IEX,20.825000,100
2019-10-23 19:57:35.4431104,2019-10-23 19:57:35.4413020,12499814,T,IEX,20.805000,100
2019-10-23 19:57:50.3805952,2019-10-23 19:57:50.3785765,12515610,T,IEX,20.815000,100
2019-10-23 19:57:54.639528960,2019-10-23 19:57:54.639507966,12519302,T,IEX,20.815000,40
2019-10-23 19:58:05.3696128,2019-10-23 19:58:05.3678556,12530480,T,IEX,20.815000,100
2019-10-23 19:58:11.641104896,2019-10-23 19:58:11.641085333,12538639,T,IEX,20.815000,100
2019-10-23 19:58:13.94298880,2019-10-23 19:58:13.94279386,12540173,T,IEX,20.820000,100
2019-10-23 19:58:15.3706880,2019-10-23 19:58:15.3687042,12542023,T,IEX,20.815000,200
2019-10-23 19:58:15.9273088,2019-10-23 19:58:15.9256111,12542032,T,IEX,20.815000,59
2019-10-23 19:58:23.37668096,2019-10-23 19:58:23.37649812,12550751,T,IEX,20.815000,100
2019-10-23 19:58:23.39251968,2019-10-23 19:58:23.39229750,12550794,T,IEX,20.815000,200
2019-10-23 19:58:27.75316992,2019-10-23 19:58:27.75301359,12555106,T,IEX,20.815000,200
2019-10-23 19:58:31.41756928,2019-10-23 19:58:31.41738262,12559477,T,IEX,20.815000,100
2019-10-23 19:58:31.42874112,2019-10-23 19:58:31.42855928,12559483,T,IEX,20.815000,100
2019-10-23 19:58:37.75506944,2019-10-23 19:58:37.75489968,12566426,T,IEX,20.815000,200
2019-10-23 19:58:41.93873920,2019-10-23 19:58:41.93854415,12570346,T,IEX,20.815000,100
2019-10-23 19:58:43.556549120,2019-10-23 19:58:43.556532827,12573611,T,IEX,20.815000,200
2019-10-23 19:58:51.620674048,2019-10-23 19:58:51.620655328,12581697,T,IEX,20.815000,100
2019-10-23 19:58:55.410228992,2019-10-23 19:58:55.410206164,12586213,T,IEX,20.815000,200
2019-10-23 19:58:56.399404032,2019-10-23 19:58:56.399383030,12587212,T,IEX,20.815000,1100
2019-10-23 19:58:56.399418880,2019-10-23 19:58:56.399402697,12587213,T,IEX,20.815000,200
2019-10-23 19:59:05.3546880,2019-10-23 19:59:05.3529581,12600151,T,IEX,20.805000,100
2019-10-23 19:59:20.580399104,2019-10-23 19:59:20.580377180,12628106,T,IEX,20.775000,100
2019-10-23 19:59:22.405147904,2019-10-23 19:59:22.405130349,12630367,T,IEX,20.775000,200
2019-10-23 19:59:23.210198016,2019-10-23 19:59:23.210178330,12631225,T,IEX,20.770000,100
2019-10-23 19:59:23.697200128,2019-10-23 19:59:23.697182816,12631686,T,IEX,20.770000,75
2019-10-23 19:59:25.17102080,2019-10-23 19:59:25.17086148,12633226,T,IEX,20.770000,100
2019-10-23 19:59:27.94437120,2019-10-23 19:59:27.94410646,12635640,T,IEX,20.775000,100
2019-10-23 19:59:27.94468096,2019-10-23 19:59:27.94439710,12635642,T,IEX,20.775000,400
2019-10-23 19:59:27.128609024,2019-10-23 19:59:27.128590495,12636090,T,IEX,20.780000,100
2019-10-23 19:59:28.749146880,2019-10-23 19:59:28.749124177,12638088,T,IEX,20.775000,100
2019-10-23 19:59:30.110387968,2019-10-23 19:59:30.110370650,12641683,T,IEX,20.780000,100
2019-10-23 19:59:33.946590976,2019-10-23 19:59:33.946570963,12659797,T,IEX,20.775000,100
2019-10-23 19:59:36.789705984,2019-10-23 19:59:36.789680654,12672645,T,IEX,20.765000,200
2019-10-23 19:59:39.876256000,2019-10-23 19:59:39.876235068,12690174,T,IEX,20.755000,100
2019-10-23 19:59:44.70094080,2019-10-23 19:59:44.70076666,12717104,T,IEX,20.750000,200
