2019-10-15 13:38:35.371614976,2019-10-15 13:38:35.371592140,619512,T,IEX,29.375000,100
2019-10-15 13:49:59.853978112,2019-10-15 13:49:59.853959485,1188497,T,IEX,29.335000,100
2019-10-15 13:55:27.856595968,2019-10-15 13:55:27.856578248,1443037,T,IEX,29.375000,100
2019-10-15 14:05:48.761351936,2019-10-15 14:05:48.761333245,1909813,T,IEX,29.310000,500
2019-10-15 14:06:47.759355904,2019-10-15 14:06:47.759340184,1951594,T,IEX,29.305000,40
2019-10-15 14:08:17.51536896,2019-10-15 14:08:17.51518532,2003332,T,IEX,29.305000,100
2019-10-15 14:08:17.592364032,2019-10-15 14:08:17.592343272,2003578,T,IEX,29.305000,200
2019-10-15 14:09:48.325069056,2019-10-15 14:09:48.325042982,2059968,T,IEX,29.295000,200
2019-10-15 14:10:17.792393984,2019-10-15 14:10:17.792376150,2087031,T,IEX,29.285000,800
2019-10-15 14:10:20.581829888,2019-10-15 14:10:20.581812280,2090006,T,IEX,29.275000,300
2019-10-15 14:10:20.583250944,2019-10-15 14:10:20.583234947,2090012,T,IEX,29.275000,300
2019-10-15 14:10:20.584293888,2019-10-15 14:10:20.584276387,2090022,T,IEX,29.275000,300
2019-10-15 14:10:20.585282048,2019-10-15 14:10:20.585263637,2090028,T,IEX,29.275000,300
2019-10-15 14:11:27.584236032,2019-10-15 14:11:27.584214727,2145333,T,IEX,29.260000,1200
2019-10-15 14:13:30.294417920,2019-10-15 14:13:30.294390009,2239515,T,IEX,29.230000,200
2019-10-15 14:17:09.812296960,2019-10-15 14:17:09.812277807,2400991,T,IEX,29.200000,200
2019-10-15 14:18:00.658240000,2019-10-15 14:18:00.658218937,2431416,T,IEX,29.195000,200
2019-10-15 14:18:10.102322944,2019-10-15 14:18:10.102303705,2438514,T,IEX,29.200000,300
2019-10-15 14:18:27.441786880,2019-10-15 14:18:27.441766458,2451016,T,IEX,29.195000,700
2019-10-15 14:19:22.34618880,2019-10-15 14:19:22.34597735,2488280,T,IEX,29.200000,524
2019-10-15 14:19:22.55991040,2019-10-15 14:19:22.55972021,2488889,T,IEX,29.200000,1000
2019-10-15 14:19:23.29694976,2019-10-15 14:19:23.29678262,2490654,T,IEX,29.200000,900
2019-10-15 14:19:44.53387008,2019-10-15 14:19:44.53369228,2505672,T,IEX,29.195000,300
2019-10-15 14:19:44.54287104,2019-10-15 14:19:44.54270399,2505674,T,IEX,29.195000,300
2019-10-15 14:19:56.473115904,2019-10-15 14:19:56.473095836,2512778,T,IEX,29.200000,100
2019-10-15 14:20:34.963497984,2019-10-15 14:20:34.963477308,2540022,T,IEX,29.195000,100
2019-10-15 14:20:46.540292096,2019-10-15 14:20:46.540271425,2547284,T,IEX,29.195000,200
2019-10-15 14:20:48.437118976,2019-10-15 14:20:48.437100142,2548944,T,IEX,29.195000,100
2019-10-15 14:20:52.421743104,2019-10-15 14:20:52.421722930,2551309,T,IEX,29.195000,300
2019-10-15 14:20:55.158614016,2019-10-15 14:20:55.158594601,2552440,T,IEX,29.195000,100
2019-10-15 14:23:26.350297088,2019-10-15 14:23:26.350278585,2643421,T,IEX,29.215000,100
2019-10-15 14:23:35.210512896,2019-10-15 14:23:35.210486829,2648113,T,IEX,29.215000,100
2019-10-15 14:23:35.211401984,2019-10-15 14:23:35.211380451,2648148,T,IEX,29.215000,100
2019-10-15 14:24:02.387703040,2019-10-15 14:24:02.387683095,2666145,T,IEX,29.220000,100
2019-10-15 14:29:41.890812928,2019-10-15 14:29:41.890795534,3051061,T,IEX,29.130000,900
2019-10-15 14:29:41.891969024,2019-10-15 14:29:41.891950370,3051064,T,IEX,29.130000,100
2019-10-15 14:33:06.843034112,2019-10-15 14:33:06.843013467,3318482,T,IEX,29.115000,300
2019-10-15 14:34:07.24635904,2019-10-15 14:34:07.24616976,3377805,T,IEX,29.115000,100
2019-10-15 14:42:54.685213952,2019-10-15 14:42:54.685194073,3976501,T,IEX,29.035000,100
2019-10-15 14:44:22.81515008,2019-10-15 14:44:22.81494883,4058823,T,IEX,29.015000,52
2019-10-15 14:47:08.5698048,2019-10-15 14:47:08.5680236,4222547,T,IEX,29.005000,100
2019-10-15 14:47:10.878938112,2019-10-15 14:47:10.878920436,4224129,T,IEX,29.005000,600
2019-10-15 14:47:12.345584896,2019-10-15 14:47:12.345568968,4225159,T,IEX,29.005000,600
2019-10-15 14:47:12.346823936,2019-10-15 14:47:12.346804283,4225161,T,IEX,29.005000,600
2019-10-15 14:47:12.348043008,2019-10-15 14:47:12.348023551,4225162,T,IEX,29.005000,600
2019-10-15 14:47:12.367792128,2019-10-15 14:47:12.367772162,4225175,T,IEX,29.005000,300
2019-10-15 14:47:12.367802112,2019-10-15 14:47:12.367784278,4225176,T,IEX,29.005000,200
2019-10-15 14:47:12.367816960,2019-10-15 14:47:12.367797991,4225177,T,IEX,29.005000,100
2019-10-15 14:47:12.401179904,2019-10-15 14:47:12.401162653,4225216,T,IEX,29.005000,600
2019-10-15 14:47:12.416093952,2019-10-15 14:47:12.416075663,4225221,T,IEX,29.005000,600
2019-10-15 14:47:12.506200064,2019-10-15 14:47:12.506182139,4225274,T,IEX,29.005000,600
2019-10-15 14:47:12.789018112,2019-10-15 14:47:12.788999226,4225428,T,IEX,29.005000,100
2019-10-15 14:47:12.789025024,2019-10-15 14:47:12.789006589,4225429,T,IEX,29.005000,300
2019-10-15 14:47:12.789039104,2019-10-15 14:47:12.789022286,4225430,T,IEX,29.005000,200
2019-10-15 14:47:12.790573056,2019-10-15 14:47:12.790555078,4225440,T,IEX,29.005000,100
2019-10-15 14:47:12.790586880,2019-10-15 14:47:12.790569829,4225441,T,IEX,29.005000,200
2019-10-15 14:47:12.790595072,2019-10-15 14:47:12.790577770,4225442,T,IEX,29.005000,200
2019-10-15 14:47:12.790606080,2019-10-15 14:47:12.790589888,4225443,T,IEX,29.005000,100
2019-10-15 14:47:12.792940032,2019-10-15 14:47:12.792917681,4225445,T,IEX,29.005000,200
2019-10-15 14:47:12.792948992,2019-10-15 14:47:12.792930733,4225446,T,IEX,29.005000,200
2019-10-15 14:47:12.792957952,2019-10-15 14:47:12.792939417,4225447,T,IEX,29.005000,100
2019-10-15 14:47:12.792965120,2019-10-15 14:47:12.792948084,4225448,T,IEX,29.005000,100
2019-10-15 14:47:12.972014080,2019-10-15 14:47:12.971995193,4225572,T,IEX,29.005000,300
2019-10-15 14:47:13.319260928,2019-10-15 14:47:13.319245666,4225977,T,IEX,29.005000,100
2019-10-15 14:47:13.338400000,2019-10-15 14:47:13.338382264,4226011,T,IEX,29.005000,100
2019-10-15 14:47:24.713185024,2019-10-15 14:47:24.713167195,4235071,T,IEX,29.000000,100
2019-10-15 14:48:02.53185024,2019-10-15 14:48:02.53166849,4264454,T,IEX,29.005000,100
2019-10-15 14:48:07.53455872,2019-10-15 14:48:07.53433916,4268031,T,IEX,29.005000,100
2019-10-15 14:57:19.82715904,2019-10-15 14:57:19.82698011,4719542,T,IEX,28.965000,100
2019-10-15 14:57:19.138415104,2019-10-15 14:57:19.138396710,4719584,T,IEX,28.965000,100
2019-10-15 14:57:19.138448896,2019-10-15 14:57:19.138430696,4719586,T,IEX,28.965000,42
2019-10-15 14:57:19.176679936,2019-10-15 14:57:19.176657593,4719737,T,IEX,28.965000,100
2019-10-15 14:57:19.213047040,2019-10-15 14:57:19.213026590,4719773,T,IEX,28.965000,100
2019-10-15 14:57:19.347467008,2019-10-15 14:57:19.347447589,4719867,T,IEX,28.965000,100
2019-10-15 14:57:26.83087872,2019-10-15 14:57:26.83066900,4723728,T,IEX,28.965000,100
2019-10-15 14:57:26.89780992,2019-10-15 14:57:26.89759889,4723729,T,IEX,28.965000,300
2019-10-15 14:57:26.90690048,2019-10-15 14:57:26.90674192,4723730,T,IEX,28.965000,1
2019-10-15 14:57:41.263064064,2019-10-15 14:57:41.263044792,4735918,T,IEX,28.965000,100
2019-10-15 15:00:40.437577984,2019-10-15 15:00:40.437560461,4902052,T,IEX,28.950000,100
2019-10-15 15:00:40.438146048,2019-10-15 15:00:40.438119696,4902078,T,IEX,28.945000,100
2019-10-15 15:00:40.438161920,2019-10-15 15:00:40.438136469,4902079,T,IEX,28.945000,100
2019-10-15 15:00:40.438174976,2019-10-15 15:00:40.438151583,4902081,T,IEX,28.945000,100
2019-10-15 15:04:51.115462912,2019-10-15 15:04:51.115444629,5149127,T,IEX,28.955000,103
2019-10-15 15:05:30.839975936,2019-10-15 15:05:30.839959078,5183347,T,IEX,28.970000,100
2019-10-15 15:09:28.69314048,2019-10-15 15:09:28.69298705,5362585,T,IEX,28.940000,26
2019-10-15 15:09:28.70259968,2019-10-15 15:09:28.70240739,5362588,T,IEX,28.940000,74
2019-10-15 15:09:28.70273024,2019-10-15 15:09:28.70255903,5362589,T,IEX,28.940000,101
2019-10-15 15:13:20.6153984,2019-10-15 15:13:20.6136038,5536222,T,IEX,28.990000,100
2019-10-15 15:13:52.210162944,2019-10-15 15:13:52.210146371,5556907,T,IEX,28.995000,100
2019-10-15 15:17:34.714326016,2019-10-15 15:17:34.714304821,5741967,T,IEX,29.020000,100
2019-10-15 15:23:25.434032896,2019-10-15 15:23:25.434013286,6057418,T,IEX,29.045000,200
2019-10-15 15:23:25.455083008,2019-10-15 15:23:25.455065695,6057507,T,IEX,29.045000,100
2019-10-15 15:32:45.309058048,2019-10-15 15:32:45.309038904,6423254,T,IEX,28.980000,100
2019-10-15 15:35:17.639443968,2019-10-15 15:35:17.639388924,6514354,T,IEX,29.020000,1000
2019-10-15 15:37:04.566108928,2019-10-15 15:37:04.566086609,6608418,T,IEX,29.030000,300
2019-10-15 16:08:31.22323968,2019-10-15 16:08:31.22303231,7507646,T,IEX,28.970000,85
2019-10-15 16:28:55.548841984,2019-10-15 16:28:55.548823173,8037545,T,IEX,29.010000,100
2019-10-15 16:29:28.499798016,2019-10-15 16:29:28.499778495,8057688,T,IEX,29.010000,100
2019-10-15 16:34:24.460518912,2019-10-15 16:34:24.460499501,8177944,T,IEX,29.005000,100
2019-10-15 16:34:44.350312960,2019-10-15 16:34:44.350296777,8184606,T,IEX,29.005000,100
2019-10-15 16:34:57.373526016,2019-10-15 16:34:57.373506659,8189444,T,IEX,29.005000,100
2019-10-15 16:36:20.766212096,2019-10-15 16:36:20.766194630,8216178,T,IEX,29.015000,200
2019-10-15 16:38:16.249274880,2019-10-15 16:38:16.249259471,8252988,T,IEX,28.995000,100
2019-10-15 16:54:55.48165888,2019-10-15 16:54:55.48148714,8590332,T,IEX,28.980000,100
2019-10-15 16:58:24.832745984,2019-10-15 16:58:24.832725026,8675308,T,IEX,28.960000,100
2019-10-15 17:03:14.580323072,2019-10-15 17:03:14.580303051,8785617,T,IEX,28.955000,100
2019-10-15 17:34:30.647908096,2019-10-15 17:34:30.647887320,9422716,T,IEX,28.970000,100
2019-10-15 17:50:07.377219072,2019-10-15 17:50:07.377199523,9734943,T,IEX,28.940000,200
2019-10-15 17:50:07.377227008,2019-10-15 17:50:07.377210967,9734944,T,IEX,28.940000,47
2019-10-15 17:51:43.943724032,2019-10-15 17:51:43.943698617,9769818,T,IEX,28.925000,10
2019-10-15 17:56:32.2398976,2019-10-15 17:56:32.2371167,9873305,T,IEX,28.910000,200
2019-10-15 18:00:24.56768000,2019-10-15 18:00:24.56741705,9955211,T,IEX,28.930000,200
2019-10-15 18:25:02.131124992,2019-10-15 18:25:02.131106316,10466796,T,IEX,28.895000,200
2019-10-15 18:26:17.276624896,2019-10-15 18:26:17.276606903,10490835,T,IEX,28.900000,100
2019-10-15 18:27:01.162284032,2019-10-15 18:27:01.162262242,10505998,T,IEX,28.905000,400
2019-10-15 18:27:56.960355072,2019-10-15 18:27:56.960334931,10528270,T,IEX,28.905000,600
2019-10-15 18:29:31.925232896,2019-10-15 18:29:31.925215879,10567999,T,IEX,28.915000,100
2019-10-15 18:30:32.22614016,2019-10-15 18:30:32.22594087,10589451,T,IEX,28.920000,800
2019-10-15 18:30:32.22651904,2019-10-15 18:30:32.22630986,10589453,T,IEX,28.920000,300
2019-10-15 18:33:01.964557056,2019-10-15 18:33:01.964539359,10647092,T,IEX,28.920000,200
2019-10-15 18:33:01.965534976,2019-10-15 18:33:01.965515957,10647113,T,IEX,28.920000,100
2019-10-15 18:35:51.613384960,2019-10-15 18:35:51.613359869,10707507,T,IEX,28.930000,100
2019-10-15 18:35:51.613396992,2019-10-15 18:35:51.613378330,10707509,T,IEX,28.930000,100
2019-10-15 18:35:51.613408000,2019-10-15 18:35:51.613389814,10707510,T,IEX,28.930000,100
2019-10-15 18:35:51.613464064,2019-10-15 18:35:51.613443178,10707512,T,IEX,28.930000,100
2019-10-15 18:35:51.613477120,2019-10-15 18:35:51.613454118,10707513,T,IEX,28.930000,200
2019-10-15 18:35:51.613494016,2019-10-15 18:35:51.613466391,10707515,T,IEX,28.930000,100
2019-10-15 18:36:48.529619968,2019-10-15 18:36:48.529601934,10725214,T,IEX,28.930000,500
2019-10-15 18:36:48.529655040,2019-10-15 18:36:48.529634113,10725217,T,IEX,28.930000,200
2019-10-15 18:38:24.149464064,2019-10-15 18:38:24.149446749,10755872,T,IEX,28.935000,100
2019-10-15 18:42:38.319672064,2019-10-15 18:42:38.319652041,10850053,T,IEX,28.925000,100
2019-10-15 18:42:43.949270016,2019-10-15 18:42:43.949251394,10852151,T,IEX,28.930000,1200
2019-10-15 18:45:51.163918080,2019-10-15 18:45:51.163899427,10912422,T,IEX,28.930000,100
2019-10-15 18:49:09.443692032,2019-10-15 18:49:09.443673470,10982758,T,IEX,28.940000,100
2019-10-15 18:52:22.971862016,2019-10-15 18:52:22.971781113,11055655,T,IEX,28.940000,30
2019-10-15 18:52:22.971862016,2019-10-15 18:52:22.971781113,11055656,T,IEX,28.940000,70
2019-10-15 18:52:22.974036992,2019-10-15 18:52:22.974017477,11055657,T,IEX,28.940000,100
2019-10-15 18:53:12.691369984,2019-10-15 18:53:12.691353676,11069680,T,IEX,28.940000,200
2019-10-15 18:53:12.692534016,2019-10-15 18:53:12.692513408,11069681,T,IEX,28.940000,100
2019-10-15 18:53:36.972419072,2019-10-15 18:53:36.972394930,11077325,T,IEX,28.940000,200
2019-10-15 18:53:36.974661120,2019-10-15 18:53:36.974640219,11077326,T,IEX,28.940000,100
2019-10-15 18:54:34.46714880,2019-10-15 18:54:34.46693901,11095631,T,IEX,28.950000,839
2019-10-15 18:54:34.46740992,2019-10-15 18:54:34.46717037,11095633,T,IEX,28.950000,100
2019-10-15 18:56:27.241263104,2019-10-15 18:56:27.241244362,11137141,T,IEX,28.950000,210
2019-10-15 18:56:34.427088896,2019-10-15 18:56:34.427067530,11139433,T,IEX,28.950000,100
2019-10-15 18:56:34.427392000,2019-10-15 18:56:34.427373358,11139450,T,IEX,28.950000,1135
2019-10-15 18:56:34.427403008,2019-10-15 18:56:34.427384857,11139451,T,IEX,28.950000,65
2019-10-15 18:56:34.427769088,2019-10-15 18:56:34.427750656,11139474,T,IEX,28.950000,735
2019-10-15 18:56:34.427791104,2019-10-15 18:56:34.427769098,11139476,T,IEX,28.950000,300
2019-10-15 18:56:34.427802112,2019-10-15 18:56:34.427781347,11139477,T,IEX,28.950000,300
2019-10-15 18:56:34.427891968,2019-10-15 18:56:34.427873895,11139483,T,IEX,28.950000,100
2019-10-15 19:00:00.69097984,2019-10-15 19:00:00.69078264,11240641,T,IEX,28.970000,100
2019-10-15 19:01:05.38405120,2019-10-15 19:01:05.38387907,11268771,T,IEX,28.980000,100
2019-10-15 19:01:05.472850944,2019-10-15 19:01:05.472832381,11268888,T,IEX,28.980000,200
2019-10-15 19:01:05.472872960,2019-10-15 19:01:05.472854220,11268890,T,IEX,28.980000,100
2019-10-15 19:02:58.13891072,2019-10-15 19:02:58.13873489,11309359,T,IEX,28.990000,100
2019-10-15 19:09:31.894141952,2019-10-15 19:09:31.894118813,11453060,T,IEX,28.990000,30
2019-10-15 19:09:33.775844096,2019-10-15 19:09:33.775824626,11454028,T,IEX,28.990000,100
2019-10-15 19:09:33.775862016,2019-10-15 19:09:33.775844295,11454029,T,IEX,28.990000,100
2019-10-15 19:09:58.80258048,2019-10-15 19:09:58.80238801,11465252,T,IEX,28.995000,100
2019-10-15 19:10:53.782577920,2019-10-15 19:10:53.782558394,11483730,T,IEX,29.000000,800
2019-10-15 19:10:53.783179008,2019-10-15 19:10:53.783161400,11483752,T,IEX,29.000000,200
2019-10-15 19:10:53.783192064,2019-10-15 19:10:53.783173699,11483753,T,IEX,29.000000,100
2019-10-15 19:10:53.783207936,2019-10-15 19:10:53.783190836,11483754,T,IEX,29.000000,100
2019-10-15 19:10:53.783233024,2019-10-15 19:10:53.783211296,11483755,T,IEX,29.000000,200
2019-10-15 19:10:53.783258112,2019-10-15 19:10:53.783232453,11483758,T,IEX,29.000000,200
2019-10-15 19:10:53.783269888,2019-10-15 19:10:53.783248661,11483760,T,IEX,29.000000,72
2019-10-15 19:12:11.89253888,2019-10-15 19:12:11.89233222,11509169,T,IEX,29.015000,100
2019-10-15 19:14:46.7496960,2019-10-15 19:14:46.7477534,11558959,T,IEX,29.005000,100
2019-10-15 19:14:46.14435072,2019-10-15 19:14:46.14419016,11558967,T,IEX,29.005000,100
2019-10-15 19:15:10.535023104,2019-10-15 19:15:10.534998088,11568176,T,IEX,29.010000,100
2019-10-15 19:15:10.541020928,2019-10-15 19:15:10.541002225,11568270,T,IEX,29.010000,100
2019-10-15 19:15:11.419190016,2019-10-15 19:15:11.419171326,11569068,T,IEX,29.010000,100
2019-10-15 19:15:11.419212032,2019-10-15 19:15:11.419193940,11569069,T,IEX,29.010000,100
2019-10-15 19:15:11.419236096,2019-10-15 19:15:11.419217042,11569070,T,IEX,29.010000,100
2019-10-15 19:15:11.419267072,2019-10-15 19:15:11.419243073,11569072,T,IEX,29.010000,200
2019-10-15 19:15:11.419284992,2019-10-15 19:15:11.419265704,11569073,T,IEX,29.010000,237
2019-10-15 19:15:11.419378944,2019-10-15 19:15:11.419361278,11569076,T,IEX,29.010000,86
2019-10-15 19:15:11.419425024,2019-10-15 19:15:11.419408058,11569079,T,IEX,29.010000,77
2019-10-15 19:15:11.421902080,2019-10-15 19:15:11.421881168,11569153,T,IEX,29.015000,200
2019-10-15 19:15:17.65080064,2019-10-15 19:15:17.65061332,11572602,T,IEX,29.020000,100
2019-10-15 19:19:29.582633984,2019-10-15 19:19:29.582615971,11669393,T,IEX,29.000000,100
2019-10-15 19:19:29.583878912,2019-10-15 19:19:29.583861097,11669470,T,IEX,29.000000,100
2019-10-15 19:21:53.973938944,2019-10-15 19:21:53.973911003,11717259,T,IEX,29.000000,100
2019-10-15 19:21:53.973950976,2019-10-15 19:21:53.973931360,11717261,T,IEX,29.000000,100
2019-10-15 19:21:53.973961984,2019-10-15 19:21:53.973943176,11717262,T,IEX,29.000000,100
2019-10-15 19:21:53.974044928,2019-10-15 19:21:53.974027394,11717267,T,IEX,29.000000,200
2019-10-15 19:21:53.974443008,2019-10-15 19:21:53.974424007,11717284,T,IEX,29.000000,200
2019-10-15 19:21:53.974736896,2019-10-15 19:21:53.974694607,11717296,T,IEX,29.000000,100
2019-10-15 19:21:53.974736896,2019-10-15 19:21:53.974694607,11717299,T,IEX,29.000000,100
2019-10-15 19:21:53.975768064,2019-10-15 19:21:53.975750418,11717355,T,IEX,29.000000,100
2019-10-15 19:21:53.975789056,2019-10-15 19:21:53.975771488,11717356,T,IEX,29.000000,100
2019-10-15 19:25:32.480291072,2019-10-15 19:25:32.480271281,11796619,T,IEX,28.980000,355
2019-10-15 19:26:59.473036032,2019-10-15 19:26:59.473018163,11836594,T,IEX,28.970000,400
2019-10-15 19:32:06.183714048,2019-10-15 19:32:06.183696338,11974749,T,IEX,28.950000,100
2019-10-15 19:32:22.689307904,2019-10-15 19:32:22.689289093,11983147,T,IEX,28.950000,100
2019-10-15 19:32:22.689417984,2019-10-15 19:32:22.689390715,11983153,T,IEX,28.950000,300
2019-10-15 19:32:37.596925952,2019-10-15 19:32:37.596908267,11991350,T,IEX,28.960000,100
2019-10-15 19:32:37.596937984,2019-10-15 19:32:37.596920993,11991351,T,IEX,28.960000,100
2019-10-15 19:32:37.596953088,2019-10-15 19:32:37.596936233,11991352,T,IEX,28.960000,100
2019-10-15 19:32:37.596969984,2019-10-15 19:32:37.596952027,11991353,T,IEX,28.960000,100
2019-10-15 19:32:37.597030912,2019-10-15 19:32:37.597012872,11991356,T,IEX,28.960000,100
2019-10-15 19:32:37.597043968,2019-10-15 19:32:37.597026784,11991357,T,IEX,28.960000,100
2019-10-15 19:33:35.387345920,2019-10-15 19:33:35.387322932,12025433,T,IEX,28.990000,100
2019-10-15 19:34:40.812073984,2019-10-15 19:34:40.812054864,12069564,T,IEX,28.980000,100
2019-10-15 19:35:46.568963072,2019-10-15 19:35:46.568944484,12104751,T,IEX,28.970000,100
2019-10-15 19:36:52.217716992,2019-10-15 19:36:52.217689682,12133387,T,IEX,28.980000,100
2019-10-15 19:36:52.217754112,2019-10-15 19:36:52.217722952,12133389,T,IEX,28.980000,100
2019-10-15 19:36:52.217769984,2019-10-15 19:36:52.217739426,12133392,T,IEX,28.980000,100
2019-10-15 19:36:52.217788928,2019-10-15 19:36:52.217757837,12133396,T,IEX,28.980000,100
2019-10-15 19:36:52.217805056,2019-10-15 19:36:52.217786128,12133397,T,IEX,28.980000,100
2019-10-15 19:36:52.218156032,2019-10-15 19:36:52.218129962,12133424,T,IEX,28.980000,200
2019-10-15 19:36:52.218184960,2019-10-15 19:36:52.218166619,12133426,T,IEX,28.980000,100
2019-10-15 19:36:52.218201088,2019-10-15 19:36:52.218183763,12133427,T,IEX,28.980000,100
2019-10-15 19:36:52.218281984,2019-10-15 19:36:52.218255144,12133432,T,IEX,28.980000,100
2019-10-15 19:36:52.218322944,2019-10-15 19:36:52.218297067,12133437,T,IEX,28.980000,200
2019-10-15 19:36:52.218467072,2019-10-15 19:36:52.218446329,12133442,T,IEX,28.980000,100
2019-10-15 19:36:52.218917120,2019-10-15 19:36:52.218898011,12133453,T,IEX,28.980000,200
2019-10-15 19:36:52.218937088,2019-10-15 19:36:52.218914858,12133455,T,IEX,28.980000,200
2019-10-15 19:36:52.218987008,2019-10-15 19:36:52.218970232,12133457,T,IEX,28.980000,200
2019-10-15 19:39:07.491458048,2019-10-15 19:39:07.491435930,12200578,T,IEX,28.990000,200
2019-10-15 19:39:12.187334912,2019-10-15 19:39:12.187314918,12204240,T,IEX,28.985000,80
2019-10-15 19:39:16.776176128,2019-10-15 19:39:16.776159218,12208392,T,IEX,28.975000,20
2019-10-15 19:39:16.776196096,2019-10-15 19:39:16.776180478,12208393,T,IEX,28.975000,120
2019-10-15 19:39:18.951133952,2019-10-15 19:39:18.951117374,12209934,T,IEX,28.980000,400
2019-10-15 19:39:19.381088000,2019-10-15 19:39:19.381070240,12210234,T,IEX,28.980000,200
2019-10-15 19:39:53.336755968,2019-10-15 19:39:53.336736191,12224428,T,IEX,28.990000,100
2019-10-15 19:39:53.336766976,2019-10-15 19:39:53.336745189,12224429,T,IEX,28.990000,100
2019-10-15 19:39:53.336780032,2019-10-15 19:39:53.336762736,12224430,T,IEX,28.990000,100
2019-10-15 19:39:53.336794112,2019-10-15 19:39:53.336775668,12224431,T,IEX,28.990000,100
2019-10-15 19:41:19.383776000,2019-10-15 19:41:19.383755013,12267308,T,IEX,28.990000,500
2019-10-15 19:42:29.577430016,2019-10-15 19:42:29.577413176,12301338,T,IEX,29.000000,100
2019-10-15 19:42:29.577447936,2019-10-15 19:42:29.577431473,12301339,T,IEX,29.000000,100
2019-10-15 19:42:29.577510912,2019-10-15 19:42:29.577493530,12301341,T,IEX,29.000000,41
2019-10-15 19:42:29.577521920,2019-10-15 19:42:29.577503323,12301342,T,IEX,29.000000,59
2019-10-15 19:42:29.577592064,2019-10-15 19:42:29.577571029,12301344,T,IEX,29.000000,41
2019-10-15 19:42:29.577616896,2019-10-15 19:42:29.577594497,12301346,T,IEX,29.000000,59
2019-10-15 19:42:29.577652992,2019-10-15 19:42:29.577635216,12301347,T,IEX,29.000000,41
2019-10-15 19:42:29.577667072,2019-10-15 19:42:29.577648940,12301348,T,IEX,29.000000,59
2019-10-15 19:42:29.577978880,2019-10-15 19:42:29.577961400,12301352,T,IEX,29.000000,41
2019-10-15 19:42:29.577993984,2019-10-15 19:42:29.577976263,12301353,T,IEX,29.000000,59
2019-10-15 19:42:38.147730944,2019-10-15 19:42:38.147701580,12305971,T,IEX,29.010000,807
2019-10-15 19:42:38.147755008,2019-10-15 19:42:38.147718955,12305974,T,IEX,29.010000,200
2019-10-15 19:42:38.147776000,2019-10-15 19:42:38.147753908,12305978,T,IEX,29.010000,100
2019-10-15 19:42:38.147791872,2019-10-15 19:42:38.147773566,12305979,T,IEX,29.010000,100
2019-10-15 19:44:19.266873088,2019-10-15 19:44:19.266849978,12357949,T,IEX,29.010000,100
2019-10-15 19:46:10.876889088,2019-10-15 19:46:10.876871811,12433992,T,IEX,28.995000,289
2019-10-15 19:46:11.116188928,2019-10-15 19:46:11.116171541,12434204,T,IEX,28.995000,100
2019-10-15 19:46:11.118137088,2019-10-15 19:46:11.118119217,12434214,T,IEX,28.995000,100
2019-10-15 19:47:30.979683072,2019-10-15 19:47:30.979660678,12479422,T,IEX,29.010000,500
2019-10-15 19:47:30.980683008,2019-10-15 19:47:30.980664311,12479451,T,IEX,29.010000,200
2019-10-15 19:47:57.143091968,2019-10-15 19:47:57.143072461,12495476,T,IEX,29.020000,100
2019-10-15 19:47:57.143137024,2019-10-15 19:47:57.143106814,12495479,T,IEX,29.020000,100
2019-10-15 19:47:57.143151104,2019-10-15 19:47:57.143126351,12495482,T,IEX,29.020000,100
2019-10-15 19:47:57.143219968,2019-10-15 19:47:57.143199506,12495484,T,IEX,29.020000,100
2019-10-15 19:47:57.143229952,2019-10-15 19:47:57.143210154,12495485,T,IEX,29.020000,200
2019-10-15 19:49:01.916348928,2019-10-15 19:49:01.916325894,12540355,T,IEX,29.020000,100
2019-10-15 19:49:01.923452928,2019-10-15 19:49:01.923432981,12540399,T,IEX,29.020000,100
2019-10-15 19:49:04.532300032,2019-10-15 19:49:04.532280998,12544047,T,IEX,29.030000,300
2019-10-15 19:49:36.62708992,2019-10-15 19:49:36.62689265,12567600,T,IEX,29.030000,700
2019-10-15 19:49:36.62771968,2019-10-15 19:49:36.62753988,12567603,T,IEX,29.030000,300
2019-10-15 19:50:02.94723072,2019-10-15 19:50:02.94700406,12593479,T,IEX,29.020000,400
2019-10-15 19:50:02.95240960,2019-10-15 19:50:02.95220378,12593498,T,IEX,29.020000,100
2019-10-15 19:50:08.506491904,2019-10-15 19:50:08.506468433,12599746,T,IEX,29.020000,100
2019-10-15 19:50:42.633210880,2019-10-15 19:50:42.633189007,12622400,T,IEX,29.005000,100
2019-10-15 19:50:42.633477888,2019-10-15 19:50:42.633458140,12622414,T,IEX,29.005000,148
2019-10-15 19:51:05.402728960,2019-10-15 19:51:05.402706803,12635953,T,IEX,29.010000,171
2019-10-15 19:51:05.403639040,2019-10-15 19:51:05.403622531,12635954,T,IEX,29.010000,428
2019-10-15 19:51:05.404563968,2019-10-15 19:51:05.404545319,12635955,T,IEX,29.010000,301
2019-10-15 19:51:05.404578048,2019-10-15 19:51:05.404562071,12635956,T,IEX,29.010000,300
2019-10-15 19:52:06.545309952,2019-10-15 19:52:06.545290736,12674293,T,IEX,29.010000,100
2019-10-15 19:52:06.545328896,2019-10-15 19:52:06.545308628,12674294,T,IEX,29.010000,2
2019-10-15 19:52:06.556817920,2019-10-15 19:52:06.556800414,12674685,T,IEX,29.010000,100
2019-10-15 19:52:06.556904960,2019-10-15 19:52:06.556886316,12674689,T,IEX,29.010000,100
2019-10-15 19:52:06.557144064,2019-10-15 19:52:06.557125728,12674700,T,IEX,29.010000,200
2019-10-15 19:53:08.223234048,2019-10-15 19:53:08.223212826,12719239,T,IEX,29.010000,118
2019-10-15 19:53:08.223269120,2019-10-15 19:53:08.223250353,12719240,T,IEX,29.010000,118
2019-10-15 19:53:41.829704960,2019-10-15 19:53:41.829676731,12743844,T,IEX,29.020000,200
2019-10-15 19:53:41.829831936,2019-10-15 19:53:41.829813485,12743850,T,IEX,29.020000,100
2019-10-15 19:53:41.829891072,2019-10-15 19:53:41.829871021,12743852,T,IEX,29.020000,200
2019-10-15 19:53:41.829923072,2019-10-15 19:53:41.829904854,12743853,T,IEX,29.020000,100
2019-10-15 19:53:41.831817984,2019-10-15 19:53:41.831799485,12743989,T,IEX,29.020000,100
2019-10-15 19:54:19.622254080,2019-10-15 19:54:19.622231407,12775295,T,IEX,29.030000,100
2019-10-15 19:54:28.716526080,2019-10-15 19:54:28.716504530,12781435,T,IEX,29.035000,80
2019-10-15 19:54:58.328252928,2019-10-15 19:54:58.328225463,12809661,T,IEX,29.030000,600
2019-10-15 19:54:58.328301056,2019-10-15 19:54:58.328264444,12809669,T,IEX,29.030000,100
2019-10-15 19:55:00.340720128,2019-10-15 19:55:00.340698924,12818180,T,IEX,29.010000,100
2019-10-15 19:55:08.116713984,2019-10-15 19:55:08.116693760,12840252,T,IEX,29.030000,100
2019-10-15 19:55:14.793842944,2019-10-15 19:55:14.793823629,12851735,T,IEX,29.030000,100
2019-10-15 19:55:14.793857024,2019-10-15 19:55:14.793838962,12851736,T,IEX,29.030000,100
2019-10-15 19:55:14.793880064,2019-10-15 19:55:14.793862042,12851738,T,IEX,29.030000,100
2019-10-15 19:55:18.83382016,2019-10-15 19:55:18.83361853,12855983,T,IEX,29.030000,100
2019-10-15 19:55:26.808931072,2019-10-15 19:55:26.808911939,12865947,T,IEX,29.030000,300
2019-10-15 19:55:26.808954112,2019-10-15 19:55:26.808933819,12865949,T,IEX,29.030000,100
2019-10-15 19:56:33.106759936,2019-10-15 19:56:33.106740748,12932905,T,IEX,29.015000,80
2019-10-15 19:56:33.409580032,2019-10-15 19:56:33.409560076,12933408,T,IEX,29.020000,216
2019-10-15 19:56:40.934222080,2019-10-15 19:56:40.934202046,12942361,T,IEX,29.030000,200
2019-10-15 19:56:40.934642944,2019-10-15 19:56:40.934620838,12942374,T,IEX,29.030000,100
2019-10-15 19:56:40.934659072,2019-10-15 19:56:40.934640450,12942375,T,IEX,29.030000,100
2019-10-15 19:56:40.934681088,2019-10-15 19:56:40.934662040,12942377,T,IEX,29.030000,200
2019-10-15 19:56:54.344655872,2019-10-15 19:56:54.344637197,12956015,T,IEX,29.030000,100
2019-10-15 19:56:54.344679936,2019-10-15 19:56:54.344656989,12956017,T,IEX,29.030000,50
2019-10-15 19:57:10.157918976,2019-10-15 19:57:10.157898435,12975160,T,IEX,29.035000,80
2019-10-15 19:57:10.158187008,2019-10-15 19:57:10.158170197,12975162,T,IEX,29.040000,100
2019-10-15 19:58:56.808316928,2019-10-15 19:58:56.808297697,13103375,T,IEX,29.010000,200
2019-10-15 19:59:14.763152896,2019-10-15 19:59:14.763134879,13137726,T,IEX,29.030000,100
