2019-10-17 13:30:04.605166080,2019-10-17 13:30:04.605144763,124018,T,IEX,270.775000,2
2019-10-17 13:30:04.605216000,2019-10-17 13:30:04.605196727,124019,T,IEX,270.775000,1
2019-10-17 13:30:05.67249920,2019-10-17 13:30:05.67228243,125220,T,IEX,270.775000,32
2019-10-17 13:30:33.43127040,2019-10-17 13:30:33.43104219,165870,T,IEX,270.790000,100
2019-10-17 13:37:04.635441920,2019-10-17 13:37:04.635424679,666994,T,IEX,270.500000,100
2019-10-17 13:37:04.635494912,2019-10-17 13:37:04.635476760,666995,T,IEX,270.500000,100
2019-10-17 13:55:48.515611904,2019-10-17 13:55:48.515591069,1745915,T,IEX,271.090000,100
2019-10-17 14:00:07.581872896,2019-10-17 14:00:07.581853423,1959109,T,IEX,270.860000,100
2019-10-17 14:03:05.819748096,2019-10-17 14:03:05.819728423,2135820,T,IEX,270.705000,100
2019-10-17 14:04:10.279706880,2019-10-17 14:04:10.279684820,2186561,T,IEX,270.800000,100
2019-10-17 14:04:10.280999936,2019-10-17 14:04:10.280978844,2186562,T,IEX,270.800000,100
2019-10-17 14:04:10.284673024,2019-10-17 14:04:10.284652835,2186568,T,IEX,270.800000,59
2019-10-17 14:14:18.549163008,2019-10-17 14:14:18.549145313,2663089,T,IEX,270.960000,100
2019-10-17 14:14:18.554631936,2019-10-17 14:14:18.554615242,2663098,T,IEX,270.960000,100
2019-10-17 14:14:27.28704000,2019-10-17 14:14:27.28686532,2670953,T,IEX,270.960000,1900
2019-10-17 14:16:18.241731072,2019-10-17 14:16:18.241710272,2762916,T,IEX,271.050000,168
2019-10-17 14:16:23.89656064,2019-10-17 14:16:23.89636321,2766742,T,IEX,271.080000,200
2019-10-17 14:20:11.649353984,2019-10-17 14:20:11.649336340,2946057,T,IEX,270.890000,100
2019-10-17 14:49:23.839243008,2019-10-17 14:49:23.839226022,4315876,T,IEX,270.490000,100
2019-10-17 14:49:23.907952896,2019-10-17 14:49:23.907935230,4317942,T,IEX,270.480000,100
2019-10-17 14:49:23.912386048,2019-10-17 14:49:23.912368822,4318006,T,IEX,270.480000,100
2019-10-17 14:50:02.979513088,2019-10-17 14:50:02.979478073,4373377,T,IEX,270.460000,100
2019-10-17 14:50:43.518777088,2019-10-17 14:50:43.518756129,4412403,T,IEX,270.540000,5
2019-10-17 14:59:42.407503104,2019-10-17 14:59:42.407483843,4799997,T,IEX,270.410000,100
2019-10-17 14:59:45.656473088,2019-10-17 14:59:45.656453153,4802390,T,IEX,270.410000,100
2019-10-17 15:12:30.575696896,2019-10-17 15:12:30.575677108,5533743,T,IEX,270.400000,100
2019-10-17 15:40:00.982865920,2019-10-17 15:40:00.982846504,6574553,T,IEX,270.280000,100
2019-10-17 15:42:59.161989888,2019-10-17 15:42:59.161968132,6690212,T,IEX,270.240000,100
2019-10-17 15:44:30.740697088,2019-10-17 15:44:30.740677553,6765718,T,IEX,270.230000,100
2019-10-17 15:47:42.761839104,2019-10-17 15:47:42.761819324,6883768,T,IEX,270.155000,100
2019-10-17 15:47:42.762897920,2019-10-17 15:47:42.762878359,6883769,T,IEX,270.155000,144
2019-10-17 16:16:11.631366912,2019-10-17 16:16:11.631347108,7845610,T,IEX,269.820000,100
2019-10-17 16:16:58.874352896,2019-10-17 16:16:58.874336406,7869829,T,IEX,269.805000,271
2019-10-17 18:50:45.366644992,2019-10-17 18:50:45.366627785,11243686,T,IEX,270.800000,100
2019-10-17 19:07:57.232932096,2019-10-17 19:07:57.232910722,11614595,T,IEX,270.640000,100
2019-10-17 19:12:36.829127936,2019-10-17 19:12:36.829105018,11711140,T,IEX,270.690000,100
2019-10-17 19:29:05.573705984,2019-10-17 19:29:05.573687911,12049930,T,IEX,270.620000,100
2019-10-17 19:30:28.536868096,2019-10-17 19:30:28.536847428,12095030,T,IEX,270.720000,100
2019-10-17 19:33:36.257340928,2019-10-17 19:33:36.257321389,12190146,T,IEX,270.650000,100
2019-10-17 19:34:20.35568896,2019-10-17 19:34:20.35548223,12211456,T,IEX,270.610000,97
2019-10-17 19:36:51.833644032,2019-10-17 19:36:51.833628736,12277941,T,IEX,270.530000,100
2019-10-17 19:53:35.834227968,2019-10-17 19:53:35.834207092,12834481,T,IEX,270.475000,24
2019-10-17 19:55:00.29390080,2019-10-17 19:55:00.29369824,12902197,T,IEX,270.440000,29
2019-10-17 19:55:00.31874048,2019-10-17 19:55:00.31854484,12902269,T,IEX,270.440000,38
2019-10-17 19:58:20.3975936,2019-10-17 19:58:20.3954849,13118100,T,IEX,270.440000,100
2019-10-17 19:58:23.341250048,2019-10-17 19:58:23.341229075,13122648,T,IEX,270.440000,100
2019-10-17 19:58:26.170458112,2019-10-17 19:58:26.170434925,13126726,T,IEX,270.420000,100
2019-10-17 19:58:44.364029952,2019-10-17 19:58:44.364010034,13147888,T,IEX,270.420000,34
2019-10-17 19:58:59.431352064,2019-10-17 19:58:59.431326604,13166392,T,IEX,270.440000,100
2019-10-17 19:59:37.874788096,2019-10-17 19:59:37.874760204,13260513,T,IEX,270.370000,100
2019-10-17 19:59:37.874809088,2019-10-17 19:59:37.874775998,13260517,T,IEX,270.370000,100
2019-10-17 19:59:50.934397952,2019-10-17 19:59:50.934380356,13351880,T,IEX,270.380000,100
