Name,Time,Cumulative PnL
MVWAP,2023-Jan-04 14:30:15.135322,0.000000
MVWAP,2023-Jan-04 14:31:15.321943,0.000000
MVWAP,2023-Jan-04 14:32:15.840278,-245.736000
MVWAP,2023-Jan-04 14:33:16.071930,-245.736000
MVWAP,2023-Jan-04 14:34:16.203464,-33.636000
MVWAP,2023-Jan-04 14:35:16.933872,-29.728845
MVWAP,2023-Jan-04 14:36:17.295493,-63.364845
MVWAP,2023-Jan-04 14:37:17.493681,-63.364845
MVWAP,2023-Jan-04 14:38:17.806930,-23.464845
MVWAP,2023-Jan-04 14:39:19.009665,-109.300845
MVWAP,2023-Jan-04 14:40:19.149975,-39.094221
MVWAP,2023-Jan-04 14:41:19.475604,-81.694221
MVWAP,2023-Jan-04 14:42:20.496196,-23.230221
MVWAP,2023-Jan-04 14:43:21.025331,-47.830221
MVWAP,2023-Jan-04 14:44:21.157891,-142.030221
MVWAP,2023-Jan-04 14:45:21.772055,-142.030221
MVWAP,2023-Jan-04 14:46:21.826800,-153.466221
MVWAP,2023-Jan-04 14:47:23.014251,-132.766221
MVWAP,2023-Jan-04 14:48:23.376830,-163.695490
MVWAP,2023-Jan-04 14:49:23.557550,-101.588604
MVWAP,2023-Jan-04 14:50:23.771758,-138.817885
MVWAP,2023-Jan-04 14:51:24.159845,-173.683114
MVWAP,2023-Jan-04 14:52:24.946994,-158.976261
MVWAP,2023-Jan-04 14:53:25.803463,-179.712261
MVWAP,2023-Jan-04 14:54:25.952896,-117.648261
MVWAP,2023-Jan-04 14:55:26.300643,-107.441718
MVWAP,2023-Jan-04 14:56:26.659275,-201.077718
MVWAP,2023-Jan-04 14:57:26.874931,-180.371000
MVWAP,2023-Jan-04 14:58:28.332468,-132.407000
MVWAP,2023-Jan-04 14:59:47.557286,-204.407000
MVWAP,2023-Jan-04 15:00:48.244762,-226.929113
MVWAP,2023-Jan-04 15:01:48.335995,-298.101113
MVWAP,2023-Jan-04 15:02:49.099565,-262.394301
MVWAP,2023-Jan-04 15:03:49.232492,-332.930301
MVWAP,2023-Jan-04 15:04:49.279664,-334.759442
MVWAP,2023-Jan-04 15:05:49.333199,-434.951575
MVWAP,2023-Jan-04 15:06:49.530085,-510.351600
MVWAP,2023-Jan-04 15:07:49.802968,-514.879605
MVWAP,2023-Jan-04 15:08:49.849669,-536.215605
MVWAP,2023-Jan-04 15:09:50.034295,-435.779395
MVWAP,2023-Jan-04 15:10:50.427697,-555.843347
MVWAP,2023-Jan-04 15:11:50.573319,-636.843347
MVWAP,2023-Jan-04 15:12:50.682959,-2035.443347
MVWAP,2023-Jan-04 15:13:51.108698,-509.071069
MVWAP,2023-Jan-04 15:14:51.174626,-814.171069
MVWAP,2023-Jan-04 15:15:51.506024,-403.771069
MVWAP,2023-Jan-04 15:16:51.686873,-390.271069
MVWAP,2023-Jan-04 15:17:51.799683,-390.299303
MVWAP,2023-Jan-04 15:18:51.836872,-414.335303
MVWAP,2023-Jan-04 15:19:52.413062,-417.955468
MVWAP,2023-Jan-04 15:20:52.584494,-372.991468
MVWAP,2023-Jan-04 15:21:52.734255,-321.383708
MVWAP,2023-Jan-04 15:22:53.170166,-875.819708
MVWAP,2023-Jan-04 15:23:53.364538,-880.647592
MVWAP,2023-Jan-04 15:24:53.427857,-365.583592
MVWAP,2023-Jan-04 15:25:53.466569,-968.619592
MVWAP,2023-Jan-04 15:26:53.863358,-587.019592
MVWAP,2023-Jan-04 15:27:54.586743,-587.019592
MVWAP,2023-Jan-04 15:28:54.730316,-583.111436
MVWAP,2023-Jan-04 15:29:54.807357,-269.611436
MVWAP,2023-Jan-04 15:30:55.026967,-998.777436
MVWAP,2023-Jan-04 15:31:55.668871,-415.577436
MVWAP,2023-Jan-04 15:32:55.851504,-440.777436
MVWAP,2023-Jan-04 15:33:56.150286,-350.805461
MVWAP,2023-Jan-04 15:34:56.194482,-318.405461
MVWAP,2023-Jan-04 15:35:56.598493,-524.841461
MVWAP,2023-Jan-04 15:36:56.648176,-517.033594
MVWAP,2023-Jan-04 15:37:57.000837,-494.826050
MVWAP,2023-Jan-04 15:38:57.310415,-300.418397
MVWAP,2023-Jan-04 15:39:57.518222,-477.418397
MVWAP,2023-Jan-04 15:40:57.948005,-361.354397
MVWAP,2023-Jan-04 15:41:58.638757,-486.482597
MVWAP,2023-Jan-04 15:43:00.006916,-394.644731
MVWAP,2023-Jan-04 15:44:00.754972,-399.172924
MVWAP,2023-Jan-04 15:45:02.068274,-108.172924
MVWAP,2023-Jan-04 15:46:03.004941,-9.172924
MVWAP,2023-Jan-04 15:47:03.278808,-5.866018
MVWAP,2023-Jan-04 15:48:04.219079,-11.902018
MVWAP,2023-Jan-04 15:49:04.597166,35.195808
MVWAP,2023-Jan-04 15:50:05.418755,-27.540192
MVWAP,2023-Jan-04 15:51:06.370784,-126.540192
MVWAP,2023-Jan-04 15:52:06.629095,-126.540192
MVWAP,2023-Jan-04 15:53:07.969576,47.459808
MVWAP,2023-Jan-04 15:54:09.260081,-126.540192
MVWAP,2023-Jan-04 15:55:09.716660,-30.226225
MVWAP,2023-Jan-04 15:56:09.942478,-39.862225
MVWAP,2023-Jan-04 15:57:10.095639,30.351486
MVWAP,2023-Jan-04 15:58:10.249655,-87.248514
MVWAP,2023-Jan-04 15:59:10.632116,48.022251
MVWAP,2023-Jan-04 16:00:10.945850,-84.277749
MVWAP,2023-Jan-04 16:01:11.145446,36.929077
MVWAP,2023-Jan-04 16:02:11.274465,24.635862
MVWAP,2023-Jan-04 16:03:11.940229,-52.793191
MVWAP,2023-Jan-04 16:04:12.478000,23.706809
MVWAP,2023-Jan-04 16:05:13.554084,-68.429191
MVWAP,2023-Jan-04 16:06:13.866558,2.677628
MVWAP,2023-Jan-04 16:07:14.236889,-7.858372
MVWAP,2023-Jan-04 16:08:14.418221,28.748648
MVWAP,2023-Jan-04 16:09:14.806048,55.748648
MVWAP,2023-Jan-04 16:10:14.962897,49.748648
MVWAP,2023-Jan-04 16:11:15.195572,-25.544782
MVWAP,2023-Jan-04 16:12:15.850989,77.655218
MVWAP,2023-Jan-04 16:13:16.113897,115.161789
MVWAP,2023-Jan-04 16:14:16.469754,107.961789
MVWAP,2023-Jan-04 16:15:16.938701,132.232083
MVWAP,2023-Jan-04 16:16:17.269669,116.896083
MVWAP,2023-Jan-04 16:17:17.885116,106.702600
MVWAP,2023-Jan-04 16:18:18.422631,82.966600
MVWAP,2023-Jan-04 16:19:18.918451,100.966600
MVWAP,2023-Jan-04 16:20:19.381167,87.773009
MVWAP,2023-Jan-04 16:21:20.538938,100.373009
MVWAP,2023-Jan-04 16:22:20.758935,93.137009
MVWAP,2023-Jan-04 16:23:21.085512,105.137009
MVWAP,2023-Jan-04 16:24:21.396023,82.007532
MVWAP,2023-Jan-04 16:25:21.665507,85.607532
MVWAP,2023-Jan-04 16:26:22.090982,82.007532
MVWAP,2023-Jan-04 16:27:23.206523,94.007532
MVWAP,2023-Jan-04 16:28:23.458682,123.413807
MVWAP,2023-Jan-04 16:29:24.623930,131.513807
MVWAP,2023-Jan-04 16:30:25.000077,165.983974
MVWAP,2023-Jan-04 16:31:25.292212,237.983974
MVWAP,2023-Jan-04 16:32:26.572388,220.853569
MVWAP,2023-Jan-04 16:33:28.380366,220.853569
MVWAP,2023-Jan-04 16:34:29.581474,237.281569
MVWAP,2023-Jan-04 16:35:30.211190,215.987038
MVWAP,2023-Jan-04 16:36:30.882160,215.987038
MVWAP,2023-Jan-04 16:37:31.734629,222.892479
MVWAP,2023-Jan-04 16:38:32.350275,258.856479
MVWAP,2023-Jan-04 16:39:32.671192,274.161786
MVWAP,2023-Jan-04 16:40:32.980454,288.494918
MVWAP,2023-Jan-04 16:41:33.639580,289.933128
MVWAP,2023-Jan-04 16:42:34.322491,280.607379
MVWAP,2023-Jan-04 16:43:34.742331,289.876451
MVWAP,2023-Jan-04 16:44:35.009750,294.645503
MVWAP,2023-Jan-04 16:45:35.145852,254.709503
MVWAP,2023-Jan-04 16:46:36.152452,274.514709
MVWAP,2023-Jan-04 16:47:36.418861,296.983814
MVWAP,2023-Jan-04 16:48:36.727474,294.516865
MVWAP,2023-Jan-04 16:49:37.096079,289.121964
MVWAP,2023-Jan-04 16:50:38.291120,297.190995
MVWAP,2023-Jan-04 16:51:38.650958,274.654995
MVWAP,2023-Jan-04 16:52:39.111952,297.460047
MVWAP,2023-Jan-04 16:53:39.568427,301.060047
MVWAP,2023-Jan-04 16:54:40.783212,298.602977
MVWAP,2023-Jan-04 16:55:41.167875,319.007955
MVWAP,2023-Jan-04 16:56:41.583801,316.571955
MVWAP,2023-Jan-04 16:57:42.488058,328.876758
MVWAP,2023-Jan-04 16:58:43.098120,311.445628
MVWAP,2023-Jan-04 16:59:44.209700,300.009628
MVWAP,2023-Jan-04 17:00:44.760100,302.414552
MVWAP,2023-Jan-04 17:01:45.325562,279.588552
MVWAP,2023-Jan-04 17:02:45.561160,287.367563
MVWAP,2023-Jan-04 17:03:46.890518,278.941626
MVWAP,2023-Jan-04 17:04:47.786930,285.210671
MVWAP,2023-Jan-04 17:05:48.037722,280.074671
MVWAP,2023-Jan-04 17:06:48.517922,251.274671
MVWAP,2023-Jan-04 17:07:48.733356,265.679796
MVWAP,2023-Jan-04 17:08:48.960683,280.948915
MVWAP,2023-Jan-04 17:09:49.106163,266.512915
MVWAP,2023-Jan-04 17:10:49.756247,259.918040
MVWAP,2023-Jan-04 17:11:50.209389,275.482040
MVWAP,2023-Jan-04 17:12:51.315303,279.987172
MVWAP,2023-Jan-04 17:13:51.376235,260.151172
MVWAP,2023-Jan-04 17:14:51.528967,248.151172
MVWAP,2023-Jan-04 17:15:51.962653,260.456372
MVWAP,2023-Jan-04 17:16:52.461452,262.256372
MVWAP,2023-Jan-04 17:17:53.113169,257.445490
MVWAP,2023-Jan-04 17:18:53.773995,276.345490
MVWAP,2023-Jan-04 17:19:54.073876,267.314535
MVWAP,2023-Jan-04 17:20:54.161102,253.147566
MVWAP,2023-Jan-04 17:21:54.398772,286.752658
MVWAP,2023-Jan-04 17:22:54.750586,281.021548
MVWAP,2023-Jan-04 17:23:54.814850,282.185548
MVWAP,2023-Jan-04 17:24:55.601338,285.469382
MVWAP,2023-Jan-04 17:25:55.870297,283.933382
MVWAP,2023-Jan-04 17:26:56.200626,269.802346
MVWAP,2023-Jan-04 17:27:56.362182,249.707465
MVWAP,2023-Jan-04 17:28:57.257285,254.709588
MVWAP,2023-Jan-04 17:29:57.476944,240.309588
MVWAP,2023-Jan-04 17:30:58.076583,259.814707
MVWAP,2023-Jan-04 17:31:59.022380,259.814707
MVWAP,2023-Jan-04 17:32:59.436848,280.783691
MVWAP,2023-Jan-04 17:33:59.563347,266.947691
MVWAP,2023-Jan-04 17:34:59.718345,270.852629
MVWAP,2023-Jan-04 17:35:59.887354,262.385573
MVWAP,2023-Jan-04 17:37:00.450544,283.359407
MVWAP,2023-Jan-04 17:38:00.889008,274.623407
MVWAP,2023-Jan-04 17:39:00.969752,274.628290
MVWAP,2023-Jan-04 17:40:01.077690,282.692290
MVWAP,2023-Jan-04 17:41:02.098962,280.897194
MVWAP,2023-Jan-04 17:42:02.356477,277.861194
MVWAP,2023-Jan-04 17:43:02.502150,276.950077
MVWAP,2023-Jan-04 17:44:02.604263,276.018934
MVWAP,2023-Jan-04 17:45:03.292349,280.823784
MVWAP,2023-Jan-04 17:46:03.390946,277.161490
MVWAP,2023-Jan-04 17:47:04.203414,278.025490
MVWAP,2023-Jan-04 17:48:05.058522,274.130374
MVWAP,2023-Jan-04 17:49:05.207254,240.194374
MVWAP,2023-Jan-04 17:50:05.530855,250.663425
MVWAP,2023-Jan-04 17:51:05.792135,246.132416
MVWAP,2023-Jan-04 17:52:06.023011,213.732416
MVWAP,2023-Jan-04 17:53:06.721016,205.332416
MVWAP,2023-Jan-04 17:54:07.337408,224.237669
MVWAP,2023-Jan-04 17:55:07.458052,200.501669
MVWAP,2023-Jan-04 17:56:10.075034,184.901669
MVWAP,2023-Jan-04 17:57:10.251345,174.107070
MVWAP,2023-Jan-04 17:58:10.899113,143.471070
MVWAP,2023-Jan-04 17:59:11.451286,145.576666
MVWAP,2023-Jan-04 18:00:13.139186,129.940666
MVWAP,2023-Jan-04 18:01:13.564996,95.140666
MVWAP,2023-Jan-04 18:02:13.596384,-210.589402
MVWAP,2023-Jan-04 18:03:13.633847,87.916678
MVWAP,2023-Jan-04 18:04:13.789126,90.616678
MVWAP,2023-Jan-04 18:05:14.718277,80.380678
MVWAP,2023-Jan-04 18:06:15.097031,79.150636
MVWAP,2023-Jan-04 18:07:15.621646,88.126500
MVWAP,2023-Jan-04 18:08:16.113707,99.826500
MVWAP,2023-Jan-04 18:09:16.594533,90.640311
MVWAP,2023-Jan-04 18:10:17.452760,102.946075
MVWAP,2023-Jan-04 18:11:17.884502,107.446075
MVWAP,2023-Jan-04 18:12:18.403929,116.446075
MVWAP,2023-Jan-04 18:13:18.596169,119.415738
MVWAP,2023-Jan-04 18:14:19.234555,119.349347
MVWAP,2023-Jan-04 18:15:19.445092,125.654943
MVWAP,2023-Jan-04 18:16:19.525434,148.154943
MVWAP,2023-Jan-04 18:17:19.786546,147.254943
MVWAP,2023-Jan-04 18:18:19.993635,163.124337
MVWAP,2023-Jan-04 18:19:20.387344,174.813584
MVWAP,2023-Jan-04 18:20:20.685702,168.513584
MVWAP,2023-Jan-04 18:21:21.110690,171.547584
MVWAP,2023-Jan-04 18:22:21.552124,168.826884
MVWAP,2023-Jan-04 18:23:22.204498,174.532164
MVWAP,2023-Jan-04 18:24:23.184221,176.332164
MVWAP,2023-Jan-04 18:25:24.356366,173.896164
MVWAP,2023-Jan-04 18:26:25.094807,173.896164
MVWAP,2023-Jan-04 18:27:25.507386,158.601417
MVWAP,2023-Jan-04 18:28:25.718155,172.106710
MVWAP,2023-Jan-04 18:29:26.021443,158.870710
MVWAP,2023-Jan-04 18:30:26.492931,167.876091
MVWAP,2023-Jan-04 18:31:26.847367,160.940091
MVWAP,2023-Jan-04 18:32:27.187485,168.145412
MVWAP,2023-Jan-04 18:33:27.422626,163.924692
MVWAP,2023-Jan-04 18:34:27.598646,167.814012
MVWAP,2023-Jan-04 18:35:27.744572,170.178012
MVWAP,2023-Jan-04 18:36:28.093984,177.083292
MVWAP,2023-Jan-04 18:37:28.435590,184.283292
MVWAP,2023-Jan-04 18:38:28.537747,184.883292
MVWAP,2023-Jan-04 18:39:28.772143,182.447292
MVWAP,2023-Jan-04 18:40:28.924409,177.947292
MVWAP,2023-Jan-04 18:41:29.254475,175.252444
MVWAP,2023-Jan-04 18:42:29.707017,172.521650
MVWAP,2023-Jan-04 18:43:30.237751,170.390924
MVWAP,2023-Jan-04 18:44:30.450269,165.560237
MVWAP,2023-Jan-04 18:45:30.865765,161.293517
MVWAP,2023-Jan-04 18:46:30.925573,157.982817
MVWAP,2023-Jan-04 18:47:31.597744,155.252151
MVWAP,2023-Jan-04 18:48:31.748924,145.957619
MVWAP,2023-Jan-04 18:49:31.858093,147.996461
MVWAP,2023-Jan-04 18:50:32.405641,147.314711
MVWAP,2023-Jan-04 18:51:32.966902,141.248092
MVWAP,2023-Jan-04 18:52:33.834003,141.253506
MVWAP,2023-Jan-04 18:53:34.569867,136.686874
MVWAP,2023-Jan-04 18:54:35.140709,136.961649
MVWAP,2023-Jan-04 18:55:35.816752,76.025649
MVWAP,2023-Jan-04 18:56:36.711953,76.025649
MVWAP,2023-Jan-04 18:57:37.163073,63.109649
MVWAP,2023-Jan-04 18:58:38.072930,85.615426
MVWAP,2023-Jan-04 18:59:38.594042,67.285136
MVWAP,2023-Jan-04 19:00:39.173472,-7.481006
MVWAP,2023-Jan-04 19:01:40.376257,46.523998
MVWAP,2023-Jan-04 19:02:40.579175,-30.312002
MVWAP,2023-Jan-04 19:03:41.445031,-159.948002
MVWAP,2023-Jan-04 19:04:41.646892,-148.541075
MVWAP,2023-Jan-04 19:05:42.916752,-0.934498
MVWAP,2023-Jan-04 19:06:42.944969,38.071246
MVWAP,2023-Jan-04 19:07:43.442960,54.577056
MVWAP,2023-Jan-04 19:08:43.613563,29.041056
MVWAP,2023-Jan-04 19:09:43.752290,-45.678602
MVWAP,2023-Jan-04 19:10:44.788788,-15.671817
MVWAP,2023-Jan-04 19:11:45.214544,16.698599
MVWAP,2023-Jan-04 19:12:45.514449,-6.466777
MVWAP,2023-Jan-04 19:13:45.688560,12.997967
MVWAP,2023-Jan-04 19:14:46.171480,-40.711604
MVWAP,2023-Jan-04 19:15:46.437921,70.558603
MVWAP,2023-Jan-04 19:16:47.301015,-41.041397
MVWAP,2023-Jan-04 19:17:47.454916,-41.041397
MVWAP,2023-Jan-04 19:18:48.246881,-41.041397
MVWAP,2023-Jan-04 19:19:48.645276,113.464522
MVWAP,2023-Jan-04 19:20:49.028574,91.544386
MVWAP,2023-Jan-04 19:21:49.338480,-5.085769
MVWAP,2023-Jan-04 19:22:49.705982,15.320936
MVWAP,2023-Jan-04 19:23:49.831100,-14.038400
MVWAP,2023-Jan-04 19:24:50.034958,10.568230
MVWAP,2023-Jan-04 19:25:50.269647,-6.567770
MVWAP,2023-Jan-04 19:26:50.740290,-13.796413
MVWAP,2023-Jan-04 19:27:50.927590,-23.017236
MVWAP,2023-Jan-04 19:28:51.301157,-29.671631
MVWAP,2023-Jan-04 19:29:51.962792,-35.663865
MVWAP,2023-Jan-04 19:30:51.986808,-29.082267
MVWAP,2023-Jan-04 19:31:52.239312,-29.082267
MVWAP,2023-Jan-04 19:32:52.426487,-40.210467
MVWAP,2023-Jan-04 19:33:52.818156,-43.798673
MVWAP,2023-Jan-04 19:34:53.900017,-43.798673
MVWAP,2023-Jan-04 19:35:54.847474,-46.203478
MVWAP,2023-Jan-04 19:36:55.761718,-53.450732
MVWAP,2023-Jan-04 19:37:55.946627,-53.123376
MVWAP,2023-Jan-04 19:38:56.280449,-54.352019
MVWAP,2023-Jan-04 19:39:56.879604,-82.288019
MVWAP,2023-Jan-04 19:40:56.977050,-62.780562
MVWAP,2023-Jan-04 19:41:57.123230,-63.679205
MVWAP,2023-Jan-04 19:42:57.676864,-66.415205
MVWAP,2023-Jan-04 19:43:58.069746,-76.307829
MVWAP,2023-Jan-04 19:44:58.429692,-84.096445
MVWAP,2023-Jan-04 19:45:59.689111,-84.096445
MVWAP,2023-Jan-04 19:46:59.826444,-84.122445
MVWAP,2023-Jan-04 19:48:00.584550,-110.822445
MVWAP,2023-Jan-04 19:49:00.754260,-85.615364
MVWAP,2023-Jan-04 19:50:00.883470,-85.615364
MVWAP,2023-Jan-04 19:51:00.976973,-85.615364
MVWAP,2023-Jan-04 19:52:01.242714,-79.051364
MVWAP,2023-Jan-04 19:53:01.394702,-82.670143
MVWAP,2023-Jan-04 19:54:01.551059,-77.570143
MVWAP,2023-Jan-04 19:55:01.719203,-82.362961
MVWAP,2023-Jan-04 19:56:01.999694,-86.881840
MVWAP,2023-Jan-04 19:57:02.108123,-86.917840
MVWAP,2023-Jan-04 19:58:02.276548,-91.417840
MVWAP,2023-Jan-04 19:59:02.530230,-95.910606
MVWAP,2023-Jan-04 20:00:02.740869,-95.910606
MVWAP,2023-Jan-04 20:01:03.105305,-95.910606
MVWAP,2023-Jan-04 20:02:03.358915,-97.410371
MVWAP,2023-Jan-04 20:03:03.669529,-100.746371
MVWAP,2023-Jan-04 20:04:03.959887,-104.340077
MVWAP,2023-Jan-04 20:05:04.106400,-104.340077
MVWAP,2023-Jan-04 20:06:04.390075,-108.566077
MVWAP,2023-Jan-04 20:07:05.015917,-139.166077
MVWAP,2023-Jan-04 20:08:05.207886,-139.166077
MVWAP,2023-Jan-04 20:09:05.497499,-118.759735
MVWAP,2023-Jan-04 20:10:06.117274,-118.759735
MVWAP,2023-Jan-04 20:11:06.621212,-134.138086
MVWAP,2023-Jan-04 20:12:06.804487,-130.897376
MVWAP,2023-Jan-04 20:13:06.888659,-139.962994
MVWAP,2023-Jan-04 20:14:07.403909,-136.656545
MVWAP,2023-Jan-04 20:15:07.708541,-139.392545
MVWAP,2023-Jan-04 20:16:08.180668,-136.151989
MVWAP,2023-Jan-04 20:17:08.347563,-137.615594
MVWAP,2023-Jan-04 20:18:08.442436,-137.615594
MVWAP,2023-Jan-04 20:19:08.563240,-141.851594
MVWAP,2023-Jan-04 20:20:08.802319,-142.474957
MVWAP,2023-Jan-04 20:21:08.970426,-156.310957
MVWAP,2023-Jan-04 20:22:09.202112,-167.110957
MVWAP,2023-Jan-04 20:23:09.446000,-204.910957
MVWAP,2023-Jan-04 20:24:09.762032,-165.604192
MVWAP,2023-Jan-04 20:25:10.185880,-166.803407
MVWAP,2023-Jan-04 20:26:10.915945,-166.803407
MVWAP,2023-Jan-04 20:27:11.021219,-215.739407
MVWAP,2023-Jan-04 20:28:11.145910,-177.032628
MVWAP,2023-Jan-04 20:29:11.204816,-180.361951
MVWAP,2023-Jan-04 20:30:11.840438,-225.997951
MVWAP,2023-Jan-04 20:31:11.972715,-227.856239
MVWAP,2023-Jan-04 20:32:12.236699,-192.485447
MVWAP,2023-Jan-04 20:33:13.199830,-189.814608
MVWAP,2023-Jan-04 20:34:13.380819,-191.365909
MVWAP,2023-Jan-04 20:35:13.511500,-194.094882
MVWAP,2023-Jan-04 20:36:13.809441,-212.130882
MVWAP,2023-Jan-04 20:37:13.900926,-229.125906
MVWAP,2023-Jan-04 20:38:14.541012,-228.218355
MVWAP,2023-Jan-04 20:39:14.659641,-232.425630
MVWAP,2023-Jan-04 20:40:15.216794,-240.861630
MVWAP,2023-Jan-04 20:41:15.269933,-250.172440
MVWAP,2023-Jan-04 20:42:15.323559,-257.426781
MVWAP,2023-Jan-04 20:43:15.976947,-278.473282
MVWAP,2023-Jan-04 20:44:16.260737,-280.841617
MVWAP,2023-Jan-04 20:45:16.981150,-295.546399
MVWAP,2023-Jan-04 20:46:17.261774,-284.495241
MVWAP,2023-Jan-04 20:47:18.104172,-289.023495
MVWAP,2023-Jan-04 20:48:18.595995,-293.430331
MVWAP,2023-Jan-04 20:49:19.135066,-294.674935
MVWAP,2023-Jan-04 20:50:19.868097,-306.903619
MVWAP,2023-Jan-04 20:51:20.069017,-299.425296
MVWAP,2023-Jan-04 20:52:20.966087,-299.425296
MVWAP,2023-Jan-04 20:53:21.889697,-303.983235
MVWAP,2023-Jan-04 20:54:22.205149,-303.983235
MVWAP,2023-Jan-04 20:55:22.555953,-311.820986
MVWAP,2023-Jan-04 20:56:22.852518,-313.570382
MVWAP,2023-Jan-04 20:57:23.089413,-313.570382
MVWAP,2023-Jan-04 20:58:23.178905,-320.265470
MVWAP,2023-Jan-04 20:59:23.542043,-322.507675
MVWAP,2023-Jan-04 21:00:34.316039,-556.543675
MVWAP,2023-Jan-04 21:04:11.729434,-556.543675
MVWAP,2023-Jan-04 21:05:23.386401,-556.543675
MVWAP,2023-Jan-04 21:06:28.435668,-556.543675
MVWAP,2023-Jan-04 21:07:32.622671,-556.543675
MVWAP,2023-Jan-04 21:08:35.959886,-556.543675
MVWAP,2023-Jan-04 21:09:38.939560,-556.543675
MVWAP,2023-Jan-04 21:10:40.917957,-556.543675
MVWAP,2023-Jan-04 21:11:47.264950,-556.543675
MVWAP,2023-Jan-04 21:13:03.119920,-556.543675
MVWAP,2023-Jan-04 21:14:22.761771,-556.543675
MVWAP,2023-Jan-04 21:16:13.456109,-556.543675
MVWAP,2023-Jan-04 21:17:21.908097,-556.543675
MVWAP,2023-Jan-04 21:18:59.757771,-556.543675
MVWAP,2023-Jan-04 21:21:16.005358,-556.543675
MVWAP,2023-Jan-04 21:22:24.412365,-556.543675
MVWAP,2023-Jan-04 21:23:27.087505,-556.543675
MVWAP,2023-Jan-04 21:24:33.390336,-556.543675
MVWAP,2023-Jan-04 21:27:47.754139,-556.543675
MVWAP,2023-Jan-04 21:28:55.164648,-556.543675
MVWAP,2023-Jan-04 21:30:09.873179,-556.543675
MVWAP,2023-Jan-04 21:31:49.075086,-556.543675
MVWAP,2023-Jan-04 21:34:56.146575,-556.543675
MVWAP,2023-Jan-04 21:36:20.925923,-556.543675
MVWAP,2023-Jan-04 21:37:30.947880,-556.543675
MVWAP,2023-Jan-04 21:41:32.333733,-556.543675
MVWAP,2023-Jan-04 21:43:52.556389,-556.543675
MVWAP,2023-Jan-04 21:52:15.784686,-556.543675
MVWAP,2023-Jan-04 21:53:45.213669,-556.543675
MVWAP,2023-Jan-04 21:56:13.185400,-556.543675
MVWAP,2023-Jan-04 21:57:38.412532,-556.543675
MVWAP,2023-Jan-04 22:00:00.026530,-556.543675
MVWAP,2023-Jan-05 05:00:00,-556.543675
