2019-10-24 13:04:10.30985984,2019-10-24 13:04:10.30942608,49875,T,IEX,11.730000,200
2019-10-24 13:08:03.75787008,2019-10-24 13:08:03.75757521,51936,T,IEX,11.750000,200
2019-10-24 13:30:38.36850944,2019-10-24 13:30:38.36826540,156768,T,IEX,11.710000,1000
2019-10-24 13:33:21.410585088,2019-10-24 13:33:21.410564172,347525,T,IEX,11.705000,100
2019-10-24 13:36:48.520547072,2019-10-24 13:36:48.520531592,598480,T,IEX,11.690000,100
2019-10-24 13:36:50.565223936,2019-10-24 13:36:50.565205225,602274,T,IEX,11.685000,300
2019-10-24 13:36:54.350620928,2019-10-24 13:36:54.350601217,605536,T,IEX,11.690000,300
2019-10-24 13:37:25.326562048,2019-10-24 13:37:25.326544227,638418,T,IEX,11.695000,100
2019-10-24 13:37:41.186106880,2019-10-24 13:37:41.186087569,652644,T,IEX,11.700000,200
2019-10-24 13:37:42.278999040,2019-10-24 13:37:42.278978991,653507,T,IEX,11.700000,100
2019-10-24 13:38:05.967533056,2019-10-24 13:38:05.967516635,677131,T,IEX,11.710000,100
2019-10-24 13:38:24.772305920,2019-10-24 13:38:24.772287597,697751,T,IEX,11.705000,100
2019-10-24 13:38:42.254091008,2019-10-24 13:38:42.254075218,715652,T,IEX,11.705000,100
2019-10-24 13:40:12.470597888,2019-10-24 13:40:12.470582303,812105,T,IEX,11.695000,100
2019-10-24 13:40:12.989349888,2019-10-24 13:40:12.989329858,812859,T,IEX,11.695000,100
2019-10-24 13:40:24.208456960,2019-10-24 13:40:24.208440638,822426,T,IEX,11.700000,200
2019-10-24 13:40:27.940200960,2019-10-24 13:40:27.940182695,825608,T,IEX,11.700000,100
2019-10-24 13:40:29.799889920,2019-10-24 13:40:29.799868507,827527,T,IEX,11.695000,100
2019-10-24 13:43:02.223781888,2019-10-24 13:43:02.223763674,964717,T,IEX,11.680000,100
2019-10-24 13:43:02.223813120,2019-10-24 13:43:02.223796162,964718,T,IEX,11.680000,100
2019-10-24 13:44:10.833830912,2019-10-24 13:44:10.833814859,1014681,T,IEX,11.685000,100
2019-10-24 13:44:17.386949888,2019-10-24 13:44:17.386932413,1019611,T,IEX,11.685000,200
2019-10-24 13:44:17.908706048,2019-10-24 13:44:17.908685157,1019943,T,IEX,11.685000,100
2019-10-24 13:44:19.929103104,2019-10-24 13:44:19.929084175,1021561,T,IEX,11.685000,100
2019-10-24 13:45:45.53958912,2019-10-24 13:45:45.53940615,1114518,T,IEX,11.685000,100
2019-10-24 13:46:23.822288896,2019-10-24 13:46:23.822274390,1153801,T,IEX,11.685000,100
2019-10-24 13:46:24.339977984,2019-10-24 13:46:24.339960317,1154274,T,IEX,11.685000,100
2019-10-24 13:46:51.361083904,2019-10-24 13:46:51.361068341,1184317,T,IEX,11.685000,100
2019-10-24 13:47:01.458715904,2019-10-24 13:47:01.458697700,1192961,T,IEX,11.685000,100
2019-10-24 13:49:06.309104128,2019-10-24 13:49:06.309087463,1334924,T,IEX,11.685000,100
2019-10-24 13:49:06.827898112,2019-10-24 13:49:06.827875863,1336023,T,IEX,11.685000,100
2019-10-24 13:51:02.24463872,2019-10-24 13:51:02.24446300,1455370,T,IEX,11.685000,100
2019-10-24 13:51:02.24487936,2019-10-24 13:51:02.24472908,1455371,T,IEX,11.685000,100
2019-10-24 13:51:02.642310912,2019-10-24 13:51:02.642292308,1455980,T,IEX,11.685000,100
2019-10-24 13:52:47.585746944,2019-10-24 13:52:47.585732601,1561809,T,IEX,11.685000,100
2019-10-24 13:52:52.603354112,2019-10-24 13:52:52.603338588,1566149,T,IEX,11.685000,100
2019-10-24 13:52:57.475164928,2019-10-24 13:52:57.475147030,1570357,T,IEX,11.690000,100
2019-10-24 13:52:57.476416000,2019-10-24 13:52:57.476395735,1570360,T,IEX,11.690000,100
2019-10-24 13:54:06.291781120,2019-10-24 13:54:06.291763534,1638090,T,IEX,11.700000,100
2019-10-24 13:54:09.921778944,2019-10-24 13:54:09.921760210,1641670,T,IEX,11.695000,100
2019-10-24 13:54:24.876544000,2019-10-24 13:54:24.876524356,1653995,T,IEX,11.695000,100
2019-10-24 13:55:06.700877056,2019-10-24 13:55:06.700857882,1694185,T,IEX,11.705000,100
2019-10-24 13:56:03.38924032,2019-10-24 13:56:03.38905156,1751590,T,IEX,11.705000,100
2019-10-24 13:58:09.534467072,2019-10-24 13:58:09.534450575,1877031,T,IEX,11.705000,100
2019-10-24 13:58:09.534508032,2019-10-24 13:58:09.534490110,1877032,T,IEX,11.705000,100
2019-10-24 13:58:10.70068992,2019-10-24 13:58:10.70053501,1877388,T,IEX,11.705000,100
2019-10-24 14:00:08.420547072,2019-10-24 14:00:08.420531381,1966847,T,IEX,11.720000,100
2019-10-24 14:00:08.420566016,2019-10-24 14:00:08.420550888,1966848,T,IEX,11.720000,100
2019-10-24 14:00:09.872452096,2019-10-24 14:00:09.872432965,1967798,T,IEX,11.715000,100
2019-10-24 14:02:15.490365952,2019-10-24 14:02:15.490348994,2110027,T,IEX,11.720000,400
2019-10-24 14:02:36.590107904,2019-10-24 14:02:36.590093918,2138561,T,IEX,11.715000,100
2019-10-24 14:02:37.112857088,2019-10-24 14:02:37.112840059,2139135,T,IEX,11.715000,200
2019-10-24 14:02:41.11154944,2019-10-24 14:02:41.11139684,2143074,T,IEX,11.720000,100
2019-10-24 14:04:34.83358976,2019-10-24 14:04:34.83344125,2262711,T,IEX,11.725000,100
2019-10-24 14:04:34.629707008,2019-10-24 14:04:34.629689073,2263581,T,IEX,11.725000,100
2019-10-24 14:05:47.290394880,2019-10-24 14:05:47.290379145,2336873,T,IEX,11.725000,100
2019-10-24 14:05:59.74832896,2019-10-24 14:05:59.74814583,2350269,T,IEX,11.725000,400
2019-10-24 14:06:23.403879936,2019-10-24 14:06:23.403862369,2378471,T,IEX,11.725000,100
2019-10-24 14:06:40.384791040,2019-10-24 14:06:40.384772819,2393785,T,IEX,11.725000,100
2019-10-24 14:08:21.12590080,2019-10-24 14:08:21.12571634,2483509,T,IEX,11.725000,100
2019-10-24 14:08:21.532487936,2019-10-24 14:08:21.532470482,2483814,T,IEX,11.725000,200
2019-10-24 14:08:40.678000896,2019-10-24 14:08:40.677982268,2498234,T,IEX,11.725000,100
2019-10-24 14:10:42.217446912,2019-10-24 14:10:42.217429461,2603722,T,IEX,11.735000,100
2019-10-24 14:10:47.618650880,2019-10-24 14:10:47.618633243,2608125,T,IEX,11.735000,100
2019-10-24 14:11:59.584711936,2019-10-24 14:11:59.584693227,2665936,T,IEX,11.725000,100
2019-10-24 14:12:00.121900032,2019-10-24 14:12:00.121881461,2666285,T,IEX,11.730000,100
2019-10-24 14:12:00.122344960,2019-10-24 14:12:00.122327898,2666292,T,IEX,11.730000,100
2019-10-24 14:12:04.673893120,2019-10-24 14:12:04.673874744,2669790,T,IEX,11.725000,100
2019-10-24 14:12:10.201114880,2019-10-24 14:12:10.201093967,2674260,T,IEX,11.725000,100
2019-10-24 14:13:43.872798976,2019-10-24 14:13:43.872778818,2748426,T,IEX,11.725000,100
2019-10-24 14:14:55.39440896,2019-10-24 14:14:55.39422300,2804074,T,IEX,11.715000,100
2019-10-24 14:15:39.806479872,2019-10-24 14:15:39.806464269,2845435,T,IEX,11.720000,200
2019-10-24 14:16:04.411665920,2019-10-24 14:16:04.411646421,2863674,T,IEX,11.725000,100
2019-10-24 14:16:53.177366016,2019-10-24 14:16:53.177350303,2898886,T,IEX,11.715000,100
2019-10-24 14:16:53.695806976,2019-10-24 14:16:53.695788756,2899196,T,IEX,11.715000,100
2019-10-24 14:18:45.388614912,2019-10-24 14:18:45.388598410,2989327,T,IEX,11.710000,100
2019-10-24 14:18:45.388630016,2019-10-24 14:18:45.388614736,2989328,T,IEX,11.710000,100
2019-10-24 14:18:47.25487872,2019-10-24 14:18:47.25469886,2990269,T,IEX,11.710000,100
2019-10-24 14:19:09.486008064,2019-10-24 14:19:09.485987323,3008116,T,IEX,11.705000,100
2019-10-24 14:21:39.969601024,2019-10-24 14:21:39.969586193,3132410,T,IEX,11.715000,200
2019-10-24 14:21:42.220022016,2019-10-24 14:21:42.220005600,3134543,T,IEX,11.720000,100
2019-10-24 14:21:42.220039936,2019-10-24 14:21:42.220024986,3134544,T,IEX,11.720000,100
2019-10-24 14:21:48.827259904,2019-10-24 14:21:48.827243420,3138783,T,IEX,11.715000,100
2019-10-24 14:22:42.219036928,2019-10-24 14:22:42.219021727,3178887,T,IEX,11.715000,100
2019-10-24 14:23:11.542465024,2019-10-24 14:23:11.542446721,3199931,T,IEX,11.715000,100
2019-10-24 14:24:41.212576000,2019-10-24 14:24:41.212560664,3266560,T,IEX,11.725000,100
2019-10-24 14:24:46.231000064,2019-10-24 14:24:46.230980739,3269699,T,IEX,11.725000,100
2019-10-24 14:25:02.152205056,2019-10-24 14:25:02.152186093,3280559,T,IEX,11.740000,1000
2019-10-24 14:25:02.152224000,2019-10-24 14:25:02.152203776,3280560,T,IEX,11.740000,500
2019-10-24 14:25:02.152236032,2019-10-24 14:25:02.152215105,3280562,T,IEX,11.740000,1000
2019-10-24 14:26:10.521637888,2019-10-24 14:26:10.521622650,3328310,T,IEX,11.750000,100
2019-10-24 14:26:10.521664000,2019-10-24 14:26:10.521647765,3328311,T,IEX,11.750000,100
2019-10-24 14:26:47.291663104,2019-10-24 14:26:47.291643551,3347427,T,IEX,11.750000,200
2019-10-24 14:26:50.539440896,2019-10-24 14:26:50.539422611,3348771,T,IEX,11.755000,100
2019-10-24 14:26:50.681180928,2019-10-24 14:26:50.681161410,3348875,T,IEX,11.755000,200
2019-10-24 14:27:27.804867072,2019-10-24 14:27:27.804851430,3376804,T,IEX,11.755000,100
2019-10-24 14:27:29.850460928,2019-10-24 14:27:29.850445673,3378332,T,IEX,11.760000,100
2019-10-24 14:28:04.19279872,2019-10-24 14:28:04.19261181,3398206,T,IEX,11.755000,100
2019-10-24 14:29:06.989411072,2019-10-24 14:29:06.989387997,3441001,T,IEX,11.760000,100
2019-10-24 14:29:07.507610112,2019-10-24 14:29:07.507589911,3441475,T,IEX,11.755000,100
2019-10-24 14:29:10.782430976,2019-10-24 14:29:10.782412802,3443219,T,IEX,11.770000,500
2019-10-24 14:29:10.782450944,2019-10-24 14:29:10.782433172,3443220,T,IEX,11.770000,600
2019-10-24 14:29:26.179866880,2019-10-24 14:29:26.179848443,3452825,T,IEX,11.770000,500
2019-10-24 14:29:26.179877120,2019-10-24 14:29:26.179858041,3452826,T,IEX,11.770000,900
2019-10-24 14:29:50.349574912,2019-10-24 14:29:50.349553240,3467157,T,IEX,11.765000,400
2019-10-24 14:29:52.882317056,2019-10-24 14:29:52.882296651,3468269,T,IEX,11.760000,100
2019-10-24 14:29:52.882330880,2019-10-24 14:29:52.882316460,3468270,T,IEX,11.760000,111
2019-10-24 14:30:02.494914048,2019-10-24 14:30:02.494892464,3473965,T,IEX,11.770000,400
2019-10-24 14:30:09.666487040,2019-10-24 14:30:09.666467455,3478139,T,IEX,11.770000,300
2019-10-24 14:30:13.58817024,2019-10-24 14:30:13.58799510,3480837,T,IEX,11.770000,300
2019-10-24 14:30:34.748410880,2019-10-24 14:30:34.748393126,3504861,T,IEX,11.770000,100
2019-10-24 14:30:34.748429056,2019-10-24 14:30:34.748413537,3504862,T,IEX,11.770000,100
2019-10-24 14:30:54.339452928,2019-10-24 14:30:54.339433749,3533379,T,IEX,11.765000,100
2019-10-24 14:31:01.911831040,2019-10-24 14:31:01.911811305,3541306,T,IEX,11.780000,600
2019-10-24 14:33:36.404454912,2019-10-24 14:33:36.404440261,3655848,T,IEX,11.765000,100
2019-10-24 14:33:36.924045056,2019-10-24 14:33:36.924023831,3656141,T,IEX,11.765000,100
2019-10-24 14:34:10.430614016,2019-10-24 14:34:10.430591915,3680973,T,IEX,11.755000,100
2019-10-24 14:34:17.894334976,2019-10-24 14:34:17.894311999,3686404,T,IEX,11.755000,100
2019-10-24 14:34:40.948484096,2019-10-24 14:34:40.948463978,3703481,T,IEX,11.755000,100
2019-10-24 14:36:52.529319936,2019-10-24 14:36:52.529300708,3808208,T,IEX,11.765000,100
2019-10-24 14:36:52.529344000,2019-10-24 14:36:52.529327009,3808211,T,IEX,11.765000,100
2019-10-24 14:36:53.49828096,2019-10-24 14:36:53.49809079,3809081,T,IEX,11.765000,100
2019-10-24 14:38:14.36914944,2019-10-24 14:38:14.36895973,3867793,T,IEX,11.765000,100
2019-10-24 14:40:51.235011072,2019-10-24 14:40:51.234994005,3974877,T,IEX,11.760000,100
2019-10-24 14:41:04.582934016,2019-10-24 14:41:04.582915537,3986188,T,IEX,11.755000,100
2019-10-24 14:41:05.131025920,2019-10-24 14:41:05.131007499,3986621,T,IEX,11.755000,300
2019-10-24 14:41:26.456954880,2019-10-24 14:41:26.456934412,4002885,T,IEX,11.755000,100
2019-10-24 14:41:40.384395008,2019-10-24 14:41:40.384379569,4013690,T,IEX,11.760000,100
2019-10-24 14:41:59.392071936,2019-10-24 14:41:59.392052785,4025317,T,IEX,11.755000,6900
2019-10-24 14:41:59.392088064,2019-10-24 14:41:59.392071978,4025318,T,IEX,11.755000,4300
2019-10-24 14:41:59.392104960,2019-10-24 14:41:59.392088894,4025319,T,IEX,11.755000,500
2019-10-24 14:41:59.392122112,2019-10-24 14:41:59.392106560,4025320,T,IEX,11.755000,500
2019-10-24 14:43:57.856826112,2019-10-24 14:43:57.856809417,4108839,T,IEX,11.755000,100
2019-10-24 14:43:57.856844032,2019-10-24 14:43:57.856828488,4108840,T,IEX,11.755000,100
2019-10-24 14:44:00.107258880,2019-10-24 14:44:00.107241365,4109973,T,IEX,11.760000,100
2019-10-24 14:47:01.239365888,2019-10-24 14:47:01.239351592,4219706,T,IEX,11.755000,100
2019-10-24 14:47:01.757477120,2019-10-24 14:47:01.757461804,4220487,T,IEX,11.755000,200
2019-10-24 14:47:33.142401024,2019-10-24 14:47:33.142384366,4242505,T,IEX,11.755000,100
2019-10-24 14:47:33.214650112,2019-10-24 14:47:33.214633931,4242616,T,IEX,11.760000,100
2019-10-24 14:48:47.457648896,2019-10-24 14:48:47.457629844,4282532,T,IEX,11.755000,100
2019-10-24 14:51:07.153675008,2019-10-24 14:51:07.153659770,4367965,T,IEX,11.745000,100
2019-10-24 14:51:53.651491072,2019-10-24 14:51:53.651470612,4393601,T,IEX,11.750000,200
2019-10-24 14:51:53.651505920,2019-10-24 14:51:53.651490192,4393602,T,IEX,11.750000,100
2019-10-24 14:51:54.169540096,2019-10-24 14:51:54.169520845,4393872,T,IEX,11.745000,100
2019-10-24 14:52:49.559525888,2019-10-24 14:52:49.559506625,4424171,T,IEX,11.745000,300
2019-10-24 14:53:21.679403008,2019-10-24 14:53:21.679388046,4442711,T,IEX,11.735000,100
2019-10-24 14:54:28.951202048,2019-10-24 14:54:28.951181186,4482437,T,IEX,11.730000,100
2019-10-24 14:54:28.951215104,2019-10-24 14:54:28.951199765,4482438,T,IEX,11.730000,100
2019-10-24 14:57:33.356061952,2019-10-24 14:57:33.356043654,4605658,T,IEX,11.710000,100
2019-10-24 14:57:33.356088064,2019-10-24 14:57:33.356069621,4605659,T,IEX,11.710000,100
2019-10-24 14:57:34.235930880,2019-10-24 14:57:34.235915564,4606797,T,IEX,11.710000,300
2019-10-24 14:58:37.378673920,2019-10-24 14:58:37.378655837,4651104,T,IEX,11.710000,100
2019-10-24 14:59:27.701286912,2019-10-24 14:59:27.701266118,4683326,T,IEX,11.705000,2800
2019-10-24 14:59:32.953158912,2019-10-24 14:59:32.953139066,4686130,T,IEX,11.705000,100
2019-10-24 15:02:48.528057088,2019-10-24 15:02:48.528041918,4806200,T,IEX,11.695000,300
2019-10-24 15:03:25.126053120,2019-10-24 15:03:25.126037184,4834702,T,IEX,11.695000,100
2019-10-24 15:04:42.156254976,2019-10-24 15:04:42.156234870,4892619,T,IEX,11.700000,300
2019-10-24 15:06:10.46532096,2019-10-24 15:06:10.46513178,4951009,T,IEX,11.695000,100
2019-10-24 15:09:16.681648128,2019-10-24 15:09:16.681632542,5066085,T,IEX,11.690000,200
2019-10-24 15:09:30.233968128,2019-10-24 15:09:30.233949534,5076598,T,IEX,11.690000,100
2019-10-24 15:10:15.976059904,2019-10-24 15:10:15.976039581,5103675,T,IEX,11.685000,100
2019-10-24 15:13:20.225209088,2019-10-24 15:13:20.225193809,5222993,T,IEX,11.710000,100
2019-10-24 15:16:32.70970880,2019-10-24 15:16:32.70953725,5328062,T,IEX,11.715000,100
2019-10-24 15:17:01.213171968,2019-10-24 15:17:01.213150423,5341169,T,IEX,11.715000,100
2019-10-24 15:18:17.443844096,2019-10-24 15:18:17.443824144,5378787,T,IEX,11.715000,100
2019-10-24 15:18:24.559289088,2019-10-24 15:18:24.559268833,5382634,T,IEX,11.715000,100
2019-10-24 15:21:00.776403968,2019-10-24 15:21:00.776386058,5474165,T,IEX,11.720000,200
2019-10-24 15:21:48.577010944,2019-10-24 15:21:48.576993210,5504314,T,IEX,11.715000,100
2019-10-24 15:22:01.660093952,2019-10-24 15:22:01.660075773,5510608,T,IEX,11.720000,100
2019-10-24 15:26:05.737814016,2019-10-24 15:26:05.737794003,5641611,T,IEX,11.705000,100
2019-10-24 15:26:55.677488128,2019-10-24 15:26:55.677470703,5667679,T,IEX,11.715000,100
2019-10-24 15:30:49.883725056,2019-10-24 15:30:49.883703621,5829570,T,IEX,11.740000,100
2019-10-24 15:32:54.584400896,2019-10-24 15:32:54.584387030,5899525,T,IEX,11.725000,100
2019-10-24 15:36:53.896500992,2019-10-24 15:36:53.896481235,6030495,T,IEX,11.750000,100
2019-10-24 15:40:01.213636096,2019-10-24 15:40:01.213614837,6124051,T,IEX,11.745000,100
2019-10-24 15:40:12.331785984,2019-10-24 15:40:12.331767123,6129588,T,IEX,11.745000,100
2019-10-24 15:41:28.605198080,2019-10-24 15:41:28.605180713,6164746,T,IEX,11.750000,100
2019-10-24 15:41:36.521740032,2019-10-24 15:41:36.521718315,6168071,T,IEX,11.750000,159
2019-10-24 15:41:37.674102016,2019-10-24 15:41:37.674082023,6168503,T,IEX,11.750000,100
2019-10-24 15:42:36.425193984,2019-10-24 15:42:36.425175678,6192714,T,IEX,11.750000,100
2019-10-24 15:42:36.425210112,2019-10-24 15:42:36.425195773,6192715,T,IEX,11.750000,100
2019-10-24 15:42:37.303671040,2019-10-24 15:42:37.303654615,6193064,T,IEX,11.750000,100
2019-10-24 15:42:39.247834112,2019-10-24 15:42:39.247816252,6193712,T,IEX,11.750000,100
2019-10-24 15:44:15.471836928,2019-10-24 15:44:15.471816221,6234526,T,IEX,11.750000,300
2019-10-24 15:44:32.781596928,2019-10-24 15:44:32.781576961,6241193,T,IEX,11.750000,200
2019-10-24 15:45:13.11407872,2019-10-24 15:45:13.11386819,6257903,T,IEX,11.755000,200
2019-10-24 15:45:17.889699072,2019-10-24 15:45:17.889679699,6259141,T,IEX,11.755000,100
2019-10-24 15:47:08.900752896,2019-10-24 15:47:08.900735271,6305126,T,IEX,11.755000,100
2019-10-24 15:47:08.907918080,2019-10-24 15:47:08.907897049,6305129,T,IEX,11.755000,300
2019-10-24 15:47:17.72558080,2019-10-24 15:47:17.72542402,6309806,T,IEX,11.755000,400
2019-10-24 15:47:17.77979904,2019-10-24 15:47:17.77960187,6309811,T,IEX,11.755000,300
2019-10-24 15:47:21.137396992,2019-10-24 15:47:21.137378913,6312225,T,IEX,11.755000,300
2019-10-24 15:47:21.143744000,2019-10-24 15:47:21.143723940,6312226,T,IEX,11.755000,300
2019-10-24 15:47:25.499790080,2019-10-24 15:47:25.499772337,6314960,T,IEX,11.755000,100
2019-10-24 15:47:25.554738944,2019-10-24 15:47:25.554719991,6315008,T,IEX,11.755000,100
2019-10-24 15:48:01.309274880,2019-10-24 15:48:01.309258133,6331086,T,IEX,11.745000,300
2019-10-24 15:48:01.316869120,2019-10-24 15:48:01.316852390,6331096,T,IEX,11.745000,300
2019-10-24 15:48:08.650660096,2019-10-24 15:48:08.650637877,6333931,T,IEX,11.740000,400
2019-10-24 15:48:36.162095104,2019-10-24 15:48:36.162076322,6344209,T,IEX,11.735000,100
2019-10-24 15:49:04.74332928,2019-10-24 15:49:04.74317693,6355370,T,IEX,11.735000,200
2019-10-24 15:49:04.82771968,2019-10-24 15:49:04.82752786,6355390,T,IEX,11.735000,100
2019-10-24 15:49:04.746222080,2019-10-24 15:49:04.746201892,6355715,T,IEX,11.730000,300
2019-10-24 15:49:08.300033024,2019-10-24 15:49:08.300013068,6357752,T,IEX,11.730000,300
2019-10-24 15:49:11.229928960,2019-10-24 15:49:11.229911050,6359197,T,IEX,11.725000,300
2019-10-24 15:49:16.285334016,2019-10-24 15:49:16.285315593,6361465,T,IEX,11.725000,100
2019-10-24 15:49:16.291867904,2019-10-24 15:49:16.291850539,6361474,T,IEX,11.725000,300
2019-10-24 15:49:17.714091008,2019-10-24 15:49:17.714071390,6362123,T,IEX,11.720000,300
2019-10-24 15:49:17.738258944,2019-10-24 15:49:17.738238073,6362139,T,IEX,11.720000,300
2019-10-24 15:49:38.224600064,2019-10-24 15:49:38.224580177,6370432,T,IEX,11.720000,300
2019-10-24 15:49:42.64009984,2019-10-24 15:49:42.63991379,6372198,T,IEX,11.720000,100
2019-10-24 15:51:35.885073920,2019-10-24 15:51:35.885054807,6433314,T,IEX,11.715000,300
2019-10-24 15:52:02.792557056,2019-10-24 15:52:02.792542411,6506078,T,IEX,11.715000,100
2019-10-24 15:54:04.458842880,2019-10-24 15:54:04.458821377,6603179,T,IEX,11.730000,500
2019-10-24 15:55:39.199707904,2019-10-24 15:55:39.199685997,6650880,T,IEX,11.745000,100
2019-10-24 16:01:01.880676096,2019-10-24 16:01:01.880656896,6829488,T,IEX,11.745000,100
2019-10-24 16:06:27.692724992,2019-10-24 16:06:27.692706599,7037244,T,IEX,11.725000,100
2019-10-24 16:10:29.748090112,2019-10-24 16:10:29.748074392,7192776,T,IEX,11.720000,100
2019-10-24 16:10:44.910383104,2019-10-24 16:10:44.910365316,7200998,T,IEX,11.725000,100
2019-10-24 16:10:44.910402048,2019-10-24 16:10:44.910385167,7200999,T,IEX,11.725000,100
2019-10-24 16:11:53.890157056,2019-10-24 16:11:53.890136877,7237821,T,IEX,11.730000,100
2019-10-24 16:11:56.656837120,2019-10-24 16:11:56.656819123,7238813,T,IEX,11.730000,100
2019-10-24 16:13:46.474291968,2019-10-24 16:13:46.474276706,7299175,T,IEX,11.730000,100
2019-10-24 16:18:44.793157120,2019-10-24 16:18:44.793135922,7500533,T,IEX,11.735000,100
2019-10-24 16:24:06.833426944,2019-10-24 16:24:06.833407890,7670499,T,IEX,11.735000,100
2019-10-24 16:24:08.98291968,2019-10-24 16:24:08.98277675,7670964,T,IEX,11.735000,100
2019-10-24 16:31:22.685071104,2019-10-24 16:31:22.685051670,7883247,T,IEX,11.755000,100
2019-10-24 16:32:03.11504128,2019-10-24 16:32:03.11483482,7898806,T,IEX,11.755000,100
2019-10-24 16:35:05.70360064,2019-10-24 16:35:05.70341361,7984890,T,IEX,11.760000,100
2019-10-24 16:41:54.399458048,2019-10-24 16:41:54.399443430,8156487,T,IEX,11.760000,100
2019-10-24 16:47:50.77980928,2019-10-24 16:47:50.77963705,8291522,T,IEX,11.765000,100
2019-10-24 16:48:32.532464128,2019-10-24 16:48:32.532447499,8307396,T,IEX,11.765000,100
2019-10-24 16:53:06.40828928,2019-10-24 16:53:06.40814480,8408566,T,IEX,11.755000,100
2019-10-24 16:53:10.365659904,2019-10-24 16:53:10.365639264,8410334,T,IEX,11.755000,100
2019-10-24 16:53:21.350266880,2019-10-24 16:53:21.350251227,8414420,T,IEX,11.760000,100
2019-10-24 16:54:32.503833088,2019-10-24 16:54:32.503816188,8436576,T,IEX,11.765000,100
2019-10-24 16:54:45.590176000,2019-10-24 16:54:45.590158865,8441044,T,IEX,11.765000,100
2019-10-24 16:56:54.695258880,2019-10-24 16:56:54.695240657,8501832,T,IEX,11.765000,100
2019-10-24 17:02:08.241180928,2019-10-24 17:02:08.241163231,8622307,T,IEX,11.775000,100
2019-10-24 17:03:31.849569024,2019-10-24 17:03:31.849548123,8650296,T,IEX,11.775000,201
2019-10-24 17:03:31.852139008,2019-10-24 17:03:31.852119509,8650297,T,IEX,11.775000,100
2019-10-24 17:03:31.853161984,2019-10-24 17:03:31.853141883,8650298,T,IEX,11.775000,100
2019-10-24 17:03:31.854391040,2019-10-24 17:03:31.854370257,8650299,T,IEX,11.775000,100
2019-10-24 17:03:31.855460096,2019-10-24 17:03:31.855438154,8650300,T,IEX,11.775000,100
2019-10-24 17:03:31.856505088,2019-10-24 17:03:31.856486234,8650301,T,IEX,11.775000,100
2019-10-24 17:07:44.387503104,2019-10-24 17:07:44.387485197,8744094,T,IEX,11.780000,100
2019-10-24 17:11:46.114208000,2019-10-24 17:11:46.114189894,8838844,T,IEX,11.780000,100
2019-10-24 17:18:33.303666944,2019-10-24 17:18:33.303651292,9000215,T,IEX,11.785000,100
2019-10-24 17:21:33.574839040,2019-10-24 17:21:33.574818832,9060179,T,IEX,11.775000,100
2019-10-24 17:25:51.371237120,2019-10-24 17:25:51.371222267,9144693,T,IEX,11.775000,100
2019-10-24 17:29:25.567471104,2019-10-24 17:29:25.567453362,9215825,T,IEX,11.780000,100
2019-10-24 17:33:37.517704960,2019-10-24 17:33:37.517686941,9305488,T,IEX,11.765000,100
2019-10-24 17:35:48.957268992,2019-10-24 17:35:48.957250142,9369288,T,IEX,11.765000,100
2019-10-24 17:38:48.403524096,2019-10-24 17:38:48.403502795,9440513,T,IEX,11.750000,100
2019-10-24 17:38:48.403540992,2019-10-24 17:38:48.403523412,9440514,T,IEX,11.750000,100
2019-10-24 17:46:06.849476096,2019-10-24 17:46:06.849460162,9587420,T,IEX,11.765000,100
2019-10-24 17:49:53.308109056,2019-10-24 17:49:53.308090278,9656991,T,IEX,11.770000,100
2019-10-24 17:55:31.348588032,2019-10-24 17:55:31.348573017,9783238,T,IEX,11.765000,100
2019-10-24 17:58:04.250120960,2019-10-24 17:58:04.250103033,9836761,T,IEX,11.775000,1000
2019-10-24 17:58:09.29991936,2019-10-24 17:58:09.29972989,9839308,T,IEX,11.780000,100
2019-10-24 18:01:42.312515072,2019-10-24 18:01:42.312499295,9922019,T,IEX,11.775000,100
2019-10-24 18:06:38.85263104,2019-10-24 18:06:38.85247604,10038315,T,IEX,11.775000,100
2019-10-24 18:08:05.90086912,2019-10-24 18:08:05.90066022,10067087,T,IEX,11.765000,100
2019-10-24 18:09:35.596491008,2019-10-24 18:09:35.596476202,10097787,T,IEX,11.755000,100
2019-10-24 18:10:08.433840128,2019-10-24 18:10:08.433820079,10109708,T,IEX,11.755000,100
2019-10-24 18:10:57.102528000,2019-10-24 18:10:57.102511815,10126112,T,IEX,11.755000,100
2019-10-24 18:11:02.130032128,2019-10-24 18:11:02.130013846,10127519,T,IEX,11.755000,100
2019-10-24 18:12:05.285853952,2019-10-24 18:12:05.285835171,10149074,T,IEX,11.755000,100
2019-10-24 18:13:41.369729024,2019-10-24 18:13:41.369708150,10184324,T,IEX,11.745000,100
2019-10-24 18:13:45.588419072,2019-10-24 18:13:45.588397746,10186868,T,IEX,11.745000,150
2019-10-24 18:14:32.287311104,2019-10-24 18:14:32.287296128,10204705,T,IEX,11.735000,150
2019-10-24 18:16:26.416400896,2019-10-24 18:16:26.416381412,10251087,T,IEX,11.725000,100
2019-10-24 18:19:12.180989952,2019-10-24 18:19:12.180966497,10311017,T,IEX,11.715000,100
2019-10-24 18:22:11.851486976,2019-10-24 18:22:11.851471363,10375967,T,IEX,11.700000,100
2019-10-24 18:22:19.461292032,2019-10-24 18:22:19.461272540,10379720,T,IEX,11.690000,4600
2019-10-24 18:22:43.258162944,2019-10-24 18:22:43.258145017,10388415,T,IEX,11.695000,14300
2019-10-24 18:25:40.703760896,2019-10-24 18:25:40.703738742,10459604,T,IEX,11.700000,100
2019-10-24 18:29:35.109931008,2019-10-24 18:29:35.109911487,10540864,T,IEX,11.740000,100
2019-10-24 18:30:37.373334016,2019-10-24 18:30:37.373312649,10563181,T,IEX,11.745000,5
2019-10-24 18:30:57.257124096,2019-10-24 18:30:57.257105257,10568368,T,IEX,11.750000,100
2019-10-24 18:31:39.552620032,2019-10-24 18:31:39.552605016,10585150,T,IEX,11.740000,500
2019-10-24 18:33:09.397064960,2019-10-24 18:33:09.397049128,10621842,T,IEX,11.735000,100
2019-10-24 18:43:19.315909888,2019-10-24 18:43:19.315892316,10835649,T,IEX,11.735000,100
2019-10-24 18:43:19.315927040,2019-10-24 18:43:19.315912845,10835650,T,IEX,11.735000,100
2019-10-24 18:44:55.957957888,2019-10-24 18:44:55.957940311,10869774,T,IEX,11.725000,100
2019-10-24 18:44:55.957971968,2019-10-24 18:44:55.957953346,10869775,T,IEX,11.725000,100
2019-10-24 18:46:44.836660992,2019-10-24 18:46:44.836641136,10908121,T,IEX,11.730000,200
2019-10-24 18:46:44.885886976,2019-10-24 18:46:44.885870291,10908141,T,IEX,11.730000,100
2019-10-24 18:46:46.235806976,2019-10-24 18:46:46.235789387,10908417,T,IEX,11.730000,100
2019-10-24 18:46:46.982832128,2019-10-24 18:46:46.982812724,10908702,T,IEX,11.730000,100
2019-10-24 18:46:47.264843008,2019-10-24 18:46:47.264824927,10908760,T,IEX,11.730000,100
2019-10-24 18:46:48.361112064,2019-10-24 18:46:48.361094539,10908985,T,IEX,11.730000,100
2019-10-24 18:48:21.374064896,2019-10-24 18:48:21.374049661,10941057,T,IEX,11.720000,1000
2019-10-24 18:51:56.160261120,2019-10-24 18:51:56.160243220,11006620,T,IEX,11.725000,100
2019-10-24 18:55:08.893987072,2019-10-24 18:55:08.893968030,11069291,T,IEX,11.725000,100
2019-10-24 18:57:47.227384064,2019-10-24 18:57:47.227366402,11113120,T,IEX,11.730000,700
2019-10-24 18:58:19.464857088,2019-10-24 18:58:19.464837838,11124069,T,IEX,11.735000,100
2019-10-24 19:02:03.423813120,2019-10-24 19:02:03.423794609,11205275,T,IEX,11.725000,14300
2019-10-24 19:02:03.423821056,2019-10-24 19:02:03.423797647,11205276,T,IEX,11.725000,700
2019-10-24 19:02:03.868232960,2019-10-24 19:02:03.868211130,11205529,T,IEX,11.735000,600
2019-10-24 19:04:08.373573888,2019-10-24 19:04:08.373559084,11243631,T,IEX,11.725000,100
2019-10-24 19:13:05.716784896,2019-10-24 19:13:05.716765744,11416006,T,IEX,11.715000,100
2019-10-24 19:24:58.831869952,2019-10-24 19:24:58.831853337,11668272,T,IEX,11.715000,100
2019-10-24 19:24:58.831884032,2019-10-24 19:24:58.831868293,11668273,T,IEX,11.715000,100
2019-10-24 19:29:07.729854976,2019-10-24 19:29:07.729835222,11760545,T,IEX,11.710000,1400
2019-10-24 19:29:07.729954048,2019-10-24 19:29:07.729936551,11760547,T,IEX,11.705000,100
2019-10-24 19:29:07.729972992,2019-10-24 19:29:07.729956305,11760548,T,IEX,11.705000,100
2019-10-24 19:31:02.138652928,2019-10-24 19:31:02.138633183,11809264,T,IEX,11.710000,50
2019-10-24 19:34:45.294496000,2019-10-24 19:34:45.294475993,11894701,T,IEX,11.715000,100
2019-10-24 19:36:55.358969088,2019-10-24 19:36:55.358952540,11949935,T,IEX,11.720000,200
2019-10-24 19:36:55.359066880,2019-10-24 19:36:55.359048220,11949937,T,IEX,11.720000,255
2019-10-24 19:36:55.359119104,2019-10-24 19:36:55.359102483,11949939,T,IEX,11.720000,200
2019-10-24 19:36:55.386771968,2019-10-24 19:36:55.386752713,11949983,T,IEX,11.720000,200
2019-10-24 19:36:55.387078912,2019-10-24 19:36:55.387061394,11949985,T,IEX,11.720000,100
2019-10-24 19:36:55.387452928,2019-10-24 19:36:55.387435788,11949987,T,IEX,11.720000,600
2019-10-24 19:39:09.347313920,2019-10-24 19:39:09.347297566,12011787,T,IEX,11.730000,200
2019-10-24 19:39:17.493835008,2019-10-24 19:39:17.493819991,12015339,T,IEX,11.725000,100
2019-10-24 19:43:45.753464064,2019-10-24 19:43:45.753445097,12135367,T,IEX,11.725000,100
2019-10-24 19:47:03.197143040,2019-10-24 19:47:03.197127819,12244766,T,IEX,11.725000,100
2019-10-24 19:48:10.866767872,2019-10-24 19:48:10.866745881,12286072,T,IEX,11.725000,100
2019-10-24 19:49:36.800560896,2019-10-24 19:49:36.800544447,12335770,T,IEX,11.725000,21
2019-10-24 19:49:36.800858112,2019-10-24 19:49:36.800838707,12335771,T,IEX,11.725000,72
2019-10-24 19:49:36.801383936,2019-10-24 19:49:36.801368572,12335772,T,IEX,11.725000,329
2019-10-24 19:49:36.801633024,2019-10-24 19:49:36.801615316,12335773,T,IEX,11.725000,196
2019-10-24 19:50:48.411836928,2019-10-24 19:50:48.411817447,12393029,T,IEX,11.730000,100
2019-10-24 19:50:54.142017024,2019-10-24 19:50:54.142000597,12396771,T,IEX,11.725000,100
2019-10-24 19:50:54.263219968,2019-10-24 19:50:54.263199569,12396866,T,IEX,11.730000,100
2019-10-24 19:51:03.874731008,2019-10-24 19:51:03.874712997,12403645,T,IEX,11.725000,100
2019-10-24 19:51:09.248638976,2019-10-24 19:51:09.248616442,12407857,T,IEX,11.730000,100
2019-10-24 19:51:34.780240896,2019-10-24 19:51:34.780216046,12425932,T,IEX,11.730000,1000
2019-10-24 19:52:34.509140992,2019-10-24 19:52:34.509119634,12466022,T,IEX,11.730000,3300
2019-10-24 19:53:33.276528128,2019-10-24 19:53:33.276508557,12505579,T,IEX,11.725000,100
2019-10-24 19:53:33.676894976,2019-10-24 19:53:33.676873205,12505807,T,IEX,11.730000,3000
2019-10-24 19:54:21.541666048,2019-10-24 19:54:21.541650295,12550211,T,IEX,11.730000,500
2019-10-24 19:54:25.205583872,2019-10-24 19:54:25.205561919,12552689,T,IEX,11.730000,1100
2019-10-24 19:54:33.955822080,2019-10-24 19:54:33.955800930,12558757,T,IEX,11.730000,4100
2019-10-24 19:54:41.789760000,2019-10-24 19:54:41.789738342,12564298,T,IEX,11.730000,2200
2019-10-24 19:54:42.716357120,2019-10-24 19:54:42.716341281,12565047,T,IEX,11.730000,100
2019-10-24 19:55:34.27699968,2019-10-24 19:55:34.27683255,12624132,T,IEX,11.725000,100
2019-10-24 19:56:54.953295872,2019-10-24 19:56:54.953280279,12697948,T,IEX,11.725000,100
2019-10-24 19:57:33.964424960,2019-10-24 19:57:33.964406209,12741256,T,IEX,11.730000,5000
2019-10-24 19:57:53.517718016,2019-10-24 19:57:53.517697130,12761727,T,IEX,11.730000,2300
2019-10-24 19:59:49.394630912,2019-10-24 19:59:49.394616020,12992466,T,IEX,11.735000,100
2019-10-24 19:59:51.776105984,2019-10-24 19:59:51.776089834,13007598,T,IEX,11.735000,100
2019-10-24 19:59:54.611077120,2019-10-24 19:59:54.611060494,13026578,T,IEX,11.740000,964
