StrategyName,EntryTime,LastModTime,State,LastUpdateType,Symbol,Side,Type,TIF,Price,Quantity,DisplayQuantity,FilledQty,Remains,AvgFillPrice,ExecutionCost,Account,Trader,Broker,MarketCenter,OrderId,Tag,Reason,Closure
IchimokuATRCrypto,2022-Jan-01 20:25:00,2022-Jan-01 20:25:00.011000,FILLED,FILL,MSFT,SELL,LIMIT,DAY,170.010000,-30,0,-30,0,177.843667,0.155511,SIM-1001-101,dlariviere,FILL_SIMULATOR,IEX,366133077872546,,,
IchimokuATRCrypto,2022-Jan-01 20:25:00,2022-Jan-01 20:25:00.011000,FILLED,FILL,MSFT,BUY,LIMIT,DAY,177.800000,30,0,30,0,170.016667,0.036000,SIM-1001-101,dlariviere,FILL_SIMULATOR,IEX,366133077872547,,,
IchimokuATRCrypto,2022-Jan-11 16:09:00,2022-Jan-11 16:09:00.011000,FILLED,FILL,MSFT,SELL,LIMIT,DAY,133.820000,-30,0,-30,0,138.350000,0.128971,SIM-1001-101,dlariviere,FILL_SIMULATOR,IEX,366133077872548,,,
IchimokuATRCrypto,2022-Jan-11 16:09:00,2022-Jan-11 16:09:00.011000,FILLED,FILL,MSFT,BUY,LIMIT,DAY,138.300000,30,0,30,0,133.820000,0.036000,SIM-1001-101,dlariviere,FILL_SIMULATOR,IEX,366133077872549,,,
IchimokuATRCrypto,2022-Jan-11 16:18:00,2022-Jan-11 16:18:00.011000,FILLED,FILL,MSFT,SELL,LIMIT,DAY,133.820000,-30,0,-30,0,139.310000,0.129616,SIM-1001-101,dlariviere,FILL_SIMULATOR,IEX,366133077872550,,,
IchimokuATRCrypto,2022-Jan-11 16:18:00,2022-Jan-11 16:18:00.011000,FILLED,FILL,MSFT,BUY,LIMIT,DAY,139.220000,30,0,30,0,133.820000,0.036000,SIM-1001-101,dlariviere,FILL_SIMULATOR,IEX,366133077872551,,,
IchimokuATRCrypto,2022-Jan-11 16:18:00,2022-Jan-11 16:18:00.011000,FILLED,FILL,MSFT,SELL,LIMIT,DAY,133.820000,-30,0,-30,0,139.310000,0.129616,SIM-1001-101,dlariviere,FILL_SIMULATOR,IEX,366133077872552,,,
IchimokuATRCrypto,2022-Jan-11 16:18:00,2022-Jan-11 16:18:00.011000,FILLED,FILL,MSFT,BUY,LIMIT,DAY,139.250000,30,0,30,0,133.820000,0.036000,SIM-1001-101,dlariviere,FILL_SIMULATOR,IEX,366133077872553,,,
IchimokuATRCrypto,2022-Jan-11 16:36:00,2022-Jan-11 16:36:00.011000,FILLED,FILL,MSFT,SELL,LIMIT,DAY,133.820000,-30,0,-30,0,139.600000,0.129811,SIM-1001-101,dlariviere,FILL_SIMULATOR,IEX,366133077872554,,,
IchimokuATRCrypto,2022-Jan-11 16:36:00,2022-Jan-11 16:36:00.011000,FILLED,FILL,MSFT,BUY,LIMIT,DAY,139.540000,30,0,30,0,133.820000,0.036000,SIM-1001-101,dlariviere,FILL_SIMULATOR,IEX,366133077872555,,,
IchimokuATRCrypto,2022-Jan-13 19:40:00,2022-Jan-13 19:40:00.011000,FILLED,FILL,MSFT,SELL,LIMIT,DAY,147.330000,-30,0,-30,0,157.624333,0.141924,SIM-1001-101,dlariviere,FILL_SIMULATOR,IEX,366133077872556,,,
IchimokuATRCrypto,2022-Jan-13 19:40:00,2022-Jan-13 19:40:00.011000,FILLED,FILL,MSFT,BUY,LIMIT,DAY,157.580000,30,0,30,0,147.338667,0.036000,SIM-1001-101,dlariviere,FILL_SIMULATOR,IEX,366133077872557,,,
IchimokuATRCrypto,2022-Jan-20 15:04:00,2022-Jan-20 15:04:00.011000,FILLED,FILL,MSFT,SELL,LIMIT,DAY,134.740000,-30,0,-30,0,142.494667,0.131756,SIM-1001-101,dlariviere,FILL_SIMULATOR,IEX,366133077872558,,,
IchimokuATRCrypto,2022-Jan-20 15:04:00,2022-Jan-20 15:04:00.011000,FILLED,FILL,MSFT,BUY,LIMIT,DAY,142.380000,30,0,30,0,134.740000,0.036000,SIM-1001-101,dlariviere,FILL_SIMULATOR,IEX,366133077872559,,,
IchimokuATRCrypto,2022-Jan-20 15:04:00,2022-Jan-20 15:04:00.011000,FILLED,FILL,MSFT,SELL,LIMIT,DAY,134.740000,-30,0,-30,0,142.494667,0.131756,SIM-1001-101,dlariviere,FILL_SIMULATOR,IEX,366133077872560,,,
IchimokuATRCrypto,2022-Jan-20 15:04:00,2022-Jan-20 15:04:00.011000,FILLED,FILL,MSFT,BUY,LIMIT,DAY,142.400000,30,0,30,0,134.740000,0.036000,SIM-1001-101,dlariviere,FILL_SIMULATOR,IEX,366133077872561,,,
