2019-10-07 13:30:05.895128064,2019-10-07 13:30:05.895101642,87866,T,IEX,120.750000,100
2019-10-07 13:33:49.393840128,2019-10-07 13:33:49.393811468,325102,T,IEX,120.415000,200
2019-10-07 13:34:44.73819904,2019-10-07 13:34:44.73802624,382740,T,IEX,120.190000,100
2019-10-07 13:34:47.460558080,2019-10-07 13:34:47.460537225,386743,T,IEX,120.245000,200
2019-10-07 13:35:04.895695104,2019-10-07 13:35:04.895676556,404899,T,IEX,120.180000,100
2019-10-07 13:35:15.398924032,2019-10-07 13:35:15.398905748,417107,T,IEX,120.185000,200
2019-10-07 13:35:27.243129088,2019-10-07 13:35:27.243111309,429035,T,IEX,120.170000,5
2019-10-07 13:35:28.485518080,2019-10-07 13:35:28.485499400,430125,T,IEX,120.205000,100
2019-10-07 13:35:53.228157952,2019-10-07 13:35:53.228137759,456666,T,IEX,120.060000,100
2019-10-07 13:36:04.658446080,2019-10-07 13:36:04.658426266,470013,T,IEX,120.020000,100
2019-10-07 13:36:32.163545088,2019-10-07 13:36:32.163528269,494668,T,IEX,119.985000,1
2019-10-07 13:36:51.797661952,2019-10-07 13:36:51.797644434,515040,T,IEX,119.850000,15
2019-10-07 13:36:51.797863936,2019-10-07 13:36:51.797847020,515043,T,IEX,119.850000,85
2019-10-07 13:36:51.812484096,2019-10-07 13:36:51.812465968,515072,T,IEX,119.850000,100
2019-10-07 13:36:54.777794048,2019-10-07 13:36:54.777772769,517584,T,IEX,119.760000,1
2019-10-07 13:37:20.631162112,2019-10-07 13:37:20.631143491,540549,T,IEX,119.830000,100
2019-10-07 13:37:26.956562944,2019-10-07 13:37:26.956545622,547574,T,IEX,119.970000,1
2019-10-07 13:38:10.121570048,2019-10-07 13:38:10.121548823,581554,T,IEX,119.820000,100
2019-10-07 13:38:10.122405120,2019-10-07 13:38:10.122385056,581558,T,IEX,119.820000,100
2019-10-07 13:39:04.835598080,2019-10-07 13:39:04.835577893,622539,T,IEX,119.905000,1
2019-10-07 13:39:40.724259072,2019-10-07 13:39:40.724239145,649265,T,IEX,119.890000,1
2019-10-07 13:39:41.792646912,2019-10-07 13:39:41.792628959,650028,T,IEX,119.920000,100
2019-10-07 13:39:41.812741888,2019-10-07 13:39:41.812722802,650039,T,IEX,119.950000,1
2019-10-07 13:40:50.924293120,2019-10-07 13:40:50.924274530,706011,T,IEX,120.035000,1
2019-10-07 13:41:02.686883072,2019-10-07 13:41:02.686860344,714836,T,IEX,120.035000,1
2019-10-07 13:41:02.699386112,2019-10-07 13:41:02.699370333,714848,T,IEX,120.075000,3
2019-10-07 13:41:02.709481984,2019-10-07 13:41:02.709466937,714887,T,IEX,120.130000,1
2019-10-07 13:41:15.142231040,2019-10-07 13:41:15.142211517,723560,T,IEX,120.105000,10
2019-10-07 13:41:15.153543936,2019-10-07 13:41:15.153523891,723585,T,IEX,120.140000,2
2019-10-07 13:41:15.169991936,2019-10-07 13:41:15.169975253,723604,T,IEX,120.110000,1
2019-10-07 13:41:22.848001024,2019-10-07 13:41:22.847981516,730825,T,IEX,120.155000,1
2019-10-07 13:41:32.358462976,2019-10-07 13:41:32.358442783,738749,T,IEX,120.130000,1
2019-10-07 13:42:17.102631936,2019-10-07 13:42:17.102616603,778825,T,IEX,120.110000,1
2019-10-07 13:42:46.662976000,2019-10-07 13:42:46.662954678,797428,T,IEX,120.280000,4
2019-10-07 13:43:06.580997888,2019-10-07 13:43:06.580979425,812585,T,IEX,120.165000,3
2019-10-07 13:44:33.96893952,2019-10-07 13:44:33.96874905,876191,T,IEX,120.100000,2
2019-10-07 13:44:33.906511872,2019-10-07 13:44:33.906494232,876894,T,IEX,120.105000,7
2019-10-07 13:55:33.336897024,2019-10-07 13:55:33.336876348,1473494,T,IEX,120.800000,100
2019-10-07 13:59:55.554462976,2019-10-07 13:59:55.554445445,1680849,T,IEX,120.670000,1
2019-10-07 14:01:02.505060096,2019-10-07 14:01:02.505039151,1745158,T,IEX,120.620000,6
2019-10-07 14:01:02.505110016,2019-10-07 14:01:02.505092845,1745160,T,IEX,120.620000,75
2019-10-07 14:01:02.505149952,2019-10-07 14:01:02.505132228,1745161,T,IEX,120.620000,19
2019-10-07 14:01:52.231796992,2019-10-07 14:01:52.231775568,1791278,T,IEX,120.600000,1
2019-10-07 14:02:42.426940928,2019-10-07 14:02:42.426921898,1830352,T,IEX,120.690000,4
2019-10-07 14:02:42.426949888,2019-10-07 14:02:42.426932407,1830353,T,IEX,120.690000,66
2019-10-07 14:03:37.871980032,2019-10-07 14:03:37.871963016,1875886,T,IEX,120.650000,2
2019-10-07 14:03:37.872004096,2019-10-07 14:03:37.871986253,1875888,T,IEX,120.650000,26
2019-10-07 14:04:28.38851072,2019-10-07 14:04:28.38829737,1913990,T,IEX,120.680000,100
2019-10-07 14:05:00.47326976,2019-10-07 14:05:00.47310557,1941350,T,IEX,120.730000,1
2019-10-07 14:05:43.552040960,2019-10-07 14:05:43.552022872,2000105,T,IEX,120.845000,2
2019-10-07 14:05:43.552068096,2019-10-07 14:05:43.552050151,2000106,T,IEX,120.845000,2
2019-10-07 14:07:19.326150912,2019-10-07 14:07:19.326129849,2109880,T,IEX,120.910000,50
2019-10-07 14:09:29.229036032,2019-10-07 14:09:29.229017351,2208088,T,IEX,120.895000,100
2019-10-07 14:14:16.116356096,2019-10-07 14:14:16.116340160,2426078,T,IEX,120.935000,100
2019-10-07 14:14:17.345708032,2019-10-07 14:14:17.345687218,2427746,T,IEX,120.930000,100
2019-10-07 14:14:34.337060096,2019-10-07 14:14:34.337042119,2440670,T,IEX,120.940000,2
2019-10-07 14:16:06.181904896,2019-10-07 14:16:06.181884191,2512635,T,IEX,120.990000,100
2019-10-07 14:18:14.966714112,2019-10-07 14:18:14.966692329,2596761,T,IEX,120.770000,100
2019-10-07 14:18:14.966725888,2019-10-07 14:18:14.966706735,2596762,T,IEX,120.770000,100
2019-10-07 14:18:14.966738944,2019-10-07 14:18:14.966721187,2596763,T,IEX,120.770000,100
2019-10-07 14:21:19.475212032,2019-10-07 14:21:19.475192773,2718977,T,IEX,120.840000,100
2019-10-07 14:21:20.58640896,2019-10-07 14:21:20.58620275,2719788,T,IEX,120.850000,200
2019-10-07 14:21:20.59478016,2019-10-07 14:21:20.59456824,2719790,T,IEX,120.850000,7
2019-10-07 14:21:20.59486976,2019-10-07 14:21:20.59470213,2719791,T,IEX,120.850000,27
2019-10-07 14:23:32.738515968,2019-10-07 14:23:32.738495441,2810499,T,IEX,120.765000,1
2019-10-07 14:23:45.774629120,2019-10-07 14:23:45.774609468,2817088,T,IEX,120.790000,10
2019-10-07 14:23:45.774944000,2019-10-07 14:23:45.774925294,2817100,T,IEX,120.790000,90
2019-10-07 14:26:59.591024896,2019-10-07 14:26:59.591006259,2955145,T,IEX,120.820000,37
2019-10-07 14:27:05.483214080,2019-10-07 14:27:05.483193841,2963637,T,IEX,120.845000,25
2019-10-07 14:27:17.728119040,2019-10-07 14:27:17.728101006,2975400,T,IEX,120.850000,38
2019-10-07 14:27:50.560327936,2019-10-07 14:27:50.560310501,2993270,T,IEX,120.855000,2
2019-10-07 14:30:23.956563968,2019-10-07 14:30:23.956545445,3095166,T,IEX,120.750000,100
2019-10-07 14:31:28.328284928,2019-10-07 14:31:28.328269352,3142761,T,IEX,120.710000,100
2019-10-07 14:32:02.527824896,2019-10-07 14:32:02.527803427,3165934,T,IEX,120.715000,1
2019-10-07 14:32:07.391803904,2019-10-07 14:32:07.391787986,3169981,T,IEX,120.710000,100
2019-10-07 14:33:39.157035008,2019-10-07 14:33:39.157017324,3232244,T,IEX,120.640000,100
2019-10-07 14:37:09.660080128,2019-10-07 14:37:09.660060960,3388922,T,IEX,120.465000,4
2019-10-07 14:37:09.662256128,2019-10-07 14:37:09.662201889,3389015,T,IEX,120.465000,2
2019-10-07 14:37:32.942419968,2019-10-07 14:37:32.942401825,3411459,T,IEX,120.520000,100
2019-10-07 14:37:34.347002112,2019-10-07 14:37:34.346981069,3412945,T,IEX,120.520000,100
2019-10-07 14:37:35.446054912,2019-10-07 14:37:35.446037348,3413486,T,IEX,120.480000,100
2019-10-07 14:37:39.325718016,2019-10-07 14:37:39.325698066,3415475,T,IEX,120.430000,100
2019-10-07 14:37:39.325733888,2019-10-07 14:37:39.325711526,3415476,T,IEX,120.430000,100
2019-10-07 14:39:05.139345920,2019-10-07 14:39:05.139327528,3471098,T,IEX,120.310000,100
2019-10-07 14:39:32.740616960,2019-10-07 14:39:32.740594507,3490133,T,IEX,120.340000,47
2019-10-07 14:39:32.740893952,2019-10-07 14:39:32.740876110,3490140,T,IEX,120.340000,5
2019-10-07 14:39:45.535570944,2019-10-07 14:39:45.535549211,3498917,T,IEX,120.330000,100
2019-10-07 14:41:14.388954880,2019-10-07 14:41:14.388937003,3565306,T,IEX,120.490000,1
2019-10-07 14:41:43.605496064,2019-10-07 14:41:43.605475905,3583380,T,IEX,120.590000,1
2019-10-07 14:41:43.605595904,2019-10-07 14:41:43.605577878,3583385,T,IEX,120.590000,1
2019-10-07 14:41:43.605798912,2019-10-07 14:41:43.605778418,3583397,T,IEX,120.590000,1
2019-10-07 14:42:10.309822976,2019-10-07 14:42:10.309803461,3605207,T,IEX,120.590000,197
2019-10-07 14:43:26.749860096,2019-10-07 14:43:26.749839167,3656222,T,IEX,120.570000,100
2019-10-07 14:43:29.143781888,2019-10-07 14:43:29.143763133,3658017,T,IEX,120.575000,100
2019-10-07 14:43:34.4009984,2019-10-07 14:43:34.3989296,3660253,T,IEX,120.570000,35
2019-10-07 14:43:45.355869952,2019-10-07 14:43:45.355849481,3667436,T,IEX,120.595000,1
2019-10-07 14:45:29.245853952,2019-10-07 14:45:29.245834292,3753338,T,IEX,120.595000,1
2019-10-07 14:46:02.603508992,2019-10-07 14:46:02.603488348,3788157,T,IEX,120.595000,1
2019-10-07 14:46:02.603520000,2019-10-07 14:46:02.603501009,3788158,T,IEX,120.595000,99
2019-10-07 14:46:03.811933952,2019-10-07 14:46:03.811914849,3789063,T,IEX,120.595000,1
2019-10-07 14:46:59.770969088,2019-10-07 14:46:59.770953137,3826275,T,IEX,120.625000,100
2019-10-07 14:47:19.185870080,2019-10-07 14:47:19.185851039,3840431,T,IEX,120.635000,1
2019-10-07 14:47:42.436784128,2019-10-07 14:47:42.436765174,3858457,T,IEX,120.690000,100
2019-10-07 14:48:11.849978880,2019-10-07 14:48:11.849958802,3876128,T,IEX,120.715000,100
2019-10-07 14:48:19.298106880,2019-10-07 14:48:19.298089343,3880005,T,IEX,120.695000,2
2019-10-07 14:48:19.298124032,2019-10-07 14:48:19.298107525,3880006,T,IEX,120.695000,98
2019-10-07 14:48:53.553180928,2019-10-07 14:48:53.553162976,3898052,T,IEX,120.750000,100
2019-10-07 14:49:22.783598080,2019-10-07 14:49:22.783578627,3914403,T,IEX,120.730000,1
2019-10-07 14:49:24.359493888,2019-10-07 14:49:24.359475995,3915263,T,IEX,120.730000,1
2019-10-07 14:50:49.175564032,2019-10-07 14:50:49.175545281,3971870,T,IEX,120.760000,100
2019-10-07 14:51:00.171217920,2019-10-07 14:51:00.171201682,3979861,T,IEX,120.740000,100
2019-10-07 14:52:57.707784960,2019-10-07 14:52:57.707767634,4051704,T,IEX,120.710000,100
2019-10-07 14:52:57.724278016,2019-10-07 14:52:57.724258338,4051863,T,IEX,120.710000,200
2019-10-07 14:53:28.142977024,2019-10-07 14:53:28.142959135,4073022,T,IEX,120.705000,100
2019-10-07 14:53:42.171313920,2019-10-07 14:53:42.171295323,4079748,T,IEX,120.705000,1
2019-10-07 14:54:13.698682880,2019-10-07 14:54:13.698667037,4100305,T,IEX,120.780000,50
2019-10-07 14:54:13.699655936,2019-10-07 14:54:13.699640780,4100307,T,IEX,120.780000,50
2019-10-07 14:56:28.483640064,2019-10-07 14:56:28.483620841,4217219,T,IEX,120.870000,100
2019-10-07 14:57:42.260013056,2019-10-07 14:57:42.259993026,4264746,T,IEX,120.905000,100
