2019-10-15 13:31:41.688731904,2019-10-15 13:31:41.688701639,219182,T,IEX,235.000000,127
2019-10-15 13:31:41.689265920,2019-10-15 13:31:41.689247158,219185,T,IEX,235.000000,100
2019-10-15 13:31:53.539699968,2019-10-15 13:31:53.539678029,229562,T,IEX,235.110000,100
2019-10-15 13:32:34.105084928,2019-10-15 13:32:34.105061515,271277,T,IEX,234.950000,5
2019-10-15 13:33:21.438653952,2019-10-15 13:33:21.438636471,320795,T,IEX,234.800000,100
2019-10-15 13:33:25.323411968,2019-10-15 13:33:25.323396189,324588,T,IEX,234.900000,100
2019-10-15 13:34:22.821187072,2019-10-15 13:34:22.821167226,377554,T,IEX,234.850000,100
2019-10-15 13:35:04.100184064,2019-10-15 13:35:04.100162762,414786,T,IEX,234.760000,38
2019-10-15 13:35:22.201335040,2019-10-15 13:35:22.201316209,432569,T,IEX,234.775000,26
2019-10-15 13:37:07.535845888,2019-10-15 13:37:07.535828574,539673,T,IEX,235.105000,25
2019-10-15 13:37:07.535904000,2019-10-15 13:37:07.535888109,539675,T,IEX,235.100000,75
2019-10-15 13:39:27.690363904,2019-10-15 13:39:27.690343791,659768,T,IEX,235.130000,100
2019-10-15 13:39:59.934149888,2019-10-15 13:39:59.934124720,684054,T,IEX,235.030000,100
2019-10-15 13:42:52.483259904,2019-10-15 13:42:52.483239385,824364,T,IEX,235.200000,100
2019-10-15 13:42:52.896193024,2019-10-15 13:42:52.896173667,824796,T,IEX,235.240000,100
2019-10-15 13:42:54.123831040,2019-10-15 13:42:54.123813761,825621,T,IEX,235.320000,100
2019-10-15 13:44:46.976806912,2019-10-15 13:44:46.976788380,918825,T,IEX,235.430000,100
2019-10-15 13:47:17.148484096,2019-10-15 13:47:17.148463764,1054846,T,IEX,235.220000,100
2019-10-15 13:48:15.649231104,2019-10-15 13:48:15.649209584,1105748,T,IEX,235.500000,20
2019-10-15 13:49:13.858832896,2019-10-15 13:49:13.858812281,1153659,T,IEX,235.490000,100
2019-10-15 13:49:16.995328000,2019-10-15 13:49:16.995308286,1156715,T,IEX,235.550000,10
2019-10-15 13:52:17.111298048,2019-10-15 13:52:17.111280162,1303501,T,IEX,235.500000,100
2019-10-15 13:53:05.860260096,2019-10-15 13:53:05.860240944,1339360,T,IEX,235.430000,100
2019-10-15 13:54:45.44358912,2019-10-15 13:54:45.44337363,1410050,T,IEX,235.400000,19
2019-10-15 13:55:50.64353024,2019-10-15 13:55:50.64336619,1461112,T,IEX,235.230000,100
2019-10-15 13:56:07.552386048,2019-10-15 13:56:07.552367024,1474257,T,IEX,235.240000,100
2019-10-15 13:56:56.80177920,2019-10-15 13:56:56.80159714,1510962,T,IEX,235.220000,100
2019-10-15 13:57:39.889640960,2019-10-15 13:57:39.889623250,1539087,T,IEX,235.380000,300
2019-10-15 13:58:12.844346112,2019-10-15 13:58:12.844326857,1560363,T,IEX,235.440000,1
2019-10-15 13:59:57.677512960,2019-10-15 13:59:57.677493429,1635571,T,IEX,235.450000,100
2019-10-15 13:59:57.679175936,2019-10-15 13:59:57.679156511,1635572,T,IEX,235.450000,135
2019-10-15 13:59:57.680486912,2019-10-15 13:59:57.680466178,1635573,T,IEX,235.450000,65
2019-10-15 14:00:49.252435968,2019-10-15 14:00:49.252417169,1674593,T,IEX,235.560000,200
2019-10-15 14:00:49.253054976,2019-10-15 14:00:49.253039346,1674596,T,IEX,235.570000,100
2019-10-15 14:00:56.753993984,2019-10-15 14:00:56.753976662,1679148,T,IEX,235.540000,100
2019-10-15 14:01:00.117476096,2019-10-15 14:01:00.117460063,1680841,T,IEX,235.545000,300
2019-10-15 14:01:00.321523968,2019-10-15 14:01:00.321506509,1681248,T,IEX,235.540000,800
2019-10-15 14:01:18.16361984,2019-10-15 14:01:18.16340642,1695367,T,IEX,235.490000,15
2019-10-15 14:01:18.16410112,2019-10-15 14:01:18.16392962,1695368,T,IEX,235.490000,18
2019-10-15 14:01:18.16450048,2019-10-15 14:01:18.16433471,1695369,T,IEX,235.480000,8
2019-10-15 14:01:33.464711936,2019-10-15 14:01:33.464692427,1705783,T,IEX,235.480000,6
2019-10-15 14:01:57.155650048,2019-10-15 14:01:57.155630137,1722884,T,IEX,235.370000,3
2019-10-15 14:02:27.594962944,2019-10-15 14:02:27.594942657,1764369,T,IEX,235.440000,100
2019-10-15 14:02:42.788521984,2019-10-15 14:02:42.788503882,1778046,T,IEX,235.445000,200
2019-10-15 14:03:55.52086016,2019-10-15 14:03:55.52068751,1827520,T,IEX,235.565000,200
2019-10-15 14:04:20.254051072,2019-10-15 14:04:20.254031330,1846239,T,IEX,235.555000,10
2019-10-15 14:05:32.878149888,2019-10-15 14:05:32.878126193,1899058,T,IEX,235.430000,66
2019-10-15 14:05:57.866708992,2019-10-15 14:05:57.866691043,1917613,T,IEX,235.510000,100
2019-10-15 14:07:17.917908992,2019-10-15 14:07:17.917889637,1972150,T,IEX,235.410000,3
2019-10-15 14:09:29.105933056,2019-10-15 14:09:29.105911946,2046234,T,IEX,235.210000,100
2019-10-15 14:12:47.431616000,2019-10-15 14:12:47.431596519,2205467,T,IEX,235.590000,300
2019-10-15 14:12:47.440313088,2019-10-15 14:12:47.440293673,2205479,T,IEX,235.590000,3000
2019-10-15 14:13:22.476316928,2019-10-15 14:13:22.476300423,2232765,T,IEX,235.580000,300
2019-10-15 14:13:35.725379072,2019-10-15 14:13:35.725356226,2245079,T,IEX,235.575000,300
2019-10-15 14:13:51.914400000,2019-10-15 14:13:51.914380615,2256585,T,IEX,235.550000,400
2019-10-15 14:15:01.550235904,2019-10-15 14:15:01.550214926,2308373,T,IEX,235.780000,1
2019-10-15 14:17:01.123183104,2019-10-15 14:17:01.123164330,2393832,T,IEX,235.830000,16
2019-10-15 14:20:05.677977088,2019-10-15 14:20:05.677956529,2520281,T,IEX,235.800000,5
2019-10-15 14:20:43.539855872,2019-10-15 14:20:43.539835593,2545851,T,IEX,235.815000,100
2019-10-15 14:20:43.865413120,2019-10-15 14:20:43.865391152,2546024,T,IEX,235.815000,100
2019-10-15 14:21:28.877988096,2019-10-15 14:21:28.877967570,2571998,T,IEX,235.785000,1
2019-10-15 14:22:13.485159936,2019-10-15 14:22:13.485140727,2596048,T,IEX,235.730000,2
2019-10-15 14:22:17.450057984,2019-10-15 14:22:17.450039462,2597980,T,IEX,235.740000,1
2019-10-15 14:22:23.270084096,2019-10-15 14:22:23.270065961,2601008,T,IEX,235.735000,100
2019-10-15 14:23:06.908354048,2019-10-15 14:23:06.908337271,2629710,T,IEX,235.720000,100
2019-10-15 14:23:21.800802048,2019-10-15 14:23:21.800779041,2640674,T,IEX,235.660000,1
2019-10-15 14:23:21.819485952,2019-10-15 14:23:21.819470423,2640689,T,IEX,235.710000,100
2019-10-15 14:23:29.866669056,2019-10-15 14:23:29.866650636,2645543,T,IEX,235.645000,3
2019-10-15 14:23:48.403507968,2019-10-15 14:23:48.403488142,2657796,T,IEX,235.550000,1
2019-10-15 14:24:16.760487936,2019-10-15 14:24:16.760468000,2676701,T,IEX,235.490000,1
2019-10-15 14:24:21.294227968,2019-10-15 14:24:21.294208594,2679561,T,IEX,235.500000,1
2019-10-15 14:24:58.75386880,2019-10-15 14:24:58.75371333,2701068,T,IEX,235.570000,100
2019-10-15 14:24:59.72683008,2019-10-15 14:24:59.72664682,2701623,T,IEX,235.570000,100
2019-10-15 14:25:45.845082880,2019-10-15 14:25:45.845063379,2733668,T,IEX,235.560000,1
2019-10-15 14:26:17.268681984,2019-10-15 14:26:17.268663510,2757210,T,IEX,235.580000,2
2019-10-15 14:26:18.631021056,2019-10-15 14:26:18.631001407,2757728,T,IEX,235.580000,4
2019-10-15 14:27:20.666364928,2019-10-15 14:27:20.666345405,2801727,T,IEX,235.560000,1
2019-10-15 14:27:20.958041088,2019-10-15 14:27:20.958020274,2804226,T,IEX,235.580000,3
2019-10-15 14:27:36.348610048,2019-10-15 14:27:36.348590395,2854591,T,IEX,235.660000,100
2019-10-15 14:27:39.146383872,2019-10-15 14:27:39.146364183,2862073,T,IEX,235.670000,2
2019-10-15 14:27:41.78861056,2019-10-15 14:27:41.78841437,2868600,T,IEX,235.710000,1
2019-10-15 14:27:41.86904064,2019-10-15 14:27:41.86886299,2868846,T,IEX,235.780000,80
2019-10-15 14:27:50.850569984,2019-10-15 14:27:50.850547640,2890315,T,IEX,235.630000,1
2019-10-15 14:27:50.850596096,2019-10-15 14:27:50.850578152,2890316,T,IEX,235.630000,68
2019-10-15 14:27:58.767593984,2019-10-15 14:27:58.767577741,2904352,T,IEX,235.650000,2
2019-10-15 14:27:58.775943936,2019-10-15 14:27:58.775925758,2904364,T,IEX,235.680000,1
2019-10-15 14:28:14.45902080,2019-10-15 14:28:14.45881570,2928160,T,IEX,235.735000,1
2019-10-15 14:28:16.32475904,2019-10-15 14:28:16.32454286,2931602,T,IEX,235.735000,1
2019-10-15 14:28:27.794330880,2019-10-15 14:28:27.794313975,2948902,T,IEX,235.795000,1
2019-10-15 14:28:45.259675904,2019-10-15 14:28:45.259657890,2973659,T,IEX,235.740000,1
2019-10-15 14:28:58.470863872,2019-10-15 14:28:58.470846566,2991938,T,IEX,235.800000,60
2019-10-15 14:29:33.523043072,2019-10-15 14:29:33.523025114,3041060,T,IEX,235.670000,1
2019-10-15 14:29:33.634585088,2019-10-15 14:29:33.634566032,3041376,T,IEX,235.705000,1
2019-10-15 14:30:32.273314048,2019-10-15 14:30:32.273294071,3128256,T,IEX,235.655000,1
2019-10-15 14:31:06.767329024,2019-10-15 14:31:06.767313537,3166639,T,IEX,235.655000,1
2019-10-15 14:31:12.355581952,2019-10-15 14:31:12.355561628,3173801,T,IEX,235.660000,1
2019-10-15 14:31:58.117970944,2019-10-15 14:31:58.117941179,3228933,T,IEX,235.675000,1
2019-10-15 14:32:07.609143040,2019-10-15 14:32:07.609124948,3242129,T,IEX,235.740000,3
2019-10-15 14:32:10.453106944,2019-10-15 14:32:10.453085951,3244793,T,IEX,235.755000,1
2019-10-15 14:32:21.595493120,2019-10-15 14:32:21.595474936,3258571,T,IEX,235.810000,1
2019-10-15 14:32:21.615815936,2019-10-15 14:32:21.615798103,3259245,T,IEX,235.805000,50
2019-10-15 14:32:21.616634880,2019-10-15 14:32:21.616615393,3259272,T,IEX,235.805000,100
2019-10-15 14:32:27.336982016,2019-10-15 14:32:27.336964344,3268355,T,IEX,235.830000,2
2019-10-15 14:32:27.337006080,2019-10-15 14:32:27.336990603,3268356,T,IEX,235.830000,3
2019-10-15 14:32:42.526459904,2019-10-15 14:32:42.526439547,3290420,T,IEX,235.825000,1
2019-10-15 14:32:42.526482944,2019-10-15 14:32:42.526466524,3290421,T,IEX,235.825000,9
2019-10-15 14:32:45.541436928,2019-10-15 14:32:45.541418260,3294798,T,IEX,235.840000,1
2019-10-15 14:33:02.877810944,2019-10-15 14:33:02.877791387,3313152,T,IEX,235.825000,1
2019-10-15 14:33:12.871567104,2019-10-15 14:33:12.871549212,3327173,T,IEX,235.785000,1
2019-10-15 14:33:25.348047872,2019-10-15 14:33:25.348029850,3339400,T,IEX,235.840000,100
2019-10-15 14:33:33.767981056,2019-10-15 14:33:33.767960107,3348170,T,IEX,235.835000,1
2019-10-15 14:33:36.414358016,2019-10-15 14:33:36.414337535,3350420,T,IEX,235.830000,1
2019-10-15 14:34:06.611830016,2019-10-15 14:34:06.611808514,3377174,T,IEX,235.775000,1
2019-10-15 14:35:01.147554048,2019-10-15 14:35:01.147537552,3425245,T,IEX,235.880000,2
2019-10-15 14:35:48.787683072,2019-10-15 14:35:48.787663162,3476916,T,IEX,235.865000,100
2019-10-15 14:37:35.292377088,2019-10-15 14:37:35.292359760,3602536,T,IEX,235.950000,50
2019-10-15 14:37:35.292402944,2019-10-15 14:37:35.292387242,3602537,T,IEX,235.980000,50
2019-10-15 14:37:35.295376896,2019-10-15 14:37:35.295360670,3602550,T,IEX,235.945000,100
2019-10-15 14:37:35.296817920,2019-10-15 14:37:35.296797542,3602553,T,IEX,235.945000,1
2019-10-15 14:37:35.300685056,2019-10-15 14:37:35.300667994,3602561,T,IEX,235.980000,100
2019-10-15 14:37:35.302202880,2019-10-15 14:37:35.302186817,3602564,T,IEX,235.980000,100
2019-10-15 14:37:35.312103936,2019-10-15 14:37:35.312086608,3602578,T,IEX,235.980000,3
2019-10-15 14:37:36.690507008,2019-10-15 14:37:36.690490970,3603474,T,IEX,235.990000,1
2019-10-15 14:37:36.699610112,2019-10-15 14:37:36.699594287,3603485,T,IEX,235.960000,2
2019-10-15 14:37:52.44109056,2019-10-15 14:37:52.44088693,3616934,T,IEX,236.050000,1
2019-10-15 14:37:57.887659008,2019-10-15 14:37:57.887638743,3622767,T,IEX,236.060000,2
2019-10-15 14:38:10.51848960,2019-10-15 14:38:10.51830890,3638001,T,IEX,236.005000,1
2019-10-15 14:38:18.158062080,2019-10-15 14:38:18.158040852,3645304,T,IEX,236.010000,3
2019-10-15 14:38:20.304687104,2019-10-15 14:38:20.304668537,3648019,T,IEX,236.060000,100
2019-10-15 14:38:50.926305024,2019-10-15 14:38:50.926282365,3680524,T,IEX,236.040000,2
2019-10-15 14:38:59.715471872,2019-10-15 14:38:59.715453631,3690554,T,IEX,236.070000,5
2019-10-15 14:39:00.93213952,2019-10-15 14:39:00.93195229,3691134,T,IEX,236.065000,4
2019-10-15 14:39:13.269280000,2019-10-15 14:39:13.269264773,3707960,T,IEX,236.035000,1
2019-10-15 14:39:35.133071104,2019-10-15 14:39:35.133050212,3730939,T,IEX,236.055000,1
2019-10-15 14:39:43.734061056,2019-10-15 14:39:43.734044207,3740545,T,IEX,235.990000,1
2019-10-15 14:40:09.450682112,2019-10-15 14:40:09.450661502,3771193,T,IEX,236.050000,1
2019-10-15 14:40:12.549614080,2019-10-15 14:40:12.549596260,3775099,T,IEX,236.050000,1
2019-10-15 14:40:59.859088896,2019-10-15 14:40:59.859072071,3832322,T,IEX,236.160000,1
2019-10-15 14:41:00.289881088,2019-10-15 14:41:00.289863557,3832700,T,IEX,236.160000,2
2019-10-15 14:41:00.914830080,2019-10-15 14:41:00.914812556,3833313,T,IEX,236.160000,1
2019-10-15 14:41:15.119303936,2019-10-15 14:41:15.119286370,3853545,T,IEX,236.210000,100
2019-10-15 14:41:39.747450880,2019-10-15 14:41:39.747430748,3893241,T,IEX,236.040000,1
2019-10-15 14:41:39.868788992,2019-10-15 14:41:39.868771698,3893370,T,IEX,236.040000,5
2019-10-15 14:42:28.303316992,2019-10-15 14:42:28.303296818,3945773,T,IEX,235.985000,1
2019-10-15 14:42:34.205051904,2019-10-15 14:42:34.205034220,3952862,T,IEX,235.940000,1
2019-10-15 14:42:53.539916032,2019-10-15 14:42:53.539898845,3974690,T,IEX,235.900000,1
2019-10-15 14:43:00.70137088,2019-10-15 14:43:00.70115719,3981370,T,IEX,235.940000,1
2019-10-15 14:43:03.740505088,2019-10-15 14:43:03.740488950,3985234,T,IEX,236.000000,1
2019-10-15 14:43:22.988740096,2019-10-15 14:43:22.988717030,4000793,T,IEX,235.980000,100
2019-10-15 14:43:55.737220096,2019-10-15 14:43:55.737200979,4030594,T,IEX,235.945000,1
2019-10-15 14:44:03.661387008,2019-10-15 14:44:03.661367608,4039658,T,IEX,235.945000,1
2019-10-15 14:44:06.280756992,2019-10-15 14:44:06.280736886,4042621,T,IEX,235.950000,2
2019-10-15 14:44:08.978425088,2019-10-15 14:44:08.978403861,4047005,T,IEX,236.010000,100
2019-10-15 14:44:24.724317952,2019-10-15 14:44:24.724296676,4061132,T,IEX,236.020000,1
2019-10-15 14:44:24.733190912,2019-10-15 14:44:24.733174600,4061150,T,IEX,236.005000,1
2019-10-15 14:44:45.918365952,2019-10-15 14:44:45.918349618,4089258,T,IEX,236.020000,1
2019-10-15 14:44:45.926201088,2019-10-15 14:44:45.926183676,4089265,T,IEX,236.005000,1
2019-10-15 14:44:46.172282112,2019-10-15 14:44:46.172265899,4090196,T,IEX,236.010000,2
2019-10-15 14:44:56.764649984,2019-10-15 14:44:56.764629814,4102659,T,IEX,236.025000,100
2019-10-15 14:45:16.595287040,2019-10-15 14:45:16.595270639,4123014,T,IEX,236.040000,1
2019-10-15 14:46:22.909669888,2019-10-15 14:46:22.909650683,4184682,T,IEX,236.200000,1
2019-10-15 14:46:22.909693952,2019-10-15 14:46:22.909676706,4184683,T,IEX,236.200000,7
2019-10-15 14:46:26.510895104,2019-10-15 14:46:26.510873588,4187697,T,IEX,236.205000,50
2019-10-15 14:46:55.22240000,2019-10-15 14:46:55.22221907,4212643,T,IEX,236.145000,5
2019-10-15 14:46:55.101942016,2019-10-15 14:46:55.101922325,4212678,T,IEX,236.145000,10
2019-10-15 14:47:02.717794048,2019-10-15 14:47:02.717774133,4218884,T,IEX,236.145000,100
2019-10-15 14:47:06.321239040,2019-10-15 14:47:06.321221876,4221586,T,IEX,236.140000,2
2019-10-15 14:47:26.524729088,2019-10-15 14:47:26.524708983,4236238,T,IEX,236.205000,100
2019-10-15 14:47:26.526941952,2019-10-15 14:47:26.526923639,4236239,T,IEX,236.205000,100
2019-10-15 14:47:55.337361920,2019-10-15 14:47:55.337340351,4259343,T,IEX,236.255000,1
2019-10-15 14:47:57.311403008,2019-10-15 14:47:57.311382463,4260820,T,IEX,236.290000,7
2019-10-15 14:47:59.965053952,2019-10-15 14:47:59.965034251,4262373,T,IEX,236.255000,1
2019-10-15 14:48:14.537086976,2019-10-15 14:48:14.537069164,4273617,T,IEX,236.270000,1
2019-10-15 14:48:23.842693120,2019-10-15 14:48:23.842674968,4280462,T,IEX,236.270000,200
2019-10-15 14:49:04.494002944,2019-10-15 14:49:04.493984049,4314851,T,IEX,236.160000,100
2019-10-15 14:49:33.689537024,2019-10-15 14:49:33.689519105,4338605,T,IEX,236.150000,1
2019-10-15 14:49:40.260024064,2019-10-15 14:49:40.260003666,4342142,T,IEX,236.145000,3
2019-10-15 14:49:43.285323008,2019-10-15 14:49:43.285304039,4344385,T,IEX,236.115000,1
2019-10-15 14:50:04.135060992,2019-10-15 14:50:04.135040240,4358651,T,IEX,236.050000,1
2019-10-15 14:50:19.451002880,2019-10-15 14:50:19.450981853,4368455,T,IEX,236.100000,1
2019-10-15 14:50:52.318027008,2019-10-15 14:50:52.318007778,4395453,T,IEX,236.140000,1
2019-10-15 14:50:52.329863936,2019-10-15 14:50:52.329844514,4395457,T,IEX,236.160000,10
2019-10-15 14:50:54.777369088,2019-10-15 14:50:54.777346498,4396696,T,IEX,236.155000,2
2019-10-15 14:51:07.179407104,2019-10-15 14:51:07.179386125,4407084,T,IEX,236.210000,1
2019-10-15 14:52:40.181712896,2019-10-15 14:52:40.181692698,4488011,T,IEX,236.350000,26
2019-10-15 14:53:11.317021952,2019-10-15 14:53:11.317004714,4512804,T,IEX,236.280000,2
2019-10-15 14:54:27.288708096,2019-10-15 14:54:27.288684055,4570162,T,IEX,236.420000,6
2019-10-15 14:55:46.758024960,2019-10-15 14:55:46.758006095,4641767,T,IEX,236.380000,1
2019-10-15 14:57:02.686823936,2019-10-15 14:57:02.686804377,4707200,T,IEX,236.415000,1
2019-10-15 14:57:07.79629056,2019-10-15 14:57:07.79607937,4710472,T,IEX,236.430000,10
2019-10-15 14:57:14.963936000,2019-10-15 14:57:14.963915888,4715962,T,IEX,236.465000,200
2019-10-15 14:57:39.737405952,2019-10-15 14:57:39.737384525,4734393,T,IEX,236.485000,300
2019-10-15 14:59:51.84247040,2019-10-15 14:59:51.84230403,4848671,T,IEX,236.670000,7
2019-10-15 14:59:53.601799936,2019-10-15 14:59:53.601782579,4850023,T,IEX,236.800000,60
2019-10-15 15:00:07.825652992,2019-10-15 15:00:07.825631644,4867931,T,IEX,236.760000,100
2019-10-15 15:01:54.917860096,2019-10-15 15:01:54.917839516,4971946,T,IEX,236.760000,3
2019-10-15 15:02:15.119111936,2019-10-15 15:02:15.119094538,4990471,T,IEX,236.730000,6
2019-10-15 15:02:55.4716032,2019-10-15 15:02:55.4692821,5035703,T,IEX,236.770000,2
2019-10-15 15:04:19.183686912,2019-10-15 15:04:19.183666034,5112279,T,IEX,236.675000,1
2019-10-15 15:05:38.161443072,2019-10-15 15:05:38.161426757,5187616,T,IEX,236.490000,100
2019-10-15 15:05:46.49762048,2019-10-15 15:05:46.49743853,5192925,T,IEX,236.470000,4
2019-10-15 15:06:50.802952960,2019-10-15 15:06:50.802933624,5245151,T,IEX,236.610000,29
2019-10-15 15:07:45.186740992,2019-10-15 15:07:45.186720032,5290210,T,IEX,236.490000,100
2019-10-15 15:08:59.800340992,2019-10-15 15:08:59.800325171,5341944,T,IEX,236.350000,33
2019-10-15 15:08:59.801310976,2019-10-15 15:08:59.801292336,5341945,T,IEX,236.350000,41
2019-10-15 15:08:59.898056960,2019-10-15 15:08:59.898041013,5342025,T,IEX,236.340000,42
2019-10-15 15:08:59.898080000,2019-10-15 15:08:59.898062220,5342026,T,IEX,236.330000,200
2019-10-15 15:09:00.248954112,2019-10-15 15:09:00.248933800,5342545,T,IEX,236.310000,50
2019-10-15 15:09:02.3218944,2019-10-15 15:09:02.3200008,5344050,T,IEX,236.240000,3
2019-10-15 15:09:03.846236928,2019-10-15 15:09:03.846220676,5346531,T,IEX,236.310000,100
2019-10-15 15:09:03.908948992,2019-10-15 15:09:03.908930549,5346981,T,IEX,236.310000,100
2019-10-15 15:09:04.589254912,2019-10-15 15:09:04.589237906,5347848,T,IEX,236.310000,100
2019-10-15 15:09:04.590248960,2019-10-15 15:09:04.590229055,5347849,T,IEX,236.310000,160
2019-10-15 15:09:08.566742016,2019-10-15 15:09:08.566723524,5350323,T,IEX,236.310000,21
2019-10-15 15:09:09.996483072,2019-10-15 15:09:09.996468062,5351172,T,IEX,236.310000,100
2019-10-15 15:09:10.42331904,2019-10-15 15:09:10.42315995,5351208,T,IEX,236.310000,100
2019-10-15 15:09:11.518437120,2019-10-15 15:09:11.518417632,5351939,T,IEX,236.310000,100
2019-10-15 15:09:11.519401984,2019-10-15 15:09:11.519382133,5351940,T,IEX,236.310000,184
2019-10-15 15:09:12.608409088,2019-10-15 15:09:12.608388780,5353116,T,IEX,236.310000,100
2019-10-15 15:09:13.71550976,2019-10-15 15:09:13.71529208,5353590,T,IEX,236.310000,100
2019-10-15 15:09:13.72521984,2019-10-15 15:09:13.72502331,5353591,T,IEX,236.310000,400
2019-10-15 15:09:14.911732992,2019-10-15 15:09:14.911709506,5354698,T,IEX,236.310000,100
2019-10-15 15:09:14.912696064,2019-10-15 15:09:14.912679074,5354700,T,IEX,236.310000,218
2019-10-15 15:09:17.487734016,2019-10-15 15:09:17.487712857,5355726,T,IEX,236.310000,100
2019-10-15 15:09:17.488686080,2019-10-15 15:09:17.488669355,5355727,T,IEX,236.310000,175
2019-10-15 15:09:20.244690944,2019-10-15 15:09:20.244674938,5357181,T,IEX,236.220000,100
2019-10-15 15:09:20.302955008,2019-10-15 15:09:20.302932974,5357293,T,IEX,236.200000,100
2019-10-15 15:09:28.947204096,2019-10-15 15:09:28.947188198,5363123,T,IEX,236.090000,42
2019-10-15 15:09:40.670479104,2019-10-15 15:09:40.670458200,5374001,T,IEX,235.900000,100
2019-10-15 15:09:53.571311104,2019-10-15 15:09:53.571292789,5382156,T,IEX,235.970000,23
2019-10-15 15:09:53.573740032,2019-10-15 15:09:53.573714826,5382275,T,IEX,235.970000,38
2019-10-15 15:11:01.27094016,2019-10-15 15:11:01.27075915,5434772,T,IEX,235.950000,1
2019-10-15 15:11:13.184267008,2019-10-15 15:11:13.184250889,5445311,T,IEX,235.975000,25
2019-10-15 15:11:38.964406016,2019-10-15 15:11:38.964381169,5464753,T,IEX,235.950000,20
2019-10-15 15:12:13.235041024,2019-10-15 15:12:13.234999674,5487706,T,IEX,235.950000,29
2019-10-15 15:14:15.255665920,2019-10-15 15:14:15.255648272,5578433,T,IEX,235.880000,600
2019-10-15 15:14:15.720551936,2019-10-15 15:14:15.720534410,5578741,T,IEX,235.815000,200
2019-10-15 15:14:32.158161920,2019-10-15 15:14:32.158142089,5596826,T,IEX,235.725000,100
2019-10-15 15:15:06.400123904,2019-10-15 15:15:06.400105110,5628354,T,IEX,235.755000,100
2019-10-15 15:16:50.25402112,2019-10-15 15:16:50.25381460,5705276,T,IEX,235.620000,20
2019-10-15 15:16:52.165374976,2019-10-15 15:16:52.165356359,5706364,T,IEX,235.635000,80
2019-10-15 15:16:52.165387008,2019-10-15 15:16:52.165368988,5706365,T,IEX,235.635000,20
2019-10-15 15:17:55.96168960,2019-10-15 15:17:55.96150917,5756542,T,IEX,235.535000,2
2019-10-15 15:18:00.967137024,2019-10-15 15:18:00.967117505,5760400,T,IEX,235.510000,1
2019-10-15 15:18:58.878022912,2019-10-15 15:18:58.878001731,5803892,T,IEX,235.630000,1
2019-10-15 15:19:08.295034112,2019-10-15 15:19:08.295017158,5812839,T,IEX,235.715000,2
2019-10-15 15:19:08.295053056,2019-10-15 15:19:08.295036900,5812840,T,IEX,235.715000,32
2019-10-15 15:20:20.235495936,2019-10-15 15:20:20.235480162,5864539,T,IEX,235.550000,3
2019-10-15 15:20:35.116495872,2019-10-15 15:20:35.116478833,5874437,T,IEX,235.500000,100
2019-10-15 15:20:37.437754112,2019-10-15 15:20:37.437732514,5876004,T,IEX,235.590000,100
2019-10-15 15:20:39.174671104,2019-10-15 15:20:39.174651817,5878141,T,IEX,235.590000,1
2019-10-15 15:20:39.174689024,2019-10-15 15:20:39.174671924,5878142,T,IEX,235.590000,4
2019-10-15 15:21:19.991849984,2019-10-15 15:21:19.991831269,5931617,T,IEX,235.450000,100
2019-10-15 15:22:06.474882048,2019-10-15 15:22:06.474860761,5987624,T,IEX,235.420000,2
2019-10-15 15:22:23.624933888,2019-10-15 15:22:23.624910912,6006112,T,IEX,235.475000,1
2019-10-15 15:22:30.179708928,2019-10-15 15:22:30.179688323,6012482,T,IEX,235.480000,100
2019-10-15 15:22:55.70618112,2019-10-15 15:22:55.70602192,6032419,T,IEX,235.505000,2
2019-10-15 15:24:03.184641024,2019-10-15 15:24:03.184620920,6081887,T,IEX,235.660000,49
2019-10-15 15:25:15.202235904,2019-10-15 15:25:15.202218055,6133171,T,IEX,235.695000,1
2019-10-15 15:25:15.202255872,2019-10-15 15:25:15.202238573,6133172,T,IEX,235.695000,1
2019-10-15 15:25:15.202270976,2019-10-15 15:25:15.202254044,6133173,T,IEX,235.695000,2
2019-10-15 15:26:08.639042048,2019-10-15 15:26:08.639019610,6171707,T,IEX,235.825000,1
2019-10-15 15:26:37.188715008,2019-10-15 15:26:37.188695928,6189064,T,IEX,235.695000,55
2019-10-15 15:27:47.377412096,2019-10-15 15:27:47.377396386,6232161,T,IEX,235.630000,1
2019-10-15 15:29:28.204815872,2019-10-15 15:29:28.204793057,6293952,T,IEX,235.610000,2
2019-10-15 15:29:55.254601984,2019-10-15 15:29:55.254583484,6311786,T,IEX,235.725000,1
2019-10-15 15:30:24.358664960,2019-10-15 15:30:24.358646347,6342896,T,IEX,235.950000,100
2019-10-15 15:30:28.208304128,2019-10-15 15:30:28.208284151,6345775,T,IEX,235.885000,15
2019-10-15 15:31:47.876329984,2019-10-15 15:31:47.876311439,6394014,T,IEX,235.780000,1
2019-10-15 15:32:54.195286016,2019-10-15 15:32:54.195267938,6428362,T,IEX,235.790000,74
2019-10-15 15:32:54.195336960,2019-10-15 15:32:54.195320191,6428365,T,IEX,235.790000,26
2019-10-15 15:34:20.478728960,2019-10-15 15:34:20.478708421,6471969,T,IEX,235.730000,37
2019-10-15 15:35:17.670149120,2019-10-15 15:35:17.670131532,6515463,T,IEX,235.700000,20
2019-10-15 15:35:21.352126976,2019-10-15 15:35:21.352098219,6522634,T,IEX,235.715000,29
2019-10-15 15:35:21.352168960,2019-10-15 15:35:21.352145133,6522639,T,IEX,235.715000,51
2019-10-15 15:35:21.352183040,2019-10-15 15:35:21.352156134,6522641,T,IEX,235.750000,1
2019-10-15 15:35:21.352485888,2019-10-15 15:35:21.352468124,6522653,T,IEX,235.720000,100
2019-10-15 15:35:21.445913088,2019-10-15 15:35:21.445894354,6523039,T,IEX,235.750000,25
2019-10-15 15:35:21.493837056,2019-10-15 15:35:21.493817266,6523093,T,IEX,235.750000,52
2019-10-15 15:35:21.499554048,2019-10-15 15:35:21.499531292,6523097,T,IEX,235.750000,42
2019-10-15 15:39:49.162967040,2019-10-15 15:39:49.162950053,6713023,T,IEX,235.590000,2
2019-10-15 15:40:18.225391104,2019-10-15 15:40:18.225373918,6731493,T,IEX,235.625000,1
2019-10-15 15:43:51.863827968,2019-10-15 15:43:51.863801728,6832920,T,IEX,235.680000,29
2019-10-15 15:47:18.136552960,2019-10-15 15:47:18.136533505,6938145,T,IEX,235.785000,2
2019-10-15 15:48:54.789803008,2019-10-15 15:48:54.789780404,6979669,T,IEX,235.890000,100
2019-10-15 15:48:54.791165952,2019-10-15 15:48:54.791142638,6979726,T,IEX,235.870000,200
2019-10-15 15:48:54.792527104,2019-10-15 15:48:54.792505827,6979788,T,IEX,235.890000,37
2019-10-15 15:48:54.792722944,2019-10-15 15:48:54.792696199,6979799,T,IEX,235.890000,63
2019-10-15 15:52:10.279144960,2019-10-15 15:52:10.279126618,7076323,T,IEX,236.100000,16
2019-10-15 15:52:25.78172928,2019-10-15 15:52:25.78155102,7082449,T,IEX,236.100000,8
2019-10-15 15:52:25.414189056,2019-10-15 15:52:25.414173355,7082530,T,IEX,236.100000,2
2019-10-15 15:54:19.615418112,2019-10-15 15:54:19.615395934,7133789,T,IEX,236.050000,50
2019-10-15 15:54:35.961320960,2019-10-15 15:54:35.961303503,7139865,T,IEX,236.070000,100
2019-10-15 15:55:06.115749120,2019-10-15 15:55:06.115726666,7155196,T,IEX,235.985000,100
2019-10-15 15:56:01.134298880,2019-10-15 15:56:01.134280581,7182561,T,IEX,235.945000,100
2019-10-15 15:57:31.96058880,2019-10-15 15:57:31.96039235,7230744,T,IEX,235.945000,1
2019-10-15 15:57:52.269414912,2019-10-15 15:57:52.269395876,7238565,T,IEX,235.940000,1
2019-10-15 15:58:04.795813120,2019-10-15 15:58:04.795795112,7244389,T,IEX,235.900000,1
2019-10-15 15:58:39.193388032,2019-10-15 15:58:39.193371834,7257889,T,IEX,235.965000,1
2019-10-15 15:58:51.474505984,2019-10-15 15:58:51.474489252,7262679,T,IEX,235.965000,100
2019-10-15 15:59:46.115975936,2019-10-15 15:59:46.115956420,7285989,T,IEX,235.930000,2
2019-10-15 15:59:46.774299904,2019-10-15 15:59:46.774279831,7286364,T,IEX,235.935000,4
2019-10-15 15:59:50.787673088,2019-10-15 15:59:50.787649521,7287973,T,IEX,235.935000,1
2019-10-15 15:59:53.731803904,2019-10-15 15:59:53.731781941,7288954,T,IEX,235.975000,100
2019-10-15 16:00:40.241212928,2019-10-15 16:00:40.241191743,7314222,T,IEX,236.050000,1
2019-10-15 16:00:46.545413888,2019-10-15 16:00:46.545392583,7316502,T,IEX,236.055000,6
2019-10-15 16:00:52.871072000,2019-10-15 16:00:52.871050704,7319323,T,IEX,236.060000,1
2019-10-15 16:01:07.16281088,2019-10-15 16:01:07.16260605,7326495,T,IEX,236.035000,200
2019-10-15 16:01:18.821934080,2019-10-15 16:01:18.821916087,7331319,T,IEX,236.045000,1
2019-10-15 16:02:01.863845120,2019-10-15 16:02:01.863825462,7349848,T,IEX,236.010000,2
2019-10-15 16:02:11.971251968,2019-10-15 16:02:11.971230072,7356716,T,IEX,236.015000,1
2019-10-15 16:02:24.615335936,2019-10-15 16:02:24.615313801,7362462,T,IEX,236.040000,100
2019-10-15 16:02:30.680993024,2019-10-15 16:02:30.680970765,7365627,T,IEX,236.035000,2
2019-10-15 16:03:09.27828992,2019-10-15 16:03:09.27808756,7383774,T,IEX,236.045000,200
2019-10-15 16:03:46.907901952,2019-10-15 16:03:46.907884695,7399352,T,IEX,236.000000,1
2019-10-15 16:03:57.448807936,2019-10-15 16:03:57.448788140,7403695,T,IEX,236.000000,2
2019-10-15 16:04:14.604237056,2019-10-15 16:04:14.604217691,7411642,T,IEX,236.010000,100
2019-10-15 16:05:03.544390912,2019-10-15 16:05:03.544370544,7432645,T,IEX,235.950000,1
2019-10-15 16:05:03.553172992,2019-10-15 16:05:03.553152744,7432648,T,IEX,235.950000,1
2019-10-15 16:05:10.662074112,2019-10-15 16:05:10.662053898,7435786,T,IEX,235.950000,1
2019-10-15 16:06:04.98863104,2019-10-15 16:06:04.98842803,7454221,T,IEX,236.080000,1
2019-10-15 16:06:05.11975936,2019-10-15 16:06:05.11956912,7454425,T,IEX,236.120000,100
2019-10-15 16:06:05.323245056,2019-10-15 16:06:05.323227147,7454491,T,IEX,236.120000,1
2019-10-15 16:06:10.312210944,2019-10-15 16:06:10.312193593,7457058,T,IEX,236.150000,100
2019-10-15 16:06:40.316602880,2019-10-15 16:06:40.316583113,7466881,T,IEX,236.130000,100
2019-10-15 16:06:53.973419008,2019-10-15 16:06:53.973394971,7471427,T,IEX,236.135000,100
2019-10-15 16:07:36.81708032,2019-10-15 16:07:36.81686127,7485399,T,IEX,236.125000,1
2019-10-15 16:07:40.320786944,2019-10-15 16:07:40.320766680,7486691,T,IEX,236.125000,1
2019-10-15 16:07:40.323273984,2019-10-15 16:07:40.323255922,7486692,T,IEX,236.125000,100
2019-10-15 16:08:13.900570880,2019-10-15 16:08:13.900547174,7500126,T,IEX,236.130000,5
2019-10-15 16:09:10.561691904,2019-10-15 16:09:10.561670910,7526298,T,IEX,236.070000,100
2019-10-15 16:10:10.303992064,2019-10-15 16:10:10.303970262,7549727,T,IEX,236.040000,100
2019-10-15 16:10:30.144153088,2019-10-15 16:10:30.144131007,7558238,T,IEX,236.060000,1
2019-10-15 16:10:44.390818048,2019-10-15 16:10:44.390798910,7565252,T,IEX,236.070000,4
2019-10-15 16:11:28.408060928,2019-10-15 16:11:28.408041584,7583404,T,IEX,236.055000,1
2019-10-15 16:11:32.326576128,2019-10-15 16:11:32.326555857,7585261,T,IEX,236.055000,100
2019-10-15 16:12:01.915514880,2019-10-15 16:12:01.915497937,7596782,T,IEX,236.020000,1
2019-10-15 16:12:06.90766080,2019-10-15 16:12:06.90746786,7598396,T,IEX,236.020000,1
2019-10-15 16:12:24.733001984,2019-10-15 16:12:24.732983670,7604503,T,IEX,235.980000,100
2019-10-15 16:13:07.636253952,2019-10-15 16:13:07.636234498,7622627,T,IEX,235.950000,100
2019-10-15 16:13:42.236817920,2019-10-15 16:13:42.236794269,7635546,T,IEX,235.880000,1
2019-10-15 16:13:42.236828928,2019-10-15 16:13:42.236810907,7635547,T,IEX,235.880000,25
2019-10-15 16:13:47.936372992,2019-10-15 16:13:47.936352131,7638664,T,IEX,235.920000,2
2019-10-15 16:13:57.335977984,2019-10-15 16:13:57.335957794,7641891,T,IEX,235.920000,100
2019-10-15 16:14:06.118973952,2019-10-15 16:14:06.118953143,7644645,T,IEX,235.920000,1
2019-10-15 16:14:31.478802944,2019-10-15 16:14:31.478782590,7652679,T,IEX,235.895000,1
2019-10-15 16:14:45.163328000,2019-10-15 16:14:45.163307847,7659316,T,IEX,235.925000,1
2019-10-15 16:14:47.752133888,2019-10-15 16:14:47.752115607,7660666,T,IEX,235.925000,1
2019-10-15 16:15:31.278432000,2019-10-15 16:15:31.278412722,7678679,T,IEX,235.915000,1
2019-10-15 16:15:31.280492032,2019-10-15 16:15:31.280470746,7678681,T,IEX,235.930000,5
2019-10-15 16:15:31.280730112,2019-10-15 16:15:31.280713117,7678683,T,IEX,235.930000,6
2019-10-15 16:15:31.280770048,2019-10-15 16:15:31.280752168,7678684,T,IEX,235.930000,75
2019-10-15 16:15:31.280804096,2019-10-15 16:15:31.280788006,7678685,T,IEX,235.930000,14
2019-10-15 16:15:42.920443904,2019-10-15 16:15:42.920423933,7682629,T,IEX,235.945000,100
2019-10-15 16:15:42.944286976,2019-10-15 16:15:42.944267315,7682634,T,IEX,235.945000,100
2019-10-15 16:15:54.912976896,2019-10-15 16:15:54.912958933,7688198,T,IEX,235.950000,100
2019-10-15 16:15:55.19636992,2019-10-15 16:15:55.19616118,7688260,T,IEX,235.950000,1
2019-10-15 16:15:55.351346944,2019-10-15 16:15:55.351326512,7688413,T,IEX,235.930000,2
2019-10-15 16:15:55.504108032,2019-10-15 16:15:55.504089831,7688469,T,IEX,235.935000,1
2019-10-15 16:16:12.66050048,2019-10-15 16:16:12.66032839,7695413,T,IEX,235.905000,100
2019-10-15 16:16:54.476898048,2019-10-15 16:16:54.476879621,7718236,T,IEX,235.810000,1
2019-10-15 16:16:54.493519104,2019-10-15 16:16:54.493497964,7718248,T,IEX,235.820000,4
2019-10-15 16:16:55.354691072,2019-10-15 16:16:55.354670632,7718666,T,IEX,235.860000,1
2019-10-15 16:17:13.542673920,2019-10-15 16:17:13.542658071,7727004,T,IEX,235.870000,100
2019-10-15 16:17:28.150195968,2019-10-15 16:17:28.150178510,7731919,T,IEX,235.870000,1
2019-10-15 16:17:43.73902080,2019-10-15 16:17:43.73879921,7738349,T,IEX,235.855000,100
2019-10-15 16:17:55.3909888,2019-10-15 16:17:55.3890520,7743451,T,IEX,235.810000,3
2019-10-15 16:18:06.170105088,2019-10-15 16:18:06.170084557,7748615,T,IEX,235.785000,3
2019-10-15 16:18:51.136857088,2019-10-15 16:18:51.136837511,7773164,T,IEX,235.760000,100
2019-10-15 16:18:55.139542016,2019-10-15 16:18:55.139523272,7774462,T,IEX,235.740000,1
2019-10-15 16:19:06.251857920,2019-10-15 16:19:06.251837804,7778743,T,IEX,235.715000,2
2019-10-15 16:19:20.78257920,2019-10-15 16:19:20.78236117,7784059,T,IEX,235.755000,100
2019-10-15 16:19:55.4404992,2019-10-15 16:19:55.4384690,7796780,T,IEX,235.740000,1
2019-10-15 16:20:46.331821056,2019-10-15 16:20:46.331801559,7818718,T,IEX,235.720000,1
2019-10-15 16:21:01.86648064,2019-10-15 16:21:01.86631327,7824888,T,IEX,235.750000,1
2019-10-15 16:21:09.725684992,2019-10-15 16:21:09.725664779,7830985,T,IEX,235.750000,100
2019-10-15 16:21:09.725846016,2019-10-15 16:21:09.725827462,7830991,T,IEX,235.750000,1
2019-10-15 16:21:32.112752128,2019-10-15 16:21:32.112729088,7844239,T,IEX,235.690000,2
2019-10-15 16:21:32.127341056,2019-10-15 16:21:32.127319706,7844240,T,IEX,235.710000,2
2019-10-15 16:21:32.138817024,2019-10-15 16:21:32.138796051,7844245,T,IEX,235.740000,1
2019-10-15 16:21:32.145201920,2019-10-15 16:21:32.145181371,7844248,T,IEX,235.750000,250
2019-10-15 16:21:33.942734080,2019-10-15 16:21:33.942710780,7844962,T,IEX,235.745000,1
2019-10-15 16:21:50.109543936,2019-10-15 16:21:50.109523904,7851993,T,IEX,235.740000,1
2019-10-15 16:22:08.741373952,2019-10-15 16:22:08.741352147,7860779,T,IEX,235.750000,1
2019-10-15 16:22:40.32375040,2019-10-15 16:22:40.32355433,7876573,T,IEX,235.720000,1
2019-10-15 16:23:13.311374080,2019-10-15 16:23:13.311352904,7888492,T,IEX,235.705000,1
2019-10-15 16:23:27.138160128,2019-10-15 16:23:27.138141593,7893003,T,IEX,235.730000,1
2019-10-15 16:25:02.820359936,2019-10-15 16:25:02.820337782,7931619,T,IEX,235.645000,1
2019-10-15 16:25:02.820370944,2019-10-15 16:25:02.820354944,7931620,T,IEX,235.645000,25
2019-10-15 16:25:02.836009984,2019-10-15 16:25:02.835988570,7931623,T,IEX,235.670000,3
2019-10-15 16:25:31.578771968,2019-10-15 16:25:31.578750415,7945432,T,IEX,235.625000,1
2019-10-15 16:26:24.930436096,2019-10-15 16:26:24.930416237,7966912,T,IEX,235.565000,1
2019-10-15 16:26:32.995343872,2019-10-15 16:26:32.995323976,7969703,T,IEX,235.565000,1
2019-10-15 16:27:17.31864064,2019-10-15 16:27:17.31845017,7990987,T,IEX,235.550000,2
2019-10-15 16:27:31.975728896,2019-10-15 16:27:31.975709944,7999753,T,IEX,235.570000,1
2019-10-15 16:28:21.34540032,2019-10-15 16:28:21.34523690,8021120,T,IEX,235.600000,1
2019-10-15 16:28:34.509841920,2019-10-15 16:28:34.509823611,8026729,T,IEX,235.610000,54
2019-10-15 16:28:43.431077120,2019-10-15 16:28:43.431056964,8032725,T,IEX,235.550000,1
2019-10-15 16:28:55.551704064,2019-10-15 16:28:55.551678316,8037696,T,IEX,235.530000,25
2019-10-15 16:29:08.294889984,2019-10-15 16:29:08.294868888,8047434,T,IEX,235.500000,1
2019-10-15 16:29:20.134797056,2019-10-15 16:29:20.134774754,8052467,T,IEX,235.510000,1
2019-10-15 16:30:11.248058880,2019-10-15 16:30:11.248038842,8076872,T,IEX,235.500000,1
2019-10-15 16:30:13.896994048,2019-10-15 16:30:13.896975926,8079494,T,IEX,235.520000,3
2019-10-15 16:30:54.987184896,2019-10-15 16:30:54.987164885,8096652,T,IEX,235.480000,2
2019-10-15 16:31:12.581314048,2019-10-15 16:31:12.581293382,8103432,T,IEX,235.460000,4
2019-10-15 16:31:36.657248000,2019-10-15 16:31:36.657228633,8112025,T,IEX,235.480000,1
2019-10-15 16:32:25.679185920,2019-10-15 16:32:25.679165076,8132905,T,IEX,235.490000,2
2019-10-15 16:32:34.724839936,2019-10-15 16:32:34.724818116,8137553,T,IEX,235.490000,75
2019-10-15 16:32:36.63825920,2019-10-15 16:32:36.63805660,8138094,T,IEX,235.500000,1
2019-10-15 16:32:39.914260992,2019-10-15 16:32:39.914244394,8139528,T,IEX,235.480000,67
2019-10-15 16:32:39.914897920,2019-10-15 16:32:39.914880544,8139546,T,IEX,235.480000,33
2019-10-15 16:32:59.632283904,2019-10-15 16:32:59.632264393,8148459,T,IEX,235.470000,7
2019-10-15 16:33:33.328532992,2019-10-15 16:33:33.328515082,8159943,T,IEX,235.470000,100
2019-10-15 16:34:01.918298112,2019-10-15 16:34:01.918276395,8171249,T,IEX,235.480000,100
2019-10-15 16:34:11.521310976,2019-10-15 16:34:11.521290019,8173698,T,IEX,235.500000,1
2019-10-15 16:35:30.27618048,2019-10-15 16:35:30.27596941,8200353,T,IEX,235.400000,4
2019-10-15 16:35:43.1106944,2019-10-15 16:35:43.1088341,8203821,T,IEX,235.420000,7
2019-10-15 16:36:09.2333952,2019-10-15 16:36:09.2313978,8211413,T,IEX,235.400000,1
2019-10-15 16:36:21.844594944,2019-10-15 16:36:21.844576530,8216622,T,IEX,235.380000,1
2019-10-15 16:36:21.852214016,2019-10-15 16:36:21.852196694,8216782,T,IEX,235.410000,10
2019-10-15 16:36:41.282264064,2019-10-15 16:36:41.282246049,8223298,T,IEX,235.415000,1
2019-10-15 16:36:49.831812096,2019-10-15 16:36:49.831792761,8225419,T,IEX,235.445000,1
2019-10-15 16:36:51.988912896,2019-10-15 16:36:51.988893121,8226001,T,IEX,235.445000,1
2019-10-15 16:40:26.613432064,2019-10-15 16:40:26.613412116,8296229,T,IEX,235.520000,55
2019-10-15 16:40:47.469545984,2019-10-15 16:40:47.469518227,8300987,T,IEX,235.515000,100
2019-10-15 16:40:47.470415104,2019-10-15 16:40:47.470395300,8301018,T,IEX,235.530000,75
2019-10-15 16:40:47.470991872,2019-10-15 16:40:47.470867355,8301028,T,IEX,235.530000,25
2019-10-15 16:40:47.471693056,2019-10-15 16:40:47.471674127,8301066,T,IEX,235.525000,100
2019-10-15 16:40:47.473147904,2019-10-15 16:40:47.473130521,8301115,T,IEX,235.515000,100
2019-10-15 16:40:50.688441088,2019-10-15 16:40:50.688420964,8303130,T,IEX,235.515000,1
2019-10-15 16:41:24.17106944,2019-10-15 16:41:24.17088381,8320503,T,IEX,235.440000,100
2019-10-15 16:41:47.159150080,2019-10-15 16:41:47.159129036,8328600,T,IEX,235.440000,1
2019-10-15 16:41:59.158575104,2019-10-15 16:41:59.158553351,8332440,T,IEX,235.440000,1
2019-10-15 16:42:21.36439040,2019-10-15 16:42:21.36417479,8337503,T,IEX,235.460000,1
2019-10-15 16:42:21.36463104,2019-10-15 16:42:21.36445435,8337504,T,IEX,235.460000,1
2019-10-15 16:46:03.698116096,2019-10-15 16:46:03.698095697,8415684,T,IEX,235.475000,1
2019-10-15 16:47:04.360087040,2019-10-15 16:47:04.360069270,8433045,T,IEX,235.375000,2
2019-10-15 16:47:14.605878016,2019-10-15 16:47:14.605855108,8436412,T,IEX,235.390000,100
2019-10-15 16:47:48.393398016,2019-10-15 16:47:48.393377244,8451040,T,IEX,235.430000,4
2019-10-15 16:47:48.810980096,2019-10-15 16:47:48.810956679,8451116,T,IEX,235.430000,100
2019-10-15 16:47:52.375023104,2019-10-15 16:47:52.375001510,8452081,T,IEX,235.510000,2
2019-10-15 16:47:52.386405888,2019-10-15 16:47:52.386388326,8452090,T,IEX,235.540000,37
2019-10-15 16:48:03.168016896,2019-10-15 16:48:03.167996300,8455129,T,IEX,235.420000,100
2019-10-15 16:48:03.185121024,2019-10-15 16:48:03.185100808,8455141,T,IEX,235.390000,1
2019-10-15 16:48:05.749001984,2019-10-15 16:48:05.748982184,8455828,T,IEX,235.340000,1
2019-10-15 16:48:05.749026048,2019-10-15 16:48:05.749008680,8455829,T,IEX,235.340000,100
2019-10-15 16:48:05.752986880,2019-10-15 16:48:05.752965905,8455830,T,IEX,235.330000,4
2019-10-15 16:48:05.752993024,2019-10-15 16:48:05.752975448,8455831,T,IEX,235.310000,100
2019-10-15 16:48:49.387870976,2019-10-15 16:48:49.387848893,8467343,T,IEX,235.200000,3
2019-10-15 16:48:53.439489024,2019-10-15 16:48:53.439467406,8468469,T,IEX,235.105000,200
2019-10-15 16:49:35.484305920,2019-10-15 16:49:35.484284637,8480312,T,IEX,235.355000,100
2019-10-15 16:49:35.484314880,2019-10-15 16:49:35.484297778,8480313,T,IEX,235.355000,2
2019-10-15 16:51:23.645238016,2019-10-15 16:51:23.645216980,8517266,T,IEX,235.460000,10
2019-10-15 16:52:14.339657984,2019-10-15 16:52:14.339640542,8532334,T,IEX,235.465000,10
2019-10-15 16:52:57.637423104,2019-10-15 16:52:57.637399719,8548477,T,IEX,235.500000,5
2019-10-15 16:58:27.303478016,2019-10-15 16:58:27.303456549,8675884,T,IEX,235.655000,10
2019-10-15 17:00:24.668837888,2019-10-15 17:00:24.668816467,8721728,T,IEX,235.735000,100
2019-10-15 17:00:36.129327104,2019-10-15 17:00:36.129306133,8726980,T,IEX,235.690000,70
2019-10-15 17:01:36.887155968,2019-10-15 17:01:36.887137088,8750249,T,IEX,235.590000,100
2019-10-15 17:01:57.68634880,2019-10-15 17:01:57.68614035,8757688,T,IEX,235.630000,1
2019-10-15 17:02:18.659854080,2019-10-15 17:02:18.659835416,8766396,T,IEX,235.590000,1
2019-10-15 17:02:25.564547072,2019-10-15 17:02:25.564527841,8769248,T,IEX,235.590000,99
2019-10-15 17:04:00.979051008,2019-10-15 17:04:00.979027522,8800772,T,IEX,235.415000,50
2019-10-15 17:05:06.268631040,2019-10-15 17:05:06.268609807,8819528,T,IEX,235.395000,1
2019-10-15 17:05:09.706995968,2019-10-15 17:05:09.706972354,8820791,T,IEX,235.360000,100
2019-10-15 17:05:55.235481088,2019-10-15 17:05:55.235460579,8837764,T,IEX,235.450000,2
2019-10-15 17:06:04.537955072,2019-10-15 17:06:04.537933972,8840215,T,IEX,235.520000,2
2019-10-15 17:09:11.34480896,2019-10-15 17:09:11.34452661,8902388,T,IEX,235.280000,100
2019-10-15 17:11:55.730016000,2019-10-15 17:11:55.729994448,8959775,T,IEX,235.500000,1
2019-10-15 17:12:34.102497024,2019-10-15 17:12:34.102477416,8970765,T,IEX,235.540000,1
2019-10-15 17:13:03.532570880,2019-10-15 17:13:03.532550876,8979598,T,IEX,235.530000,1
2019-10-15 17:13:27.310151936,2019-10-15 17:13:27.310134583,8986010,T,IEX,235.465000,1
2019-10-15 17:13:55.36954880,2019-10-15 17:13:55.36937088,8996365,T,IEX,235.465000,1
2019-10-15 17:14:50.799533056,2019-10-15 17:14:50.799515614,9015203,T,IEX,235.445000,1
2019-10-15 17:15:45.343659008,2019-10-15 17:15:45.343637640,9034397,T,IEX,235.385000,1
2019-10-15 17:15:52.480312064,2019-10-15 17:15:52.480293289,9036977,T,IEX,235.380000,1
2019-10-15 17:15:58.277068032,2019-10-15 17:15:58.277049972,9038730,T,IEX,235.395000,1
2019-10-15 17:16:11.799227904,2019-10-15 17:16:11.799209594,9043156,T,IEX,235.365000,1
2019-10-15 17:17:06.179589888,2019-10-15 17:17:06.179569303,9059050,T,IEX,235.400000,1
2019-10-15 17:17:55.153022976,2019-10-15 17:17:55.153001305,9072838,T,IEX,235.415000,1
2019-10-15 17:18:01.556080128,2019-10-15 17:18:01.556057497,9074883,T,IEX,235.420000,1
2019-10-15 17:18:24.892153088,2019-10-15 17:18:24.892133419,9081256,T,IEX,235.365000,1
2019-10-15 17:18:40.244038912,2019-10-15 17:18:40.244018445,9085867,T,IEX,235.350000,16
2019-10-15 17:18:57.969157888,2019-10-15 17:18:57.969140177,9090199,T,IEX,235.325000,1
2019-10-15 17:19:42.355343104,2019-10-15 17:19:42.355321359,9100552,T,IEX,235.275000,1
2019-10-15 17:19:48.751825920,2019-10-15 17:19:48.751806966,9102072,T,IEX,235.310000,1
2019-10-15 17:20:00.631139072,2019-10-15 17:20:00.631117175,9105801,T,IEX,235.310000,1
2019-10-15 17:20:18.229511936,2019-10-15 17:20:18.229493641,9111682,T,IEX,235.290000,1
2019-10-15 17:21:29.462128128,2019-10-15 17:21:29.462108379,9136758,T,IEX,235.190000,1
2019-10-15 17:21:50.351751936,2019-10-15 17:21:50.351731970,9144554,T,IEX,235.240000,1
2019-10-15 17:22:26.181568000,2019-10-15 17:22:26.181550303,9156181,T,IEX,235.235000,1
2019-10-15 17:22:42.85203968,2019-10-15 17:22:42.85184062,9160430,T,IEX,235.205000,1
2019-10-15 17:23:32.421953024,2019-10-15 17:23:32.421931326,9177785,T,IEX,235.185000,1
2019-10-15 17:23:55.47664896,2019-10-15 17:23:55.47643875,9183848,T,IEX,235.175000,1
2019-10-15 17:24:33.728201984,2019-10-15 17:24:33.728182258,9197366,T,IEX,235.100000,1
2019-10-15 17:24:58.993893888,2019-10-15 17:24:58.993871343,9215505,T,IEX,235.060000,1
2019-10-15 17:25:09.709577984,2019-10-15 17:25:09.709561034,9223442,T,IEX,235.095000,1
2019-10-15 17:25:17.514319872,2019-10-15 17:25:17.514303038,9227326,T,IEX,235.140000,1
2019-10-15 17:25:50.409088,2019-10-15 17:25:50.389359,9240049,T,IEX,235.085000,1
2019-10-15 17:25:53.200698112,2019-10-15 17:25:53.200676630,9241354,T,IEX,235.095000,5
2019-10-15 17:27:08.958951936,2019-10-15 17:27:08.958930330,9268646,T,IEX,235.150000,1
2019-10-15 17:27:08.967055872,2019-10-15 17:27:08.967035129,9268647,T,IEX,235.160000,10
2019-10-15 17:28:01.237349888,2019-10-15 17:28:01.237325917,9289542,T,IEX,235.100000,100
2019-10-15 17:28:02.861596928,2019-10-15 17:28:02.861579125,9290705,T,IEX,235.105000,1
2019-10-15 17:28:04.890341120,2019-10-15 17:28:04.890321267,9291460,T,IEX,235.105000,1
2019-10-15 17:29:45.937103104,2019-10-15 17:29:45.937080293,9327218,T,IEX,235.165000,1
2019-10-15 17:30:14.582510080,2019-10-15 17:30:14.582490908,9340442,T,IEX,235.180000,2
2019-10-15 17:30:19.451476992,2019-10-15 17:30:19.451457112,9341722,T,IEX,235.190000,1
2019-10-15 17:30:21.454054912,2019-10-15 17:30:21.454033699,9342325,T,IEX,235.190000,1
2019-10-15 17:30:50.477860096,2019-10-15 17:30:50.477842328,9352166,T,IEX,235.220000,1
2019-10-15 17:31:10.241253888,2019-10-15 17:31:10.241232601,9357936,T,IEX,235.195000,1
2019-10-15 17:31:34.67799040,2019-10-15 17:31:34.67779166,9363543,T,IEX,235.180000,7
2019-10-15 17:31:52.232709888,2019-10-15 17:31:52.232690278,9369077,T,IEX,235.205000,1
2019-10-15 17:31:57.424862976,2019-10-15 17:31:57.424845457,9370575,T,IEX,235.200000,2
2019-10-15 17:32:25.782188032,2019-10-15 17:32:25.782167386,9378255,T,IEX,235.220000,11
2019-10-15 17:32:29.383764992,2019-10-15 17:32:29.383745697,9379536,T,IEX,235.220000,1
2019-10-15 17:33:11.486223872,2019-10-15 17:33:11.486207651,9392428,T,IEX,235.275000,1
2019-10-15 17:34:07.330405888,2019-10-15 17:34:07.330382765,9412379,T,IEX,235.325000,1
2019-10-15 17:34:16.782638080,2019-10-15 17:34:16.782618171,9415393,T,IEX,235.310000,12
2019-10-15 17:34:17.81980928,2019-10-15 17:34:17.81958426,9415443,T,IEX,235.310000,1
2019-10-15 17:34:22.37139968,2019-10-15 17:34:22.37121403,9419184,T,IEX,235.355000,1
2019-10-15 17:34:33.996228096,2019-10-15 17:34:33.996206934,9424005,T,IEX,235.300000,48
2019-10-15 17:34:58.477164032,2019-10-15 17:34:58.477140466,9431973,T,IEX,235.300000,17
2019-10-15 17:35:07.779922944,2019-10-15 17:35:07.779903167,9435210,T,IEX,235.300000,5
2019-10-15 17:35:34.488463872,2019-10-15 17:35:34.488440463,9443799,T,IEX,235.325000,1
2019-10-15 17:35:55.756742912,2019-10-15 17:35:55.756721810,9450110,T,IEX,235.360000,1
2019-10-15 17:37:01.327484928,2019-10-15 17:37:01.327468490,9471723,T,IEX,235.330000,1
2019-10-15 17:37:44.999181056,2019-10-15 17:37:44.999162271,9485374,T,IEX,235.305000,1
2019-10-15 17:37:51.323117056,2019-10-15 17:37:51.323098007,9486979,T,IEX,235.305000,1
2019-10-15 17:38:02.29678080,2019-10-15 17:38:02.29657324,9489517,T,IEX,235.305000,1
2019-10-15 17:39:31.832516096,2019-10-15 17:39:31.832499773,9518509,T,IEX,235.320000,1
2019-10-15 17:39:47.39559936,2019-10-15 17:39:47.39539100,9523685,T,IEX,235.370000,100
2019-10-15 17:39:55.926615040,2019-10-15 17:39:55.926596131,9527778,T,IEX,235.345000,1
2019-10-15 17:40:17.342647040,2019-10-15 17:40:17.342629264,9537198,T,IEX,235.385000,1
2019-10-15 17:42:06.72730112,2019-10-15 17:42:06.72708532,9576704,T,IEX,235.235000,1
2019-10-15 17:42:06.480901120,2019-10-15 17:42:06.480881551,9576871,T,IEX,235.245000,1
2019-10-15 17:42:37.83822080,2019-10-15 17:42:37.83800984,9587672,T,IEX,235.260000,1
2019-10-15 17:42:39.175514880,2019-10-15 17:42:39.175494142,9588285,T,IEX,235.260000,1
2019-10-15 17:42:55.66935040,2019-10-15 17:42:55.66915290,9593540,T,IEX,235.315000,1
2019-10-15 17:46:34.124983040,2019-10-15 17:46:34.124962801,9670211,T,IEX,235.220000,95
2019-10-15 17:48:31.792825088,2019-10-15 17:48:31.792808566,9708679,T,IEX,235.440000,100
2019-10-15 17:48:31.796549888,2019-10-15 17:48:31.796531984,9708682,T,IEX,235.450000,1
2019-10-15 17:48:31.797486080,2019-10-15 17:48:31.797467832,9708683,T,IEX,235.450000,99
2019-10-15 17:48:31.797500928,2019-10-15 17:48:31.797484714,9708684,T,IEX,235.450000,100
2019-10-15 17:48:36.203747072,2019-10-15 17:48:36.203728111,9709728,T,IEX,235.350000,100
2019-10-15 17:48:36.203772928,2019-10-15 17:48:36.203756019,9709729,T,IEX,235.340000,100
2019-10-15 17:48:36.203791104,2019-10-15 17:48:36.203775019,9709730,T,IEX,235.340000,100
2019-10-15 17:52:57.190664960,2019-10-15 17:52:57.190643751,9797825,T,IEX,235.670000,3
2019-10-15 17:53:57.323194112,2019-10-15 17:53:57.323174708,9818507,T,IEX,235.610000,1
2019-10-15 18:12:38.198654976,2019-10-15 18:12:38.198635268,10224750,T,IEX,235.560000,100
2019-10-15 18:12:42.528449024,2019-10-15 18:12:42.528430856,10226513,T,IEX,235.560000,14
2019-10-15 18:12:42.529552896,2019-10-15 18:12:42.529536786,10226526,T,IEX,235.560000,26
2019-10-15 18:16:28.567354880,2019-10-15 18:16:28.567333860,10296936,T,IEX,235.505000,125
2019-10-15 18:19:39.788343040,2019-10-15 18:19:39.788321191,10360453,T,IEX,235.550000,10
2019-10-15 18:20:38.899755008,2019-10-15 18:20:38.899735428,10378790,T,IEX,235.510000,100
2019-10-15 18:23:33.414258944,2019-10-15 18:23:33.414240244,10439589,T,IEX,235.600000,4
2019-10-15 18:23:33.722075904,2019-10-15 18:23:33.722054571,10439857,T,IEX,235.600000,1
2019-10-15 18:25:26.214769920,2019-10-15 18:25:26.214750910,10476621,T,IEX,235.650000,4
2019-10-15 18:25:26.215951104,2019-10-15 18:25:26.215931577,10476623,T,IEX,235.650000,100
2019-10-15 18:25:26.218074112,2019-10-15 18:25:26.218054713,10476624,T,IEX,235.645000,83
2019-10-15 18:26:22.354946048,2019-10-15 18:26:22.354927547,10494336,T,IEX,235.630000,1
2019-10-15 18:27:29.843401984,2019-10-15 18:27:29.843381472,10519928,T,IEX,235.620000,2
2019-10-15 18:27:29.843426048,2019-10-15 18:27:29.843408115,10519929,T,IEX,235.640000,100
2019-10-15 18:32:44.394196992,2019-10-15 18:32:44.394175534,10639948,T,IEX,235.880000,100
2019-10-15 18:32:45.187181056,2019-10-15 18:32:45.187161734,10640158,T,IEX,235.885000,41
2019-10-15 18:32:53.279802112,2019-10-15 18:32:53.279781344,10643236,T,IEX,235.930000,37
2019-10-15 18:33:22.445263104,2019-10-15 18:33:22.445244118,10656313,T,IEX,235.910000,1
2019-10-15 18:33:25.578597120,2019-10-15 18:33:25.578580709,10657123,T,IEX,235.900000,100
2019-10-15 18:33:25.583525120,2019-10-15 18:33:25.583505173,10657128,T,IEX,235.880000,30
2019-10-15 18:33:25.587331072,2019-10-15 18:33:25.587315127,10657132,T,IEX,235.870000,100
2019-10-15 18:33:25.587351040,2019-10-15 18:33:25.587334662,10657133,T,IEX,235.870000,100
2019-10-15 18:33:25.590993920,2019-10-15 18:33:25.590974745,10657137,T,IEX,235.860000,100
2019-10-15 18:33:25.591010048,2019-10-15 18:33:25.590993364,10657138,T,IEX,235.860000,100
2019-10-15 18:33:31.786592000,2019-10-15 18:33:31.786574030,10658880,T,IEX,235.810000,100
2019-10-15 18:33:33.887774976,2019-10-15 18:33:33.887755078,10659549,T,IEX,235.780000,68
2019-10-15 18:33:39.422802944,2019-10-15 18:33:39.422780833,10661051,T,IEX,235.815000,1500
2019-10-15 18:33:39.423821056,2019-10-15 18:33:39.423801466,10661052,T,IEX,235.815000,300
2019-10-15 18:33:41.145050112,2019-10-15 18:33:41.145028812,10661609,T,IEX,235.710000,100
2019-10-15 18:33:41.146013952,2019-10-15 18:33:41.145994880,10661610,T,IEX,235.710000,1500
2019-10-15 18:33:45.772346112,2019-10-15 18:33:45.772324875,10662841,T,IEX,235.810000,10
2019-10-15 18:34:04.70099968,2019-10-15 18:34:04.70080032,10670313,T,IEX,235.940000,100
2019-10-15 18:34:07.874596096,2019-10-15 18:34:07.874576118,10671880,T,IEX,235.870000,100
2019-10-15 18:34:07.929573888,2019-10-15 18:34:07.929558475,10671913,T,IEX,235.970000,100
2019-10-15 18:34:07.930564096,2019-10-15 18:34:07.930548611,10671916,T,IEX,235.970000,100
2019-10-15 18:34:15.182874880,2019-10-15 18:34:15.182853985,10674865,T,IEX,235.920000,100
2019-10-15 18:34:15.182889984,2019-10-15 18:34:15.182872975,10674866,T,IEX,235.910000,100
2019-10-15 18:34:39.226496000,2019-10-15 18:34:39.226471610,10684592,T,IEX,235.880000,100
2019-10-15 18:35:00.5878016,2019-10-15 18:35:00.5859459,10690589,T,IEX,235.885000,100
2019-10-15 18:35:26.692371968,2019-10-15 18:35:26.692356547,10700169,T,IEX,235.930000,45
2019-10-15 18:39:24.426461952,2019-10-15 18:39:24.426440708,10776731,T,IEX,236.000000,10
2019-10-15 18:39:25.959740928,2019-10-15 18:39:25.959723569,10777034,T,IEX,236.020000,100
2019-10-15 18:39:35.660732928,2019-10-15 18:39:35.660710098,10782560,T,IEX,236.020000,1
2019-10-15 18:39:50.814114048,2019-10-15 18:39:50.814094479,10787990,T,IEX,236.040000,2
2019-10-15 18:39:55.38738944,2019-10-15 18:39:55.38718411,10789974,T,IEX,236.065000,27
2019-10-15 18:40:07.674526976,2019-10-15 18:40:07.674504302,10794330,T,IEX,236.090000,1
2019-10-15 18:40:11.927514112,2019-10-15 18:40:11.927493065,10795260,T,IEX,236.085000,48
2019-10-15 18:40:49.990600960,2019-10-15 18:40:49.990580933,10806555,T,IEX,236.200000,97
2019-10-15 18:41:30.213370880,2019-10-15 18:41:30.213350114,10820083,T,IEX,236.160000,100
2019-10-15 18:41:39.534136064,2019-10-15 18:41:39.534116098,10822832,T,IEX,236.165000,6
2019-10-15 18:41:39.540410112,2019-10-15 18:41:39.540389700,10822833,T,IEX,236.165000,5
2019-10-15 18:45:16.395438080,2019-10-15 18:45:16.395419191,10899569,T,IEX,236.305000,100
2019-10-15 18:45:49.281479936,2019-10-15 18:45:49.281452614,10910779,T,IEX,236.350000,100
2019-10-15 18:45:49.281497088,2019-10-15 18:45:49.281478919,10910780,T,IEX,236.350000,100
2019-10-15 18:49:02.147196928,2019-10-15 18:49:02.147176873,10979876,T,IEX,236.425000,300
2019-10-15 18:49:02.148256000,2019-10-15 18:49:02.148236971,10979877,T,IEX,236.425000,300
2019-10-15 18:49:09.422881024,2019-10-15 18:49:09.422863835,10982603,T,IEX,236.240000,100
2019-10-15 18:49:09.427287040,2019-10-15 18:49:09.427271050,10982608,T,IEX,236.230000,60
2019-10-15 18:49:09.428229888,2019-10-15 18:49:09.428210891,10982610,T,IEX,236.230000,40
2019-10-15 18:49:11.525271040,2019-10-15 18:49:11.525253137,10984344,T,IEX,236.215000,200
2019-10-15 18:49:16.663809024,2019-10-15 18:49:16.663788086,10986473,T,IEX,236.100000,100
2019-10-15 18:49:16.663947008,2019-10-15 18:49:16.663930307,10986475,T,IEX,236.100000,100
2019-10-15 18:49:16.664364032,2019-10-15 18:49:16.664348151,10986477,T,IEX,236.100000,32
2019-10-15 18:49:16.665690112,2019-10-15 18:49:16.665675124,10986481,T,IEX,236.100000,100
2019-10-15 18:49:16.665710080,2019-10-15 18:49:16.665690757,10986482,T,IEX,236.100000,68
2019-10-15 18:49:18.716329984,2019-10-15 18:49:18.716308553,10987193,T,IEX,236.100000,32
2019-10-15 18:49:18.721308928,2019-10-15 18:49:18.721289919,10987198,T,IEX,236.100000,24
2019-10-15 18:49:18.726213888,2019-10-15 18:49:18.726191709,10987200,T,IEX,236.100000,24
2019-10-15 18:49:18.732665088,2019-10-15 18:49:18.732644024,10987202,T,IEX,236.100000,19
2019-10-15 18:49:18.737603072,2019-10-15 18:49:18.737584975,10987204,T,IEX,236.100000,19
2019-10-15 18:49:18.742500096,2019-10-15 18:49:18.742483629,10987208,T,IEX,236.100000,14
2019-10-15 18:49:18.747385088,2019-10-15 18:49:18.747369490,10987212,T,IEX,236.100000,14
2019-10-15 18:49:18.752275968,2019-10-15 18:49:18.752255525,10987214,T,IEX,236.100000,4
2019-10-15 18:49:18.757157120,2019-10-15 18:49:18.757140756,10987220,T,IEX,236.100000,4
2019-10-15 18:49:18.762035968,2019-10-15 18:49:18.762015910,10987222,T,IEX,236.100000,4
2019-10-15 18:49:25.920904960,2019-10-15 18:49:25.920884396,10991427,T,IEX,236.230000,100
2019-10-15 18:49:25.936811008,2019-10-15 18:49:25.936788948,10991431,T,IEX,236.250000,39
2019-10-15 18:49:25.940333056,2019-10-15 18:49:25.940311537,10991435,T,IEX,236.250000,139
2019-10-15 18:49:27.100910080,2019-10-15 18:49:27.100889815,10991709,T,IEX,236.280000,100
2019-10-15 18:50:31.852091904,2019-10-15 18:50:31.852071820,11015179,T,IEX,236.150000,10
2019-10-15 18:50:35.363097088,2019-10-15 18:50:35.363076651,11016127,T,IEX,236.125000,90
2019-10-15 18:50:52.30787072,2019-10-15 18:50:52.30765829,11025489,T,IEX,236.140000,6
2019-10-15 18:51:20.332567040,2019-10-15 18:51:20.332545916,11036963,T,IEX,236.100000,29
2019-10-15 18:51:20.332667904,2019-10-15 18:51:20.332650711,11036965,T,IEX,236.100000,71
2019-10-15 18:51:20.332840960,2019-10-15 18:51:20.332824190,11036967,T,IEX,236.100000,34
2019-10-15 18:51:20.332881920,2019-10-15 18:51:20.332865276,11036968,T,IEX,236.100000,8
2019-10-15 18:51:20.347782912,2019-10-15 18:51:20.347763361,11036973,T,IEX,236.100000,5
2019-10-15 18:51:39.532339968,2019-10-15 18:51:39.532320256,11042100,T,IEX,236.100000,100
2019-10-15 18:51:47.986758912,2019-10-15 18:51:47.986729511,11044638,T,IEX,236.110000,100
2019-10-15 18:53:52.697687040,2019-10-15 18:53:52.697667287,11081743,T,IEX,236.140000,2
2019-10-15 18:54:54.52610048,2019-10-15 18:54:54.52583608,11102763,T,IEX,236.130000,100
2019-10-15 18:54:56.277861120,2019-10-15 18:54:56.277842429,11103955,T,IEX,236.160000,46
2019-10-15 18:56:14.836525056,2019-10-15 18:56:14.836504768,11131911,T,IEX,236.180000,25
2019-10-15 18:56:16.563443968,2019-10-15 18:56:16.563424603,11132496,T,IEX,236.180000,100
2019-10-15 18:56:32.177801984,2019-10-15 18:56:32.177784429,11138762,T,IEX,236.180000,4
2019-10-15 18:56:37.544517120,2019-10-15 18:56:37.544495600,11140749,T,IEX,236.180000,50
2019-10-15 18:56:46.548784896,2019-10-15 18:56:46.548762286,11143384,T,IEX,236.180000,13
2019-10-15 18:57:13.403813888,2019-10-15 18:57:13.403792138,11151572,T,IEX,236.240000,100
2019-10-15 18:57:13.403907072,2019-10-15 18:57:13.403889445,11151574,T,IEX,236.240000,1
2019-10-15 18:57:13.411193088,2019-10-15 18:57:13.411175947,11151581,T,IEX,236.230000,3
2019-10-15 19:01:16.525114112,2019-10-15 19:01:16.525093700,11273545,T,IEX,236.230000,5
2019-10-15 19:02:36.40176896,2019-10-15 19:02:36.40154692,11301919,T,IEX,236.190000,1
2019-10-15 19:03:35.204151040,2019-10-15 19:03:35.204131133,11327353,T,IEX,236.135000,100
2019-10-15 19:03:35.207211008,2019-10-15 19:03:35.207188629,11327355,T,IEX,236.135000,100
2019-10-15 19:03:53.505958912,2019-10-15 19:03:53.505938716,11334032,T,IEX,236.040000,35
2019-10-15 19:04:40.215756032,2019-10-15 19:04:40.215734952,11350216,T,IEX,236.050000,100
2019-10-15 19:10:32.252002048,2019-10-15 19:10:32.251983745,11477234,T,IEX,235.940000,100
2019-10-15 19:10:42.494769920,2019-10-15 19:10:42.494748380,11479794,T,IEX,235.930000,2
2019-10-15 19:16:30.438753024,2019-10-15 19:16:30.438731128,11605128,T,IEX,235.900000,1
2019-10-15 19:21:04.62733056,2019-10-15 19:21:04.62712676,11700810,T,IEX,235.970000,1
2019-10-15 19:21:05.612707072,2019-10-15 19:21:05.612687450,11701435,T,IEX,235.960000,100
2019-10-15 19:23:01.439908096,2019-10-15 19:23:01.439889451,11739470,T,IEX,235.890000,3
2019-10-15 19:23:29.325970944,2019-10-15 19:23:29.325955212,11748887,T,IEX,235.910000,2
2019-10-15 19:26:56.112212992,2019-10-15 19:26:56.112195250,11834607,T,IEX,235.955000,73
2019-10-15 19:28:51.562468096,2019-10-15 19:28:51.562448191,11874969,T,IEX,235.890000,27
2019-10-15 19:29:08.560801024,2019-10-15 19:29:08.560779534,11880988,T,IEX,235.920000,100
2019-10-15 19:32:13.191544064,2019-10-15 19:32:13.191525470,11978234,T,IEX,236.030000,2
2019-10-15 19:33:40.818014976,2019-10-15 19:33:40.817997375,12030910,T,IEX,235.880000,95
2019-10-15 19:36:30.335072000,2019-10-15 19:36:30.335054534,12123780,T,IEX,235.940000,100
2019-10-15 19:37:06.249968896,2019-10-15 19:37:06.249949302,12141324,T,IEX,235.895000,2
2019-10-15 19:37:38.597530880,2019-10-15 19:37:38.597511518,12156910,T,IEX,235.910000,1
2019-10-15 19:38:05.525500928,2019-10-15 19:38:05.525480867,12172506,T,IEX,235.880000,100
2019-10-15 19:38:26.601416960,2019-10-15 19:38:26.601399478,12182340,T,IEX,235.880000,100
2019-10-15 19:38:39.4283904,2019-10-15 19:38:39.4265578,12187329,T,IEX,235.890000,100
2019-10-15 19:39:04.548326912,2019-10-15 19:39:04.548308336,12199100,T,IEX,235.930000,100
2019-10-15 19:40:51.224922112,2019-10-15 19:40:51.224898586,12251981,T,IEX,235.890000,100
2019-10-15 19:41:26.187166976,2019-10-15 19:41:26.187147081,12271620,T,IEX,235.830000,2
2019-10-15 19:41:30.959585024,2019-10-15 19:41:30.959566047,12273977,T,IEX,235.830000,100
2019-10-15 19:41:30.959792896,2019-10-15 19:41:30.959766702,12273987,T,IEX,235.830000,200
2019-10-15 19:41:43.432054016,2019-10-15 19:41:43.432032743,12280473,T,IEX,235.810000,2
2019-10-15 19:43:06.679162880,2019-10-15 19:43:06.679143973,12322487,T,IEX,235.730000,10
2019-10-15 19:44:40.603724032,2019-10-15 19:44:40.603701854,12370633,T,IEX,235.730000,1
2019-10-15 19:44:50.63006976,2019-10-15 19:44:50.62985449,12375299,T,IEX,235.710000,3
2019-10-15 19:45:10.419044096,2019-10-15 19:45:10.419025218,12393538,T,IEX,235.670000,100
2019-10-15 19:45:17.289756928,2019-10-15 19:45:17.289738676,12399524,T,IEX,235.640000,64
2019-10-15 19:46:26.440348928,2019-10-15 19:46:26.440329665,12442822,T,IEX,235.720000,100
2019-10-15 19:47:01.443023104,2019-10-15 19:47:01.443006677,12460301,T,IEX,235.670000,1
2019-10-15 19:47:30.981723904,2019-10-15 19:47:30.981698840,12479489,T,IEX,235.620000,37
2019-10-15 19:47:30.982871040,2019-10-15 19:47:30.982853282,12479524,T,IEX,235.620000,63
2019-10-15 19:48:13.345285120,2019-10-15 19:48:13.345264377,12506205,T,IEX,235.570000,9
2019-10-15 19:48:13.345300992,2019-10-15 19:48:13.345283867,12506206,T,IEX,235.570000,91
2019-10-15 19:48:41.331521024,2019-10-15 19:48:41.331501188,12527822,T,IEX,235.620000,100
2019-10-15 19:49:03.876445952,2019-10-15 19:49:03.876429804,12543328,T,IEX,235.590000,5
2019-10-15 19:49:19.375329024,2019-10-15 19:49:19.375307557,12557577,T,IEX,235.555000,1
2019-10-15 19:50:17.633192960,2019-10-15 19:50:17.633172142,12605598,T,IEX,235.680000,100
2019-10-15 19:51:21.659988992,2019-10-15 19:51:21.659969078,12648566,T,IEX,235.740000,11
2019-10-15 19:51:26.8268032,2019-10-15 19:51:26.8248848,12651489,T,IEX,235.750000,3
2019-10-15 19:51:47.912525056,2019-10-15 19:51:47.912503517,12662738,T,IEX,235.780000,100
2019-10-15 19:52:05.610049024,2019-10-15 19:52:05.610027529,12673093,T,IEX,235.805000,100
2019-10-15 19:52:06.562083072,2019-10-15 19:52:06.562062143,12674859,T,IEX,235.760000,5
2019-10-15 19:52:43.275838976,2019-10-15 19:52:43.275818321,12702555,T,IEX,235.720000,4
2019-10-15 19:53:23.967715072,2019-10-15 19:53:23.967694907,12730782,T,IEX,235.690000,100
2019-10-15 19:53:36.565204992,2019-10-15 19:53:36.565179465,12738234,T,IEX,235.700000,100
2019-10-15 19:53:36.565233920,2019-10-15 19:53:36.565204579,12738237,T,IEX,235.710000,82
2019-10-15 19:53:36.568669952,2019-10-15 19:53:36.568649054,12738363,T,IEX,235.710000,100
2019-10-15 19:54:44.618885120,2019-10-15 19:54:44.618860060,12795847,T,IEX,235.620000,2
2019-10-15 19:55:00.65822976,2019-10-15 19:55:00.65805119,12813927,T,IEX,235.730000,100
2019-10-15 19:55:29.814566912,2019-10-15 19:55:29.814545171,12869357,T,IEX,235.720000,9
2019-10-15 19:55:29.814733056,2019-10-15 19:55:29.814714640,12869359,T,IEX,235.720000,50
2019-10-15 19:55:57.840207104,2019-10-15 19:55:57.840183989,12897894,T,IEX,235.785000,100
2019-10-15 19:56:13.649967104,2019-10-15 19:56:13.649948880,12915193,T,IEX,235.755000,100
2019-10-15 19:56:23.702859008,2019-10-15 19:56:23.702839265,12924417,T,IEX,235.760000,100
2019-10-15 19:56:28.713241088,2019-10-15 19:56:28.713224978,12928512,T,IEX,235.710000,5
2019-10-15 19:56:31.928363008,2019-10-15 19:56:31.928342700,12931460,T,IEX,235.710000,95
2019-10-15 19:56:36.832849920,2019-10-15 19:56:36.832829783,12937935,T,IEX,235.670000,100
2019-10-15 19:56:49.431215104,2019-10-15 19:56:49.431196659,12950381,T,IEX,235.635000,32
2019-10-15 19:56:50.775485952,2019-10-15 19:56:50.775469805,12951473,T,IEX,235.630000,100
2019-10-15 19:56:59.465211904,2019-10-15 19:56:59.465195435,12962095,T,IEX,235.570000,2
2019-10-15 19:57:42.793771008,2019-10-15 19:57:42.793751003,13008887,T,IEX,235.630000,100
2019-10-15 19:58:05.724164096,2019-10-15 19:58:05.724144516,13035386,T,IEX,235.610000,100
2019-10-15 19:58:06.482907904,2019-10-15 19:58:06.482888330,13036271,T,IEX,235.580000,100
2019-10-15 19:58:16.276769024,2019-10-15 19:58:16.276747527,13049683,T,IEX,235.600000,100
2019-10-15 19:58:32.740920064,2019-10-15 19:58:32.740902063,13071640,T,IEX,235.650000,100
2019-10-15 19:58:36.732215040,2019-10-15 19:58:36.732195810,13077250,T,IEX,235.670000,100
2019-10-15 19:58:48.943834880,2019-10-15 19:58:48.943810916,13091088,T,IEX,235.700000,100
2019-10-15 19:58:53.526321920,2019-10-15 19:58:53.526301379,13097997,T,IEX,235.730000,100
2019-10-15 19:58:59.669819904,2019-10-15 19:58:59.669799956,13108757,T,IEX,235.650000,100
2019-10-15 19:59:02.131409920,2019-10-15 19:59:02.131391659,13113921,T,IEX,235.620000,75
2019-10-15 19:59:05.428677120,2019-10-15 19:59:05.428658421,13121328,T,IEX,235.590000,25
2019-10-15 19:59:05.541267968,2019-10-15 19:59:05.541250141,13121485,T,IEX,235.590000,75
2019-10-15 19:59:10.811395072,2019-10-15 19:59:10.811377962,13130872,T,IEX,235.600000,25
2019-10-15 19:59:11.221805056,2019-10-15 19:59:11.221787361,13131505,T,IEX,235.610000,2
2019-10-15 19:59:11.653756928,2019-10-15 19:59:11.653739599,13132307,T,IEX,235.630000,100
2019-10-15 19:59:19.25668096,2019-10-15 19:59:19.25649840,13145217,T,IEX,235.610000,29
2019-10-15 19:59:21.192481024,2019-10-15 19:59:21.192461495,13148778,T,IEX,235.600000,3
2019-10-15 19:59:27.486245120,2019-10-15 19:59:27.486229234,13157857,T,IEX,235.580000,100
2019-10-15 19:59:27.486266112,2019-10-15 19:59:27.486249230,13157858,T,IEX,235.580000,100
2019-10-15 19:59:28.705192960,2019-10-15 19:59:28.705175780,13159520,T,IEX,235.590000,2
2019-10-15 19:59:30.255390976,2019-10-15 19:59:30.255363793,13165732,T,IEX,235.600000,1
2019-10-15 19:59:35.22055936,2019-10-15 19:59:35.22038172,13196287,T,IEX,235.610000,2
2019-10-15 19:59:40.843652096,2019-10-15 19:59:40.843635935,13229249,T,IEX,235.655000,38
2019-10-15 19:59:41.612015104,2019-10-15 19:59:41.611997922,13233249,T,IEX,235.660000,41
2019-10-15 19:59:42.13414912,2019-10-15 19:59:42.13398780,13234815,T,IEX,235.660000,5
2019-10-15 19:59:42.816896000,2019-10-15 19:59:42.816877200,13238044,T,IEX,235.640000,5
2019-10-15 19:59:45.45946880,2019-10-15 19:59:45.45928367,13251885,T,IEX,235.635000,14
2019-10-15 19:59:45.624975104,2019-10-15 19:59:45.624951384,13255904,T,IEX,235.635000,2
2019-10-15 19:59:50.894577920,2019-10-15 19:59:50.894544846,13286943,T,IEX,235.650000,100
2019-10-15 19:59:50.896171008,2019-10-15 19:59:50.896142326,13287085,T,IEX,235.650000,1
2019-10-15 19:59:52.127152128,2019-10-15 19:59:52.127136443,13294969,T,IEX,235.660000,1
2019-10-15 19:59:53.875339008,2019-10-15 19:59:53.875322099,13302321,T,IEX,235.710000,1
