2019-10-28 13:32:31.446472960,2019-10-28 13:32:31.446452567,306163,T,IEX,119.310000,112
2019-10-28 13:34:04.771110912,2019-10-28 13:34:04.771094241,410377,T,IEX,119.390000,25
2019-10-28 13:34:58.132544000,2019-10-28 13:34:58.132526632,467679,T,IEX,119.300000,17
2019-10-28 13:35:23.707511040,2019-10-28 13:35:23.707494462,499149,T,IEX,119.290000,56
2019-10-28 13:36:02.178532096,2019-10-28 13:36:02.178512601,539751,T,IEX,119.190000,100
2019-10-28 13:37:12.39777024,2019-10-28 13:37:12.39759216,607389,T,IEX,119.360000,11
2019-10-28 13:38:31.78393088,2019-10-28 13:38:31.78375033,674446,T,IEX,119.250000,100
2019-10-28 13:38:47.518575104,2019-10-28 13:38:47.518554402,688229,T,IEX,119.260000,39
2019-10-28 13:38:47.581425920,2019-10-28 13:38:47.581406551,688338,T,IEX,119.130000,100
2019-10-28 13:39:40.332411904,2019-10-28 13:39:40.332395519,735175,T,IEX,119.160000,1
2019-10-28 13:40:39.226941952,2019-10-28 13:40:39.226923981,788094,T,IEX,119.220000,1
2019-10-28 13:41:23.773209088,2019-10-28 13:41:23.773190080,828314,T,IEX,119.270000,1
2019-10-28 13:41:41.639330048,2019-10-28 13:41:41.639314693,842512,T,IEX,119.300000,300
2019-10-28 13:43:31.995025920,2019-10-28 13:43:31.995009353,948347,T,IEX,119.230000,7
2019-10-28 13:44:18.280280064,2019-10-28 13:44:18.280265583,989216,T,IEX,119.290000,3
2019-10-28 13:44:26.510738944,2019-10-28 13:44:26.510717312,995749,T,IEX,119.290000,100
2019-10-28 13:44:26.510758912,2019-10-28 13:44:26.510743129,995750,T,IEX,119.290000,100
2019-10-28 13:44:26.510789120,2019-10-28 13:44:26.510772785,995751,T,IEX,119.290000,100
2019-10-28 13:44:26.525862912,2019-10-28 13:44:26.525842282,995755,T,IEX,119.290000,100
2019-10-28 13:44:26.527586048,2019-10-28 13:44:26.527566076,995757,T,IEX,119.290000,100
2019-10-28 13:45:16.759107072,2019-10-28 13:45:16.759081101,1045215,T,IEX,119.380000,100
2019-10-28 13:45:16.760872960,2019-10-28 13:45:16.760855248,1045275,T,IEX,119.380000,100
2019-10-28 13:46:18.437188096,2019-10-28 13:46:18.437169262,1097220,T,IEX,119.350000,100
2019-10-28 13:46:49.135163904,2019-10-28 13:46:49.135141943,1125947,T,IEX,119.405000,100
2019-10-28 13:46:49.135179008,2019-10-28 13:46:49.135161797,1125948,T,IEX,119.405000,100
2019-10-28 13:46:49.149387008,2019-10-28 13:46:49.149370367,1125979,T,IEX,119.425000,100
2019-10-28 13:46:51.899032064,2019-10-28 13:46:51.899012791,1128402,T,IEX,119.425000,100
2019-10-28 13:46:51.900225024,2019-10-28 13:46:51.900206258,1128403,T,IEX,119.425000,100
2019-10-28 13:46:51.901195008,2019-10-28 13:46:51.901176942,1128404,T,IEX,119.425000,100
2019-10-28 13:46:58.132183040,2019-10-28 13:46:58.132161866,1133028,T,IEX,119.400000,317
2019-10-28 13:46:58.132256000,2019-10-28 13:46:58.132239728,1133029,T,IEX,119.400000,312
2019-10-28 13:46:58.132270080,2019-10-28 13:46:58.132253206,1133030,T,IEX,119.400000,88
2019-10-28 13:47:03.160231936,2019-10-28 13:47:03.160216326,1137159,T,IEX,119.370000,2
2019-10-28 13:47:03.472646912,2019-10-28 13:47:03.472626960,1137377,T,IEX,119.370000,4
2019-10-28 13:47:24.662928896,2019-10-28 13:47:24.662912372,1161109,T,IEX,119.430000,25
2019-10-28 13:47:25.694128896,2019-10-28 13:47:25.694110709,1162149,T,IEX,119.430000,100
2019-10-28 13:47:26.287860992,2019-10-28 13:47:26.287842319,1163041,T,IEX,119.420000,100
2019-10-28 13:47:56.980154880,2019-10-28 13:47:56.980134422,1187030,T,IEX,119.440000,1000
2019-10-28 13:47:56.981180928,2019-10-28 13:47:56.981163558,1187032,T,IEX,119.440000,100
2019-10-28 13:47:56.983547904,2019-10-28 13:47:56.983525659,1187033,T,IEX,119.440000,400
2019-10-28 13:47:56.983561984,2019-10-28 13:47:56.983545064,1187034,T,IEX,119.440000,100
2019-10-28 13:47:56.985815040,2019-10-28 13:47:56.985797541,1187039,T,IEX,119.440000,400
2019-10-28 13:47:57.136052992,2019-10-28 13:47:57.136033314,1187241,T,IEX,119.440000,100
2019-10-28 13:48:00.863965952,2019-10-28 13:48:00.863944862,1192256,T,IEX,119.460000,2
2019-10-28 13:48:10.440809984,2019-10-28 13:48:10.440790962,1203461,T,IEX,119.440000,100
2019-10-28 13:48:10.440823040,2019-10-28 13:48:10.440805985,1203462,T,IEX,119.440000,100
2019-10-28 13:48:10.440837888,2019-10-28 13:48:10.440821063,1203463,T,IEX,119.440000,100
2019-10-28 13:48:13.727927040,2019-10-28 13:48:13.727907870,1208543,T,IEX,119.440000,100
2019-10-28 13:49:07.419230976,2019-10-28 13:49:07.419214136,1259298,T,IEX,119.480000,591
2019-10-28 13:49:21.246358016,2019-10-28 13:49:21.246341671,1270159,T,IEX,119.470000,2
2019-10-28 13:49:28.643449088,2019-10-28 13:49:28.643428471,1275743,T,IEX,119.475000,300
2019-10-28 13:49:38.853177088,2019-10-28 13:49:38.853158507,1282185,T,IEX,119.495000,378
2019-10-28 13:49:56.668222976,2019-10-28 13:49:56.668207577,1295287,T,IEX,119.485000,4
2019-10-28 13:50:02.17071104,2019-10-28 13:50:02.17053661,1301565,T,IEX,119.455000,2
2019-10-28 13:50:03.465920,2019-10-28 13:50:03.445988,1302472,T,IEX,119.455000,100
2019-10-28 13:50:03.590595072,2019-10-28 13:50:03.590577295,1302995,T,IEX,119.485000,300
2019-10-28 13:50:03.817476096,2019-10-28 13:50:03.817460627,1303217,T,IEX,119.470000,100
2019-10-28 13:50:11.660780032,2019-10-28 13:50:11.660762245,1309723,T,IEX,119.470000,100
2019-10-28 13:50:11.662393088,2019-10-28 13:50:11.662373193,1309724,T,IEX,119.470000,100
2019-10-28 13:50:17.557815040,2019-10-28 13:50:17.557796060,1313978,T,IEX,119.470000,3
2019-10-28 13:50:22.26388992,2019-10-28 13:50:22.26368530,1319024,T,IEX,119.490000,5
2019-10-28 13:50:22.26405888,2019-10-28 13:50:22.26387981,1319025,T,IEX,119.490000,95
2019-10-28 13:50:24.489070080,2019-10-28 13:50:24.489051715,1322184,T,IEX,119.475000,30
2019-10-28 13:50:32.862181888,2019-10-28 13:50:32.862161037,1329812,T,IEX,119.430000,15
2019-10-28 13:50:41.135392000,2019-10-28 13:50:41.135372476,1337189,T,IEX,119.350000,100
2019-10-28 13:51:40.92558080,2019-10-28 13:51:40.92536886,1387597,T,IEX,119.310000,100
2019-10-28 13:52:44.677643008,2019-10-28 13:52:44.677625640,1448606,T,IEX,119.270000,100
2019-10-28 13:53:48.441598976,2019-10-28 13:53:48.441579719,1504275,T,IEX,119.370000,100
2019-10-28 13:53:53.328261120,2019-10-28 13:53:53.328245753,1509093,T,IEX,119.370000,100
2019-10-28 13:54:30.920598016,2019-10-28 13:54:30.920579879,1542865,T,IEX,119.360000,1
2019-10-28 13:54:31.819848960,2019-10-28 13:54:31.819831968,1543674,T,IEX,119.340000,100
2019-10-28 13:55:25.530557952,2019-10-28 13:55:25.530540482,1590836,T,IEX,119.280000,2
2019-10-28 13:55:28.243666944,2019-10-28 13:55:28.243650095,1593146,T,IEX,119.270000,100
2019-10-28 13:56:24.435513088,2019-10-28 13:56:24.435495513,1635997,T,IEX,119.150000,6
2019-10-28 13:57:16.383543040,2019-10-28 13:57:16.383525118,1676967,T,IEX,119.130000,100
2019-10-28 13:57:28.395494912,2019-10-28 13:57:28.395474477,1686512,T,IEX,119.140000,100
2019-10-28 13:57:52.910567936,2019-10-28 13:57:52.910551619,1704959,T,IEX,119.080000,100
2019-10-28 13:58:22.952398080,2019-10-28 13:58:22.952380786,1733713,T,IEX,119.100000,100
2019-10-28 13:58:28.654643968,2019-10-28 13:58:28.654622730,1739011,T,IEX,119.095000,100
2019-10-28 13:58:44.264662016,2019-10-28 13:58:44.264643195,1752510,T,IEX,119.110000,100
2019-10-28 13:58:51.290604032,2019-10-28 13:58:51.290585077,1757903,T,IEX,119.050000,100
2019-10-28 13:58:51.313797888,2019-10-28 13:58:51.313783060,1757955,T,IEX,119.065000,20
2019-10-28 13:59:32.927483904,2019-10-28 13:59:32.927468544,1790739,T,IEX,119.010000,50
2019-10-28 14:00:08.29739008,2019-10-28 14:00:08.29722257,1816382,T,IEX,119.075000,100
2019-10-28 14:00:13.292304896,2019-10-28 14:00:13.292286659,1822558,T,IEX,119.070000,1
2019-10-28 14:01:23.862443008,2019-10-28 14:01:23.862424483,1886306,T,IEX,118.890000,4
2019-10-28 14:01:32.924664064,2019-10-28 14:01:32.924646104,1895443,T,IEX,118.900000,10
2019-10-28 14:01:36.416538112,2019-10-28 14:01:36.416519151,1897879,T,IEX,118.880000,38
2019-10-28 14:01:53.254149888,2019-10-28 14:01:53.254133976,1908150,T,IEX,118.865000,1
2019-10-28 14:01:55.29188096,2019-10-28 14:01:55.29170799,1909185,T,IEX,118.850000,10
2019-10-28 14:02:06.828645120,2019-10-28 14:02:06.828626992,1919578,T,IEX,118.825000,1
2019-10-28 14:02:25.94647040,2019-10-28 14:02:25.94632459,1935697,T,IEX,118.825000,3
2019-10-28 14:02:25.648332032,2019-10-28 14:02:25.648316416,1936152,T,IEX,118.845000,4
2019-10-28 14:02:37.652216064,2019-10-28 14:02:37.652201047,1946483,T,IEX,118.845000,100
2019-10-28 14:02:45.171607040,2019-10-28 14:02:45.171590033,1952894,T,IEX,118.850000,100
2019-10-28 14:03:04.633532928,2019-10-28 14:03:04.633514112,1966645,T,IEX,118.850000,2
2019-10-28 14:03:08.197114112,2019-10-28 14:03:08.197092250,1970174,T,IEX,118.860000,100
2019-10-28 14:03:09.134117888,2019-10-28 14:03:09.134100551,1971162,T,IEX,118.880000,33
2019-10-28 14:04:19.886457088,2019-10-28 14:04:19.886436989,2021837,T,IEX,118.790000,1
2019-10-28 14:04:26.576514048,2019-10-28 14:04:26.576497943,2026775,T,IEX,118.805000,7
2019-10-28 14:04:26.583838976,2019-10-28 14:04:26.583817471,2026800,T,IEX,118.805000,3
2019-10-28 14:05:10.388670976,2019-10-28 14:05:10.388652402,2059217,T,IEX,118.720000,10
2019-10-28 14:05:46.202777088,2019-10-28 14:05:46.202758240,2087603,T,IEX,118.690000,100
2019-10-28 14:06:01.244978944,2019-10-28 14:06:01.244960732,2099100,T,IEX,118.740000,1
2019-10-28 14:07:04.319490048,2019-10-28 14:07:04.319469800,2156666,T,IEX,118.755000,100
2019-10-28 14:07:04.319546112,2019-10-28 14:07:04.319528613,2156667,T,IEX,118.755000,100
2019-10-28 14:07:09.281632000,2019-10-28 14:07:09.281612165,2160782,T,IEX,118.755000,100
2019-10-28 14:07:13.276843008,2019-10-28 14:07:13.276822455,2164416,T,IEX,118.760000,10
2019-10-28 14:07:23.272294912,2019-10-28 14:07:23.272277703,2171931,T,IEX,118.770000,8
2019-10-28 14:08:12.963881984,2019-10-28 14:08:12.963748001,2205317,T,IEX,118.740000,100
2019-10-28 14:08:48.33600000,2019-10-28 14:08:48.33578734,2228926,T,IEX,118.750000,7
2019-10-28 14:09:08.184043008,2019-10-28 14:09:08.184025436,2244650,T,IEX,118.685000,1
2019-10-28 14:09:15.821195008,2019-10-28 14:09:15.821174513,2250383,T,IEX,118.720000,105
2019-10-28 14:09:40.140108032,2019-10-28 14:09:40.140089924,2266548,T,IEX,118.680000,5
2019-10-28 14:10:11.665441024,2019-10-28 14:10:11.665419405,2286502,T,IEX,118.700000,5
2019-10-28 14:11:28.544674048,2019-10-28 14:11:28.544652655,2345269,T,IEX,118.705000,100
2019-10-28 14:11:28.825411072,2019-10-28 14:11:28.825394568,2345369,T,IEX,118.705000,100
2019-10-28 14:11:34.76304896,2019-10-28 14:11:34.76286007,2348197,T,IEX,118.705000,100
2019-10-28 14:12:07.95654912,2019-10-28 14:12:07.95633420,2371442,T,IEX,118.650000,100
2019-10-28 14:12:07.95676928,2019-10-28 14:12:07.95658730,2371443,T,IEX,118.640000,100
2019-10-28 14:13:24.526436096,2019-10-28 14:13:24.526410961,2427037,T,IEX,118.710000,6
2019-10-28 14:14:20.903898112,2019-10-28 14:14:20.903880700,2460890,T,IEX,118.675000,1
2019-10-28 14:14:45.435276032,2019-10-28 14:14:45.435255450,2477794,T,IEX,118.600000,100
2019-10-28 14:15:07.997632000,2019-10-28 14:15:07.997611713,2492781,T,IEX,118.605000,6
2019-10-28 14:17:17.751542016,2019-10-28 14:17:17.751525047,2591472,T,IEX,118.590000,20
2019-10-28 14:17:17.751566080,2019-10-28 14:17:17.751549142,2591473,T,IEX,118.590000,2
2019-10-28 14:17:48.980160000,2019-10-28 14:17:48.980140367,2611831,T,IEX,118.570000,100
2019-10-28 14:17:53.476869120,2019-10-28 14:17:53.476850708,2614183,T,IEX,118.580000,100
2019-10-28 14:17:56.627892992,2019-10-28 14:17:56.627872665,2615775,T,IEX,118.580000,100
2019-10-28 14:17:57.338040064,2019-10-28 14:17:57.338019594,2616117,T,IEX,118.580000,5
2019-10-28 14:17:57.463282944,2019-10-28 14:17:57.463263795,2616268,T,IEX,118.580000,100
2019-10-28 14:18:19.387478016,2019-10-28 14:18:19.387462587,2630266,T,IEX,118.570000,100
2019-10-28 14:19:23.613505024,2019-10-28 14:19:23.613485754,2677059,T,IEX,118.520000,1
2019-10-28 14:19:41.811021056,2019-10-28 14:19:41.811003645,2690169,T,IEX,118.540000,100
2019-10-28 14:19:55.32282880,2019-10-28 14:19:55.32267266,2698270,T,IEX,118.570000,100
2019-10-28 14:21:37.535964928,2019-10-28 14:21:37.535944145,2766007,T,IEX,118.570000,5
2019-10-28 14:21:46.42373120,2019-10-28 14:21:46.42356548,2771572,T,IEX,118.575000,100
2019-10-28 14:21:46.42394112,2019-10-28 14:21:46.42375935,2771573,T,IEX,118.575000,200
2019-10-28 14:21:46.42401024,2019-10-28 14:21:46.42384847,2771574,T,IEX,118.575000,100
2019-10-28 14:21:46.107066880,2019-10-28 14:21:46.107048707,2771610,T,IEX,118.575000,100
2019-10-28 14:21:46.112588032,2019-10-28 14:21:46.112568428,2771612,T,IEX,118.575000,100
2019-10-28 14:21:50.208436992,2019-10-28 14:21:50.208418809,2774286,T,IEX,118.620000,100
2019-10-28 14:23:20.470119936,2019-10-28 14:23:20.470096686,2833650,T,IEX,118.700000,53
2019-10-28 14:23:20.496609024,2019-10-28 14:23:20.496591129,2833705,T,IEX,118.690000,100
2019-10-28 14:23:20.496651008,2019-10-28 14:23:20.496633113,2833706,T,IEX,118.700000,70
2019-10-28 14:23:20.496718080,2019-10-28 14:23:20.496701019,2833710,T,IEX,118.700000,30
2019-10-28 14:23:20.496785920,2019-10-28 14:23:20.496768808,2833712,T,IEX,118.700000,30
2019-10-28 14:23:20.496894976,2019-10-28 14:23:20.496876333,2833715,T,IEX,118.700000,70
2019-10-28 14:23:20.497541120,2019-10-28 14:23:20.497524107,2833724,T,IEX,118.700000,34
2019-10-28 14:23:53.902643968,2019-10-28 14:23:53.902624571,2855718,T,IEX,118.690000,100
2019-10-28 14:23:56.739948032,2019-10-28 14:23:56.739929870,2857478,T,IEX,118.685000,100
2019-10-28 14:23:56.743092992,2019-10-28 14:23:56.743072870,2857479,T,IEX,118.685000,4
2019-10-28 14:23:56.751129088,2019-10-28 14:23:56.751110942,2857509,T,IEX,118.685000,1
2019-10-28 14:24:07.97001984,2019-10-28 14:24:07.96970845,2865196,T,IEX,118.690000,100
2019-10-28 14:25:27.184860928,2019-10-28 14:25:27.184841514,2914992,T,IEX,118.670000,1
2019-10-28 14:25:27.681703936,2019-10-28 14:25:27.681682078,2915173,T,IEX,118.670000,1
2019-10-28 14:25:35.445709056,2019-10-28 14:25:35.445688585,2919735,T,IEX,118.690000,100
2019-10-28 14:26:01.111708928,2019-10-28 14:26:01.111688762,2933905,T,IEX,118.710000,100
2019-10-28 14:26:13.515297024,2019-10-28 14:26:13.515280936,2941772,T,IEX,118.750000,5
2019-10-28 14:26:13.515318016,2019-10-28 14:26:13.515301564,2941773,T,IEX,118.750000,100
2019-10-28 14:26:13.515335936,2019-10-28 14:26:13.515320120,2941774,T,IEX,118.750000,100
2019-10-28 14:26:13.515354880,2019-10-28 14:26:13.515339249,2941775,T,IEX,118.750000,100
2019-10-28 14:26:13.515375104,2019-10-28 14:26:13.515358157,2941776,T,IEX,118.750000,100
2019-10-28 14:26:15.953105920,2019-10-28 14:26:15.953090343,2943635,T,IEX,118.750000,100
2019-10-28 14:26:33.890998016,2019-10-28 14:26:33.890975860,2953650,T,IEX,118.790000,46
2019-10-28 14:26:33.891010048,2019-10-28 14:26:33.890993544,2953651,T,IEX,118.790000,100
2019-10-28 14:26:33.902896896,2019-10-28 14:26:33.902875699,2953655,T,IEX,118.800000,5
2019-10-28 14:27:10.273889024,2019-10-28 14:27:10.273868995,2973877,T,IEX,118.820000,100
2019-10-28 14:27:23.75699968,2019-10-28 14:27:23.75678904,2980535,T,IEX,118.825000,100
2019-10-28 14:27:25.424794112,2019-10-28 14:27:25.424771994,2981757,T,IEX,118.820000,10
2019-10-28 14:27:30.518270976,2019-10-28 14:27:30.518250523,2983767,T,IEX,118.850000,100
2019-10-28 14:27:54.31724032,2019-10-28 14:27:54.31705896,2996872,T,IEX,118.820000,100
2019-10-28 14:29:04.124380928,2019-10-28 14:29:04.124360685,3042304,T,IEX,118.765000,53
2019-10-28 14:29:58.220267008,2019-10-28 14:29:58.220244571,3077963,T,IEX,118.665000,1
2019-10-28 14:30:11.843706112,2019-10-28 14:30:11.843689241,3086472,T,IEX,118.670000,16
2019-10-28 14:31:12.173794048,2019-10-28 14:31:12.173774758,3127819,T,IEX,118.680000,25
2019-10-28 14:31:24.109686016,2019-10-28 14:31:24.109663456,3138118,T,IEX,118.675000,2
2019-10-28 14:33:17.160979968,2019-10-28 14:33:17.160957283,3219849,T,IEX,118.760000,5
2019-10-28 14:33:17.160994048,2019-10-28 14:33:17.160975336,3219850,T,IEX,118.780000,22
2019-10-28 14:33:17.161007104,2019-10-28 14:33:17.160989167,3219851,T,IEX,118.780000,5
2019-10-28 14:33:17.161020928,2019-10-28 14:33:17.161003386,3219852,T,IEX,118.780000,68
2019-10-28 14:33:17.162650880,2019-10-28 14:33:17.162632275,3219856,T,IEX,118.760000,100
2019-10-28 14:33:17.162793984,2019-10-28 14:33:17.162773605,3219857,T,IEX,118.780000,100
2019-10-28 14:34:04.451627008,2019-10-28 14:34:04.451609629,3252116,T,IEX,118.805000,7
2019-10-28 14:35:35.498631936,2019-10-28 14:35:35.498611172,3308853,T,IEX,118.750000,100
2019-10-28 14:35:35.498648064,2019-10-28 14:35:35.498631015,3308854,T,IEX,118.750000,11
2019-10-28 14:36:48.68206080,2019-10-28 14:36:48.68187432,3353740,T,IEX,118.750000,100
2019-10-28 14:36:48.203215872,2019-10-28 14:36:48.203196494,3353835,T,IEX,118.750000,100
2019-10-28 14:39:52.242891008,2019-10-28 14:39:52.242870349,3495295,T,IEX,118.590000,6
2019-10-28 14:39:55.551836928,2019-10-28 14:39:55.551815225,3497821,T,IEX,118.600000,100
2019-10-28 14:41:48.119290880,2019-10-28 14:41:48.119272002,3573876,T,IEX,118.700000,13
2019-10-28 14:42:11.286750976,2019-10-28 14:42:11.286733381,3591299,T,IEX,118.710000,6
2019-10-28 14:43:06.564709888,2019-10-28 14:43:06.564688510,3623554,T,IEX,118.675000,5
2019-10-28 14:43:06.790096896,2019-10-28 14:43:06.790080243,3623651,T,IEX,118.690000,5
2019-10-28 14:44:30.212933120,2019-10-28 14:44:30.212912299,3675058,T,IEX,118.750000,14
2019-10-28 14:44:30.212948992,2019-10-28 14:44:30.212932173,3675059,T,IEX,118.750000,1
2019-10-28 14:44:30.212967936,2019-10-28 14:44:30.212951983,3675060,T,IEX,118.750000,85
2019-10-28 14:44:51.616314880,2019-10-28 14:44:51.616295900,3685607,T,IEX,118.745000,7
2019-10-28 14:44:51.616340992,2019-10-28 14:44:51.616322896,3685608,T,IEX,118.745000,100
2019-10-28 14:46:06.80431104,2019-10-28 14:46:06.80414311,3733470,T,IEX,118.700000,1
2019-10-28 14:46:06.87917056,2019-10-28 14:46:06.87898219,3733480,T,IEX,118.700000,3
2019-10-28 14:46:26.338219008,2019-10-28 14:46:26.338201139,3745444,T,IEX,118.685000,1
2019-10-28 14:46:26.345445888,2019-10-28 14:46:26.345428233,3745448,T,IEX,118.685000,1
2019-10-28 14:46:27.335759872,2019-10-28 14:46:27.335740428,3745867,T,IEX,118.685000,100
2019-10-28 14:46:32.286189056,2019-10-28 14:46:32.286171981,3748479,T,IEX,118.665000,1
2019-10-28 14:46:33.282437120,2019-10-28 14:46:33.282417013,3749109,T,IEX,118.680000,100
2019-10-28 14:46:44.230819072,2019-10-28 14:46:44.230800186,3755301,T,IEX,118.685000,100
2019-10-28 14:47:12.813207040,2019-10-28 14:47:12.813189897,3770323,T,IEX,118.715000,1
2019-10-28 14:47:28.917416960,2019-10-28 14:47:28.917399527,3780320,T,IEX,118.720000,1
2019-10-28 14:47:40.7664128,2019-10-28 14:47:40.7647902,3786825,T,IEX,118.730000,55
2019-10-28 14:47:45.988210944,2019-10-28 14:47:45.988193024,3789301,T,IEX,118.735000,1
2019-10-28 14:47:58.53067008,2019-10-28 14:47:58.53046760,3795123,T,IEX,118.770000,1
2019-10-28 14:47:58.443546112,2019-10-28 14:47:58.443526458,3795289,T,IEX,118.780000,100
2019-10-28 14:48:02.525728000,2019-10-28 14:48:02.525710115,3797363,T,IEX,118.780000,100
2019-10-28 14:48:11.220189952,2019-10-28 14:48:11.220169549,3802367,T,IEX,118.790000,5
2019-10-28 14:48:15.405501952,2019-10-28 14:48:15.405479689,3804046,T,IEX,118.785000,1
2019-10-28 14:49:58.44805120,2019-10-28 14:49:58.44783057,3859411,T,IEX,118.790000,6
2019-10-28 14:49:58.44818944,2019-10-28 14:49:58.44802345,3859412,T,IEX,118.790000,4
2019-10-28 14:49:58.44835072,2019-10-28 14:49:58.44818327,3859413,T,IEX,118.790000,200
2019-10-28 14:49:58.44849920,2019-10-28 14:49:58.44833419,3859414,T,IEX,118.790000,100
2019-10-28 14:49:58.44862976,2019-10-28 14:49:58.44846689,3859415,T,IEX,118.790000,90
2019-10-28 14:52:38.647416064,2019-10-28 14:52:38.647401063,3961003,T,IEX,118.730000,100
2019-10-28 14:53:26.968727040,2019-10-28 14:53:26.968706572,3989644,T,IEX,118.685000,1
2019-10-28 14:53:26.986734080,2019-10-28 14:53:26.986712017,3989647,T,IEX,118.690000,99
2019-10-28 14:54:27.822341888,2019-10-28 14:54:27.822323225,4029187,T,IEX,118.650000,17
2019-10-28 14:55:30.870255104,2019-10-28 14:55:30.870234883,4068596,T,IEX,118.685000,2
2019-10-28 14:55:31.991266048,2019-10-28 14:55:31.991244515,4069237,T,IEX,118.685000,1
2019-10-28 14:55:32.48064000,2019-10-28 14:55:32.48043555,4069256,T,IEX,118.685000,1
2019-10-28 14:55:41.962796032,2019-10-28 14:55:41.962775581,4078262,T,IEX,118.710000,14
2019-10-28 14:55:41.970134016,2019-10-28 14:55:41.970115248,4078265,T,IEX,118.710000,7
2019-10-28 14:55:41.970149120,2019-10-28 14:55:41.970132659,4078266,T,IEX,118.710000,2
2019-10-28 14:56:03.171113984,2019-10-28 14:56:03.171096768,4091432,T,IEX,118.725000,1
2019-10-28 14:56:03.437918976,2019-10-28 14:56:03.437901831,4091555,T,IEX,118.725000,2
2019-10-28 14:56:24.270080000,2019-10-28 14:56:24.270057991,4105031,T,IEX,118.715000,1
2019-10-28 14:56:33.995563008,2019-10-28 14:56:33.995542628,4109860,T,IEX,118.715000,5
2019-10-28 14:59:49.425984000,2019-10-28 14:59:49.425966157,4206731,T,IEX,118.600000,5
2019-10-28 15:01:09.693182976,2019-10-28 15:01:09.693165441,4264441,T,IEX,118.525000,6
2019-10-28 15:01:09.694226944,2019-10-28 15:01:09.694207741,4264442,T,IEX,118.530000,50
2019-10-28 15:01:09.696931072,2019-10-28 15:01:09.696914080,4264446,T,IEX,118.540000,100
2019-10-28 15:01:09.710383104,2019-10-28 15:01:09.710366870,4264459,T,IEX,118.540000,71
2019-10-28 15:01:49.751067904,2019-10-28 15:01:49.751049033,4293352,T,IEX,118.505000,1
2019-10-28 15:04:16.113681920,2019-10-28 15:04:16.113664948,4377328,T,IEX,118.445000,100
2019-10-28 15:04:18.995336960,2019-10-28 15:04:18.995322843,4379286,T,IEX,118.410000,100
2019-10-28 15:04:18.996299008,2019-10-28 15:04:18.996283615,4379289,T,IEX,118.410000,100
2019-10-28 15:05:02.252800000,2019-10-28 15:05:02.252781247,4403476,T,IEX,118.430000,100
2019-10-28 15:08:20.258640896,2019-10-28 15:08:20.258622937,4530647,T,IEX,118.345000,4
2019-10-28 15:10:01.107835904,2019-10-28 15:10:01.107813768,4588716,T,IEX,118.405000,100
2019-10-28 15:10:01.124813056,2019-10-28 15:10:01.124792262,4588721,T,IEX,118.405000,100
2019-10-28 15:10:01.634342912,2019-10-28 15:10:01.634324165,4589237,T,IEX,118.405000,100
2019-10-28 15:10:02.136444928,2019-10-28 15:10:02.136429636,4589435,T,IEX,118.405000,100
2019-10-28 15:10:02.631354112,2019-10-28 15:10:02.631333318,4589616,T,IEX,118.405000,100
2019-10-28 15:10:04.249862912,2019-10-28 15:10:04.249844513,4590316,T,IEX,118.405000,4
2019-10-28 15:10:05.721071104,2019-10-28 15:10:05.721052950,4590980,T,IEX,118.410000,4
2019-10-28 15:10:12.150023936,2019-10-28 15:10:12.150006622,4594370,T,IEX,118.415000,1
2019-10-28 15:10:18.989308928,2019-10-28 15:10:18.989288207,4598404,T,IEX,118.405000,100
2019-10-28 15:10:20.24851968,2019-10-28 15:10:20.24834688,4598891,T,IEX,118.400000,100
2019-10-28 15:10:49.139407872,2019-10-28 15:10:49.139389415,4615758,T,IEX,118.420000,1
2019-10-28 15:13:34.830384128,2019-10-28 15:13:34.830368255,4703439,T,IEX,118.445000,100
2019-10-28 15:13:50.685609984,2019-10-28 15:13:50.685590351,4712533,T,IEX,118.410000,100
2019-10-28 15:15:00.883139072,2019-10-28 15:15:00.883119418,4745770,T,IEX,118.445000,100
2019-10-28 15:18:19.742725120,2019-10-28 15:18:19.742706988,4863225,T,IEX,118.280000,100
2019-10-28 15:19:18.325529088,2019-10-28 15:19:18.325513061,4893214,T,IEX,118.270000,100
2019-10-28 15:20:57.227851008,2019-10-28 15:20:57.227829518,4941529,T,IEX,118.230000,100
2019-10-28 15:20:57.228000000,2019-10-28 15:20:57.227983541,4941531,T,IEX,118.230000,100
2019-10-28 15:20:57.228169984,2019-10-28 15:20:57.228151434,4941532,T,IEX,118.230000,100
2019-10-28 15:25:23.756222976,2019-10-28 15:25:23.756203585,5073519,T,IEX,118.290000,100
2019-10-28 15:29:33.567392000,2019-10-28 15:29:33.567371210,5180937,T,IEX,118.265000,1
2019-10-28 15:30:20.252156928,2019-10-28 15:30:20.252137858,5210062,T,IEX,118.240000,100
2019-10-28 15:30:57.604480000,2019-10-28 15:30:57.604457805,5228706,T,IEX,118.240000,10
2019-10-28 15:31:12.872477952,2019-10-28 15:31:12.872459910,5235900,T,IEX,118.235000,100
2019-10-28 15:32:07.755450880,2019-10-28 15:32:07.755431521,5262265,T,IEX,118.210000,100
2019-10-28 15:32:29.202212096,2019-10-28 15:32:29.202194130,5272411,T,IEX,118.210000,10
2019-10-28 15:32:53.658739968,2019-10-28 15:32:53.658716634,5284157,T,IEX,118.225000,100
2019-10-28 15:33:34.748029952,2019-10-28 15:33:34.748010469,5310636,T,IEX,118.225000,100
2019-10-28 15:33:37.798778112,2019-10-28 15:33:37.798760594,5311970,T,IEX,118.220000,100
2019-10-28 15:35:55.860603904,2019-10-28 15:35:55.860585649,5394218,T,IEX,118.260000,100
2019-10-28 15:35:59.676438016,2019-10-28 15:35:59.676420913,5396519,T,IEX,118.280000,100
2019-10-28 15:35:59.683673088,2019-10-28 15:35:59.683651554,5396571,T,IEX,118.280000,300
2019-10-28 15:35:59.683691008,2019-10-28 15:35:59.683674255,5396572,T,IEX,118.280000,100
2019-10-28 15:35:59.683704064,2019-10-28 15:35:59.683688158,5396573,T,IEX,118.280000,100
2019-10-28 15:36:18.485786112,2019-10-28 15:36:18.485765404,5408958,T,IEX,118.340000,100
2019-10-28 15:36:52.959115008,2019-10-28 15:36:52.959098404,5429799,T,IEX,118.325000,100
2019-10-28 15:38:48.776967936,2019-10-28 15:38:48.776949164,5500748,T,IEX,118.320000,100
2019-10-28 15:39:30.283302912,2019-10-28 15:39:30.283284231,5524918,T,IEX,118.260000,100
2019-10-28 15:39:43.50745088,2019-10-28 15:39:43.50724398,5530873,T,IEX,118.290000,100
2019-10-28 15:40:24.360536064,2019-10-28 15:40:24.360516061,5556239,T,IEX,118.285000,100
2019-10-28 15:44:54.645257984,2019-10-28 15:44:54.645237641,5696426,T,IEX,118.330000,14
2019-10-28 15:46:33.154255872,2019-10-28 15:46:33.154235761,5759654,T,IEX,118.400000,33
2019-10-28 15:46:40.837964032,2019-10-28 15:46:40.837946678,5765515,T,IEX,118.400000,100
2019-10-28 15:47:08.748843008,2019-10-28 15:47:08.748821447,5787119,T,IEX,118.390000,100
2019-10-28 15:49:29.138236928,2019-10-28 15:49:29.138216302,5857383,T,IEX,118.415000,2
2019-10-28 15:49:29.149745920,2019-10-28 15:49:29.149725218,5857388,T,IEX,118.420000,4
2019-10-28 15:49:54.2106880,2019-10-28 15:49:54.2088451,5868975,T,IEX,118.470000,1
2019-10-28 15:50:01.626245888,2019-10-28 15:50:01.626226832,5873564,T,IEX,118.490000,2
2019-10-28 15:50:01.752110080,2019-10-28 15:50:01.752093532,5873633,T,IEX,118.495000,1
2019-10-28 15:50:02.621988096,2019-10-28 15:50:02.621966995,5874182,T,IEX,118.490000,2
2019-10-28 15:50:11.707378944,2019-10-28 15:50:11.707361425,5879200,T,IEX,118.500000,1
2019-10-28 15:51:50.349186048,2019-10-28 15:51:50.349168154,5929478,T,IEX,118.510000,1
2019-10-28 15:51:51.342343936,2019-10-28 15:51:51.342324879,5929980,T,IEX,118.525000,14
2019-10-28 15:52:00.633600000,2019-10-28 15:52:00.633577074,5934812,T,IEX,118.525000,2
2019-10-28 15:52:34.145137920,2019-10-28 15:52:34.145117179,5951011,T,IEX,118.545000,1
2019-10-28 15:52:34.155379968,2019-10-28 15:52:34.155359620,5951014,T,IEX,118.550000,2
2019-10-28 15:52:46.953315072,2019-10-28 15:52:46.953292326,5957084,T,IEX,118.510000,1
2019-10-28 15:52:51.301320960,2019-10-28 15:52:51.301302436,5959051,T,IEX,118.480000,1
2019-10-28 15:52:51.309614080,2019-10-28 15:52:51.309597427,5959086,T,IEX,118.490000,52
2019-10-28 15:52:51.309629952,2019-10-28 15:52:51.309613641,5959087,T,IEX,118.490000,3
2019-10-28 15:53:01.508360960,2019-10-28 15:53:01.508343081,5965872,T,IEX,118.470000,1
2019-10-28 15:53:01.530055936,2019-10-28 15:53:01.530038184,5965921,T,IEX,118.470000,4
2019-10-28 15:53:05.599396096,2019-10-28 15:53:05.599374869,5968937,T,IEX,118.470000,1
2019-10-28 15:53:05.936119040,2019-10-28 15:53:05.936100308,5969129,T,IEX,118.470000,1
2019-10-28 15:53:19.250920960,2019-10-28 15:53:19.250901020,5978805,T,IEX,118.475000,1
2019-10-28 15:53:24.940793088,2019-10-28 15:53:24.940772923,5982405,T,IEX,118.465000,1
2019-10-28 15:53:27.630012928,2019-10-28 15:53:27.629995300,5983962,T,IEX,118.460000,100
2019-10-28 15:53:27.665712896,2019-10-28 15:53:27.665691675,5984080,T,IEX,118.460000,1
2019-10-28 15:54:02.648176896,2019-10-28 15:54:02.648156550,6003878,T,IEX,118.410000,1
2019-10-28 15:54:15.18888960,2019-10-28 15:54:15.18872598,6012123,T,IEX,118.420000,1
2019-10-28 15:54:16.160230912,2019-10-28 15:54:16.160215389,6012994,T,IEX,118.425000,2
2019-10-28 15:55:00.213230080,2019-10-28 15:55:00.213213674,6034612,T,IEX,118.400000,1
2019-10-28 15:55:19.734701056,2019-10-28 15:55:19.734680252,6046887,T,IEX,118.345000,2
2019-10-28 15:55:19.745782016,2019-10-28 15:55:19.745761907,6046894,T,IEX,118.350000,48
2019-10-28 15:55:20.363574016,2019-10-28 15:55:20.363552949,6047471,T,IEX,118.370000,1
2019-10-28 15:55:51.776402944,2019-10-28 15:55:51.776379588,6065032,T,IEX,118.325000,1
2019-10-28 15:56:10.952826112,2019-10-28 15:56:10.952804198,6076753,T,IEX,118.345000,2
2019-10-28 15:56:10.952848896,2019-10-28 15:56:10.952831232,6076754,T,IEX,118.345000,5
2019-10-28 15:56:21.666338048,2019-10-28 15:56:21.666317548,6081046,T,IEX,118.370000,2
2019-10-28 15:57:39.139987968,2019-10-28 15:57:39.139968840,6119274,T,IEX,118.320000,1
2019-10-28 15:58:03.865321984,2019-10-28 15:58:03.865304419,6131551,T,IEX,118.350000,5
2019-10-28 15:58:32.561502976,2019-10-28 15:58:32.561485092,6145861,T,IEX,118.350000,1
2019-10-28 15:58:32.696638976,2019-10-28 15:58:32.696623583,6145927,T,IEX,118.350000,2
2019-10-28 15:59:14.478582016,2019-10-28 15:59:14.478562844,6166963,T,IEX,118.325000,1
2019-10-28 15:59:40.119579904,2019-10-28 15:59:40.119561311,6178890,T,IEX,118.325000,2
2019-10-28 16:00:25.168233984,2019-10-28 16:00:25.168214439,6205091,T,IEX,118.310000,1
2019-10-28 16:01:29.12848128,2019-10-28 16:01:29.12830677,6237163,T,IEX,118.245000,3
2019-10-28 16:02:06.566195968,2019-10-28 16:02:06.566176635,6261394,T,IEX,118.190000,100
2019-10-28 16:02:39.574027008,2019-10-28 16:02:39.574008477,6278469,T,IEX,118.215000,2
2019-10-28 16:03:08.178521088,2019-10-28 16:03:08.178500562,6292579,T,IEX,118.230000,100
2019-10-28 16:04:41.831399936,2019-10-28 16:04:41.831380383,6336732,T,IEX,118.210000,100
2019-10-28 16:04:41.838580992,2019-10-28 16:04:41.838559823,6336734,T,IEX,118.210000,100
2019-10-28 16:06:09.660291072,2019-10-28 16:06:09.660276622,6376153,T,IEX,118.145000,100
2019-10-28 16:06:09.661914880,2019-10-28 16:06:09.661898434,6376163,T,IEX,118.145000,7
2019-10-28 16:06:09.702098944,2019-10-28 16:06:09.702081586,6376192,T,IEX,118.145000,1
2019-10-28 16:09:21.363083008,2019-10-28 16:09:21.363065684,6462256,T,IEX,118.160000,1
2019-10-28 16:09:42.205286912,2019-10-28 16:09:42.205268909,6469948,T,IEX,118.140000,11
2019-10-28 16:09:54.541512960,2019-10-28 16:09:54.541494582,6474704,T,IEX,118.150000,1
2019-10-28 16:09:59.541402880,2019-10-28 16:09:59.541382574,6477006,T,IEX,118.155000,1
2019-10-28 16:10:05.945608960,2019-10-28 16:10:05.945591039,6479478,T,IEX,118.155000,1
2019-10-28 16:10:13.339708928,2019-10-28 16:10:13.339690252,6483244,T,IEX,118.170000,5
2019-10-28 16:11:17.586900992,2019-10-28 16:11:17.586880007,6515296,T,IEX,118.220000,100
2019-10-28 16:13:53.590557952,2019-10-28 16:13:53.590537810,6585107,T,IEX,118.240000,6
2019-10-28 16:14:34.566162944,2019-10-28 16:14:34.566141956,6603688,T,IEX,118.280000,50
2019-10-28 16:14:45.628198912,2019-10-28 16:14:45.628180959,6609780,T,IEX,118.280000,1
2019-10-28 16:14:45.636738048,2019-10-28 16:14:45.636720978,6609841,T,IEX,118.280000,1
2019-10-28 16:14:45.637321984,2019-10-28 16:14:45.637305828,6609844,T,IEX,118.280000,1
2019-10-28 16:14:45.638021120,2019-10-28 16:14:45.638004974,6609848,T,IEX,118.280000,1
2019-10-28 16:14:45.640013056,2019-10-28 16:14:45.639995914,6609855,T,IEX,118.280000,1
2019-10-28 16:15:07.750757120,2019-10-28 16:15:07.750734156,6621233,T,IEX,118.250000,6
2019-10-28 16:17:02.577041920,2019-10-28 16:17:02.577024338,6673175,T,IEX,118.170000,100
2019-10-28 16:17:53.651569920,2019-10-28 16:17:53.651553852,6696621,T,IEX,118.170000,100
2019-10-28 16:19:27.810710016,2019-10-28 16:19:27.810688889,6736386,T,IEX,118.160000,58
2019-10-28 16:19:27.810811904,2019-10-28 16:19:27.810793706,6736392,T,IEX,118.160000,42
2019-10-28 16:19:27.868402944,2019-10-28 16:19:27.868383166,6736645,T,IEX,118.150000,100
2019-10-28 16:20:00.646991872,2019-10-28 16:20:00.646974384,6751797,T,IEX,118.110000,2
2019-10-28 16:22:48.31749888,2019-10-28 16:22:48.31728096,6822863,T,IEX,118.050000,100
2019-10-28 16:23:45.56034048,2019-10-28 16:23:45.56016440,6847499,T,IEX,118.085000,100
2019-10-28 16:25:39.356026880,2019-10-28 16:25:39.356009686,6901198,T,IEX,118.105000,300
2019-10-28 16:25:57.725088000,2019-10-28 16:25:57.725069722,6907570,T,IEX,118.110000,1
2019-10-28 16:25:57.725145088,2019-10-28 16:25:57.725128289,6907571,T,IEX,118.110000,1
2019-10-28 16:25:59.193769984,2019-10-28 16:25:59.193749844,6908117,T,IEX,118.120000,3
2019-10-28 16:25:59.193860096,2019-10-28 16:25:59.193843292,6908118,T,IEX,118.120000,2
2019-10-28 16:26:56.800210944,2019-10-28 16:26:56.800193045,6930540,T,IEX,118.100000,100
2019-10-28 16:29:14.103745024,2019-10-28 16:29:14.103724396,6999776,T,IEX,118.020000,1
2019-10-28 16:29:24.15322112,2019-10-28 16:29:24.15301590,7006140,T,IEX,118.030000,100
2019-10-28 16:30:12.752122112,2019-10-28 16:30:12.752101806,7040870,T,IEX,117.940000,5
2019-10-28 16:30:14.494565120,2019-10-28 16:30:14.494540745,7042125,T,IEX,117.950000,4
2019-10-28 16:31:55.866740992,2019-10-28 16:31:55.866720852,7091223,T,IEX,117.900000,100
2019-10-28 16:31:55.868165120,2019-10-28 16:31:55.868146615,7091273,T,IEX,117.900000,100
2019-10-28 16:32:06.238433024,2019-10-28 16:32:06.238413245,7097112,T,IEX,117.910000,100
2019-10-28 16:32:06.239854080,2019-10-28 16:32:06.239836616,7097114,T,IEX,117.910000,100
2019-10-28 16:32:06.809108992,2019-10-28 16:32:06.809091776,7097349,T,IEX,117.910000,100
2019-10-28 16:33:34.430491904,2019-10-28 16:33:34.430474477,7134776,T,IEX,117.905000,100
2019-10-28 16:34:28.81649920,2019-10-28 16:34:28.81629907,7159160,T,IEX,117.855000,161
2019-10-28 16:34:31.601604096,2019-10-28 16:34:31.601584690,7160580,T,IEX,117.855000,100
2019-10-28 16:34:41.359833088,2019-10-28 16:34:41.359811330,7166591,T,IEX,117.840000,100
2019-10-28 16:34:47.733434880,2019-10-28 16:34:47.733415909,7169349,T,IEX,117.835000,100
2019-10-28 16:34:51.838394112,2019-10-28 16:34:51.838373690,7173012,T,IEX,117.840000,100
2019-10-28 16:34:51.838405120,2019-10-28 16:34:51.838388557,7173013,T,IEX,117.840000,100
2019-10-28 16:34:53.477803008,2019-10-28 16:34:53.477786388,7173720,T,IEX,117.840000,100
2019-10-28 16:35:10.146414080,2019-10-28 16:35:10.146397514,7184900,T,IEX,117.850000,7
2019-10-28 16:36:42.324480000,2019-10-28 16:36:42.324465256,7221058,T,IEX,117.850000,1
2019-10-28 16:36:49.222685952,2019-10-28 16:36:49.222668186,7223478,T,IEX,117.860000,100
2019-10-28 16:37:14.882436096,2019-10-28 16:37:14.882414406,7233528,T,IEX,117.850000,100
2019-10-28 16:37:15.581331968,2019-10-28 16:37:15.581314917,7233741,T,IEX,117.850000,100
2019-10-28 16:37:41.338339072,2019-10-28 16:37:41.338318070,7242468,T,IEX,117.870000,10
2019-10-28 16:37:41.338384896,2019-10-28 16:37:41.338368747,7242469,T,IEX,117.870000,1
2019-10-28 16:38:14.66027008,2019-10-28 16:38:14.66008608,7254302,T,IEX,117.870000,100
2019-10-28 16:38:14.66128896,2019-10-28 16:38:14.66112447,7254308,T,IEX,117.870000,100
2019-10-28 16:43:39.723668992,2019-10-28 16:43:39.723648907,7359542,T,IEX,117.820000,43
2019-10-28 16:43:42.557328896,2019-10-28 16:43:42.557311596,7361190,T,IEX,117.820000,57
2019-10-28 16:45:09.777801984,2019-10-28 16:45:09.777782653,7389444,T,IEX,117.730000,88
2019-10-28 16:45:43.917021952,2019-10-28 16:45:43.917005787,7400548,T,IEX,117.730000,10
2019-10-28 16:45:43.917042944,2019-10-28 16:45:43.917026754,7400549,T,IEX,117.730000,100
2019-10-28 16:45:43.917063936,2019-10-28 16:45:43.917048253,7400550,T,IEX,117.730000,179
2019-10-28 16:45:43.935725056,2019-10-28 16:45:43.935704317,7400553,T,IEX,117.730000,100
2019-10-28 16:45:44.578803968,2019-10-28 16:45:44.578786172,7400673,T,IEX,117.730000,100
2019-10-28 16:45:47.542595072,2019-10-28 16:45:47.542578276,7401699,T,IEX,117.730000,140
2019-10-28 16:45:47.591728128,2019-10-28 16:45:47.591709784,7401713,T,IEX,117.730000,2
2019-10-28 16:45:57.856604928,2019-10-28 16:45:57.856584766,7405292,T,IEX,117.740000,100
2019-10-28 16:45:57.857736960,2019-10-28 16:45:57.857718025,7405339,T,IEX,117.740000,7
2019-10-28 16:45:58.544716032,2019-10-28 16:45:58.544696372,7406119,T,IEX,117.750000,3
2019-10-28 16:47:19.948410880,2019-10-28 16:47:19.948393012,7432222,T,IEX,117.715000,100
2019-10-28 16:47:23.506866944,2019-10-28 16:47:23.506845265,7433349,T,IEX,117.715000,7
2019-10-28 16:48:20.810860032,2019-10-28 16:48:20.810840690,7456571,T,IEX,117.685000,100
2019-10-28 16:48:20.812076032,2019-10-28 16:48:20.812057897,7456572,T,IEX,117.685000,100
2019-10-28 16:48:20.813816064,2019-10-28 16:48:20.813796627,7456573,T,IEX,117.685000,100
2019-10-28 16:48:22.584049920,2019-10-28 16:48:22.584030487,7457858,T,IEX,117.695000,100
2019-10-28 16:48:30.201104896,2019-10-28 16:48:30.201084021,7461040,T,IEX,117.665000,100
2019-10-28 16:48:30.201121024,2019-10-28 16:48:30.201103344,7461041,T,IEX,117.665000,52
2019-10-28 16:48:37.893661952,2019-10-28 16:48:37.893641268,7463466,T,IEX,117.690000,1
2019-10-28 16:48:51.450544128,2019-10-28 16:48:51.450525494,7467190,T,IEX,117.690000,100
2019-10-28 16:48:56.389180928,2019-10-28 16:48:56.389160992,7468725,T,IEX,117.700000,1
2019-10-28 16:49:17.451851008,2019-10-28 16:49:17.451832091,7476245,T,IEX,117.685000,2
2019-10-28 16:49:17.541199872,2019-10-28 16:49:17.541179480,7476268,T,IEX,117.685000,300
2019-10-28 16:49:18.42403072,2019-10-28 16:49:18.42381802,7476414,T,IEX,117.685000,176
2019-10-28 16:49:19.41376000,2019-10-28 16:49:19.41356122,7476678,T,IEX,117.685000,164
2019-10-28 16:49:19.641221120,2019-10-28 16:49:19.641201647,7476814,T,IEX,117.685000,58
2019-10-28 16:49:19.641232896,2019-10-28 16:49:19.641214341,7476815,T,IEX,117.685000,2
2019-10-28 16:49:19.641245952,2019-10-28 16:49:19.641230351,7476816,T,IEX,117.685000,75
2019-10-28 16:49:26.480783872,2019-10-28 16:49:26.480763491,7479051,T,IEX,117.650000,2
2019-10-28 16:49:26.494386944,2019-10-28 16:49:26.494368288,7479054,T,IEX,117.650000,1
2019-10-28 16:52:12.506213888,2019-10-28 16:52:12.506197183,7539115,T,IEX,117.675000,2
2019-10-28 16:52:12.508155904,2019-10-28 16:52:12.508136114,7539116,T,IEX,117.675000,2
2019-10-28 16:52:12.509338880,2019-10-28 16:52:12.509319668,7539117,T,IEX,117.675000,7
2019-10-28 16:53:33.145210112,2019-10-28 16:53:33.145192643,7568894,T,IEX,117.710000,100
2019-10-28 16:53:38.278265088,2019-10-28 16:53:38.278243553,7572315,T,IEX,117.720000,12
2019-10-28 16:55:21.458803968,2019-10-28 16:55:21.458784172,7608427,T,IEX,117.720000,84
2019-10-28 16:55:57.546366976,2019-10-28 16:55:57.546347869,7620578,T,IEX,117.690000,100
2019-10-28 16:57:36.810166016,2019-10-28 16:57:36.810149467,7656585,T,IEX,117.690000,1
2019-10-28 16:57:36.815361024,2019-10-28 16:57:36.815340805,7656591,T,IEX,117.690000,3
2019-10-28 16:57:36.821697024,2019-10-28 16:57:36.821679800,7656597,T,IEX,117.690000,1
2019-10-28 16:57:47.498707968,2019-10-28 16:57:47.498691414,7660840,T,IEX,117.690000,1
2019-10-28 16:57:47.509296128,2019-10-28 16:57:47.509276596,7660856,T,IEX,117.690000,2
2019-10-28 16:58:38.813966080,2019-10-28 16:58:38.813946521,7678518,T,IEX,117.700000,100
2019-10-28 16:58:48.27985920,2019-10-28 16:58:48.27965645,7681797,T,IEX,117.700000,100
2019-10-28 16:59:24.453331968,2019-10-28 16:59:24.453310847,7696197,T,IEX,117.705000,2
2019-10-28 17:00:23.978747904,2019-10-28 17:00:23.978728833,7716695,T,IEX,117.705000,100
2019-10-28 17:00:24.811625984,2019-10-28 17:00:24.811602570,7716929,T,IEX,117.700000,39
2019-10-28 17:00:24.890475008,2019-10-28 17:00:24.890454186,7716949,T,IEX,117.700000,8
2019-10-28 17:00:24.913858048,2019-10-28 17:00:24.913836646,7716959,T,IEX,117.700000,32
2019-10-28 17:00:24.989606912,2019-10-28 17:00:24.989586460,7717007,T,IEX,117.700000,8
2019-10-28 17:00:25.77153024,2019-10-28 17:00:25.77134221,7717038,T,IEX,117.710000,100
2019-10-28 17:00:25.77454080,2019-10-28 17:00:25.77436678,7717042,T,IEX,117.710000,100
2019-10-28 17:00:25.77498880,2019-10-28 17:00:25.77481341,7717044,T,IEX,117.710000,8
2019-10-28 17:00:25.87869952,2019-10-28 17:00:25.87851558,7717066,T,IEX,117.720000,73
2019-10-28 17:00:25.87995904,2019-10-28 17:00:25.87979386,7717068,T,IEX,117.720000,3
2019-10-28 17:00:25.88015872,2019-10-28 17:00:25.87997902,7717069,T,IEX,117.720000,27
2019-10-28 17:00:51.298757888,2019-10-28 17:00:51.298725117,7725905,T,IEX,117.730000,100
2019-10-28 17:01:02.994172928,2019-10-28 17:01:02.994152085,7731092,T,IEX,117.725000,100
2019-10-28 17:01:04.773528064,2019-10-28 17:01:04.773507063,7731552,T,IEX,117.720000,43
2019-10-28 17:01:04.773825024,2019-10-28 17:01:04.773806678,7731554,T,IEX,117.720000,43
2019-10-28 17:01:05.582554112,2019-10-28 17:01:05.582534976,7731777,T,IEX,117.725000,100
2019-10-28 17:02:05.587874048,2019-10-28 17:02:05.587857014,7752366,T,IEX,117.790000,100
2019-10-28 17:03:39.466320896,2019-10-28 17:03:39.466296489,7784869,T,IEX,117.800000,100
2019-10-28 17:03:39.467581952,2019-10-28 17:03:39.467562652,7784870,T,IEX,117.800000,200
2019-10-28 17:03:39.467592960,2019-10-28 17:03:39.467575320,7784871,T,IEX,117.800000,100
2019-10-28 17:03:39.693295104,2019-10-28 17:03:39.693272687,7784981,T,IEX,117.800000,195
2019-10-28 17:04:50.6740992,2019-10-28 17:04:50.6723494,7808467,T,IEX,117.830000,3
2019-10-28 17:04:54.392651008,2019-10-28 17:04:54.392630826,7809979,T,IEX,117.855000,1300
2019-10-28 17:04:55.908155904,2019-10-28 17:04:55.908134384,7810493,T,IEX,117.850000,100
2019-10-28 17:04:55.909349888,2019-10-28 17:04:55.909332351,7810494,T,IEX,117.850000,68
2019-10-28 17:04:56.60139008,2019-10-28 17:04:56.60118018,7810543,T,IEX,117.850000,100
2019-10-28 17:04:56.61403904,2019-10-28 17:04:56.61385967,7810548,T,IEX,117.850000,100
2019-10-28 17:05:17.689616896,2019-10-28 17:05:17.689597285,7819456,T,IEX,117.840000,4
2019-10-28 17:05:17.926359040,2019-10-28 17:05:17.926339104,7819591,T,IEX,117.850000,100
2019-10-28 17:05:58.452310016,2019-10-28 17:05:58.452293983,7835117,T,IEX,117.860000,73
2019-10-28 17:05:58.453299968,2019-10-28 17:05:58.453279550,7835118,T,IEX,117.860000,27
2019-10-28 17:06:04.992990976,2019-10-28 17:06:04.992972276,7837130,T,IEX,117.900000,32
2019-10-28 17:06:04.993103872,2019-10-28 17:06:04.993085980,7837132,T,IEX,117.900000,68
2019-10-28 17:09:14.437292032,2019-10-28 17:09:14.437271795,7900050,T,IEX,117.930000,13
2019-10-28 17:09:14.437306112,2019-10-28 17:09:14.437289356,7900051,T,IEX,117.930000,5
2019-10-28 17:09:42.252768000,2019-10-28 17:09:42.252746576,7906928,T,IEX,117.950000,9
2019-10-28 17:13:01.372840960,2019-10-28 17:13:01.372822890,7976530,T,IEX,118.030000,100
2019-10-28 17:13:12.287067904,2019-10-28 17:13:12.287048082,7980507,T,IEX,118.030000,100
2019-10-28 17:13:12.287081984,2019-10-28 17:13:12.287065283,7980508,T,IEX,118.030000,100
2019-10-28 17:14:28.535444992,2019-10-28 17:14:28.535426350,8006436,T,IEX,118.060000,100
2019-10-28 17:14:28.536692992,2019-10-28 17:14:28.536675002,8006451,T,IEX,118.060000,100
2019-10-28 17:14:41.701647104,2019-10-28 17:14:41.701625410,8012990,T,IEX,118.010000,1100
2019-10-28 17:14:41.851059968,2019-10-28 17:14:41.851037409,8013072,T,IEX,118.010000,3000
2019-10-28 17:14:55.96944128,2019-10-28 17:14:55.96922777,8017920,T,IEX,118.010000,500
2019-10-28 17:15:03.672281088,2019-10-28 17:15:03.672264044,8020672,T,IEX,118.020000,500
2019-10-28 17:15:13.897210880,2019-10-28 17:15:13.897192089,8023513,T,IEX,118.060000,500
2019-10-28 17:15:22.929509888,2019-10-28 17:15:22.929488185,8026038,T,IEX,118.085000,500
2019-10-28 17:15:26.110710016,2019-10-28 17:15:26.110689269,8026771,T,IEX,118.090000,2900
2019-10-28 17:16:29.603949056,2019-10-28 17:16:29.603931304,8048931,T,IEX,118.120000,500
2019-10-28 17:16:39.539515904,2019-10-28 17:16:39.539497269,8053172,T,IEX,118.080000,500
2019-10-28 17:16:45.108706048,2019-10-28 17:16:45.108688784,8055049,T,IEX,118.130000,6858
2019-10-28 17:16:47.808562944,2019-10-28 17:16:47.808542406,8055735,T,IEX,118.130000,500
2019-10-28 17:17:17.314525952,2019-10-28 17:17:17.314504181,8065405,T,IEX,118.070000,900
2019-10-28 17:17:18.405825024,2019-10-28 17:17:18.405804791,8065620,T,IEX,118.070000,100
2019-10-28 17:17:25.674791936,2019-10-28 17:17:25.674772760,8067808,T,IEX,118.070000,500
2019-10-28 17:17:27.877666048,2019-10-28 17:17:27.877645372,8068349,T,IEX,118.080000,100
2019-10-28 17:17:37.417299968,2019-10-28 17:17:37.417282266,8071122,T,IEX,118.085000,500
2019-10-28 17:17:47.836040960,2019-10-28 17:17:47.836021986,8073479,T,IEX,118.110000,10
2019-10-28 17:17:50.421792000,2019-10-28 17:17:50.421773106,8074055,T,IEX,118.095000,500
2019-10-28 17:17:50.593809920,2019-10-28 17:17:50.593792888,8074084,T,IEX,118.095000,500
2019-10-28 17:17:54.505602048,2019-10-28 17:17:54.505581660,8075061,T,IEX,118.120000,3600
2019-10-28 17:17:56.84538112,2019-10-28 17:17:56.84518700,8075380,T,IEX,118.120000,8333
2019-10-28 17:17:57.626306048,2019-10-28 17:17:57.626286502,8076462,T,IEX,118.120000,1600
2019-10-28 17:18:32.237037056,2019-10-28 17:18:32.237017861,8092025,T,IEX,118.095000,100
2019-10-28 17:18:37.396732928,2019-10-28 17:18:37.396715363,8094081,T,IEX,118.140000,100
2019-10-28 17:18:39.76918016,2019-10-28 17:18:39.76901412,8094630,T,IEX,118.120000,100
2019-10-28 17:19:25.304902912,2019-10-28 17:19:25.304883420,8113163,T,IEX,118.115000,500
2019-10-28 17:20:11.34842880,2019-10-28 17:20:11.34819630,8128130,T,IEX,118.130000,28
2019-10-28 17:21:57.13817088,2019-10-28 17:21:57.13798366,8167279,T,IEX,118.060000,500
2019-10-28 17:22:07.860123904,2019-10-28 17:22:07.860104983,8170636,T,IEX,118.105000,8900
2019-10-28 17:22:14.46273024,2019-10-28 17:22:14.46256933,8172224,T,IEX,118.120000,600
2019-10-28 17:23:45.610778880,2019-10-28 17:23:45.610756875,8200799,T,IEX,118.075000,500
2019-10-28 17:23:46.927815936,2019-10-28 17:23:46.927795197,8201379,T,IEX,118.080000,30
2019-10-28 17:23:54.212892928,2019-10-28 17:23:54.212873461,8203097,T,IEX,118.100000,19
2019-10-28 17:23:54.212905984,2019-10-28 17:23:54.212889902,8203098,T,IEX,118.110000,100
2019-10-28 17:23:57.885701120,2019-10-28 17:23:57.885679071,8204773,T,IEX,118.130000,6376
2019-10-28 17:23:59.531645952,2019-10-28 17:23:59.531629004,8205600,T,IEX,118.130000,550
2019-10-28 17:25:17.750138112,2019-10-28 17:25:17.750118896,8231562,T,IEX,118.060000,500
2019-10-28 17:25:24.16354048,2019-10-28 17:25:24.16332633,8233841,T,IEX,118.070000,100
2019-10-28 17:25:31.118593024,2019-10-28 17:25:31.118571638,8236563,T,IEX,118.130000,6
2019-10-28 17:25:31.218964992,2019-10-28 17:25:31.218941825,8236579,T,IEX,118.145000,6710
2019-10-28 17:25:32.396666112,2019-10-28 17:25:32.396648636,8236902,T,IEX,118.145000,1332
2019-10-28 17:26:27.925434880,2019-10-28 17:26:27.925415165,8257797,T,IEX,118.155000,500
2019-10-28 17:27:19.566304000,2019-10-28 17:27:19.566286034,8273516,T,IEX,118.160000,6
2019-10-28 17:28:56.649270016,2019-10-28 17:28:56.649250952,8306113,T,IEX,118.170000,6
2019-10-28 17:28:59.642471936,2019-10-28 17:28:59.642454007,8307481,T,IEX,118.200000,20
2019-10-28 17:29:01.64495104,2019-10-28 17:29:01.64477473,8308059,T,IEX,118.215000,500
2019-10-28 17:29:02.770539008,2019-10-28 17:29:02.770519890,8308944,T,IEX,118.210000,74
2019-10-28 17:29:08.602518016,2019-10-28 17:29:08.602502228,8311442,T,IEX,118.235000,8500
2019-10-28 17:29:10.374781952,2019-10-28 17:29:10.374761611,8311805,T,IEX,118.235000,500
2019-10-28 17:29:32.439041024,2019-10-28 17:29:32.439023505,8318662,T,IEX,118.230000,100
2019-10-28 17:29:40.539520000,2019-10-28 17:29:40.539499494,8321350,T,IEX,118.230000,1
2019-10-28 17:30:51.723358976,2019-10-28 17:30:51.723340128,8343094,T,IEX,118.225000,600
2019-10-28 17:31:06.371591936,2019-10-28 17:31:06.371571031,8346865,T,IEX,118.220000,2
2019-10-28 17:31:06.371598080,2019-10-28 17:31:06.371580021,8346866,T,IEX,118.220000,48
2019-10-28 17:31:06.371617024,2019-10-28 17:31:06.371600369,8346867,T,IEX,118.220000,2
2019-10-28 17:31:06.554931968,2019-10-28 17:31:06.554911112,8346965,T,IEX,118.220000,12
2019-10-28 17:31:11.90413056,2019-10-28 17:31:11.90394137,8348558,T,IEX,118.210000,500
2019-10-28 17:31:15.834921984,2019-10-28 17:31:15.834901736,8350268,T,IEX,118.230000,100
2019-10-28 17:31:56.443380992,2019-10-28 17:31:56.443359453,8361034,T,IEX,118.260000,500
2019-10-28 17:32:34.137587968,2019-10-28 17:32:34.137569687,8373627,T,IEX,118.265000,100
2019-10-28 17:33:09.156472064,2019-10-28 17:33:09.156450178,8386297,T,IEX,118.280000,500
2019-10-28 17:34:08.552549888,2019-10-28 17:34:08.552532907,8403968,T,IEX,118.320000,500
2019-10-28 17:34:35.843064064,2019-10-28 17:34:35.843041731,8412543,T,IEX,118.355000,500
2019-10-28 17:34:40.808365056,2019-10-28 17:34:40.808345841,8415031,T,IEX,118.385000,8000
2019-10-28 17:35:20.387086080,2019-10-28 17:35:20.387065147,8430080,T,IEX,118.320000,2
2019-10-28 17:35:32.632027904,2019-10-28 17:35:32.632010366,8433331,T,IEX,118.375000,500
2019-10-28 17:35:36.361400064,2019-10-28 17:35:36.361383554,8434303,T,IEX,118.400000,6382
2019-10-28 17:35:36.574863872,2019-10-28 17:35:36.574842923,8434344,T,IEX,118.400000,1117
2019-10-28 17:36:11.106468096,2019-10-28 17:36:11.106452451,8447485,T,IEX,118.285000,500
2019-10-28 17:36:19.35276032,2019-10-28 17:36:19.35256530,8451093,T,IEX,118.310000,100
2019-10-28 17:36:22.687783936,2019-10-28 17:36:22.687764089,8452323,T,IEX,118.350000,48
2019-10-28 17:36:25.279787008,2019-10-28 17:36:25.279767695,8453407,T,IEX,118.360000,100
2019-10-28 17:36:26.666846976,2019-10-28 17:36:26.666829260,8453866,T,IEX,118.370000,1000
2019-10-28 17:36:26.698123008,2019-10-28 17:36:26.698104448,8453874,T,IEX,118.370000,9100
2019-10-28 17:36:28.497931008,2019-10-28 17:36:28.497910322,8454452,T,IEX,118.365000,1400
2019-10-28 17:36:28.679673088,2019-10-28 17:36:28.679652486,8454506,T,IEX,118.365000,500
2019-10-28 17:36:36.854972928,2019-10-28 17:36:36.854955278,8457414,T,IEX,118.370000,100
2019-10-28 17:36:46.644361984,2019-10-28 17:36:46.644344067,8459994,T,IEX,118.360000,100
2019-10-28 17:36:46.659708928,2019-10-28 17:36:46.659689214,8460005,T,IEX,118.370000,100
2019-10-28 17:36:52.413925120,2019-10-28 17:36:52.413904150,8462046,T,IEX,118.365000,100
2019-10-28 17:38:07.361485056,2019-10-28 17:38:07.361465802,8485772,T,IEX,118.340000,100
2019-10-28 17:38:29.979521024,2019-10-28 17:38:29.979503264,8493337,T,IEX,118.365000,500
2019-10-28 17:38:32.850823936,2019-10-28 17:38:32.850801964,8494057,T,IEX,118.370000,6
2019-10-28 17:38:37.396711936,2019-10-28 17:38:37.396692411,8495876,T,IEX,118.410000,500
2019-10-28 17:38:41.516628992,2019-10-28 17:38:41.516609699,8496952,T,IEX,118.410000,8774
2019-10-28 17:38:47.27575040,2019-10-28 17:38:47.27555307,8498483,T,IEX,118.415000,584
2019-10-28 17:38:51.148521984,2019-10-28 17:38:51.148501843,8499651,T,IEX,118.400000,100
2019-10-28 17:38:56.876253952,2019-10-28 17:38:56.876234189,8502201,T,IEX,118.400000,100
2019-10-28 17:38:57.552587008,2019-10-28 17:38:57.552569647,8502461,T,IEX,118.400000,500
2019-10-28 17:39:51.934501120,2019-10-28 17:39:51.934478870,8520610,T,IEX,118.400000,500
2019-10-28 17:40:03.255090944,2019-10-28 17:40:03.255072852,8524779,T,IEX,118.445000,600
2019-10-28 17:40:05.152003072,2019-10-28 17:40:05.151983041,8525256,T,IEX,118.460000,500
2019-10-28 17:40:06.525637888,2019-10-28 17:40:06.525618323,8525499,T,IEX,118.460000,500
2019-10-28 17:40:07.83522048,2019-10-28 17:40:07.83504405,8525665,T,IEX,118.475000,5
2019-10-28 17:40:09.59780096,2019-10-28 17:40:09.59762209,8526691,T,IEX,118.480000,6364
2019-10-28 17:40:09.793257984,2019-10-28 17:40:09.793240472,8527119,T,IEX,118.465000,556
2019-10-28 17:40:31.240698112,2019-10-28 17:40:31.240680253,8534490,T,IEX,118.460000,500
2019-10-28 17:40:32.347521024,2019-10-28 17:40:32.347501717,8534787,T,IEX,118.460000,500
2019-10-28 17:40:40.114832896,2019-10-28 17:40:40.114813115,8537150,T,IEX,118.460000,706
2019-10-28 17:40:40.115770112,2019-10-28 17:40:40.115750655,8537151,T,IEX,118.460000,10594
2019-10-28 17:40:41.388773120,2019-10-28 17:40:41.388755090,8537479,T,IEX,118.460000,500
2019-10-28 17:40:46.606993920,2019-10-28 17:40:46.606974472,8538747,T,IEX,118.460000,500
2019-10-28 17:40:52.471416064,2019-10-28 17:40:52.471400398,8540300,T,IEX,118.460000,100
2019-10-28 17:41:04.680157952,2019-10-28 17:41:04.680140881,8544002,T,IEX,118.460000,700
2019-10-28 17:41:20.185196032,2019-10-28 17:41:20.185180718,8548701,T,IEX,118.440000,2
2019-10-28 17:41:31.912574976,2019-10-28 17:41:31.912553224,8551449,T,IEX,118.445000,500
2019-10-28 17:41:41.189466112,2019-10-28 17:41:41.189450749,8553241,T,IEX,118.450000,100
2019-10-28 17:41:57.76334080,2019-10-28 17:41:57.76312099,8557838,T,IEX,118.430000,600
2019-10-28 17:42:06.41489920,2019-10-28 17:42:06.41468661,8560855,T,IEX,118.415000,500
2019-10-28 17:42:14.91782912,2019-10-28 17:42:14.91764155,8562809,T,IEX,118.440000,100
2019-10-28 17:42:18.355908096,2019-10-28 17:42:18.355888234,8563875,T,IEX,118.420000,500
2019-10-28 17:42:35.543216896,2019-10-28 17:42:35.543198707,8569148,T,IEX,118.420000,27
2019-10-28 17:42:43.795901952,2019-10-28 17:42:43.795883739,8571651,T,IEX,118.425000,25
2019-10-28 17:42:47.766955008,2019-10-28 17:42:47.766934068,8572494,T,IEX,118.425000,500
2019-10-28 17:43:03.556139008,2019-10-28 17:43:03.556118638,8576289,T,IEX,118.425000,500
2019-10-28 17:43:07.307545088,2019-10-28 17:43:07.307524344,8577150,T,IEX,118.440000,500
2019-10-28 17:43:07.307618048,2019-10-28 17:43:07.307601420,8577151,T,IEX,118.440000,500
2019-10-28 17:43:10.164161024,2019-10-28 17:43:10.164144792,8578281,T,IEX,118.440000,500
2019-10-28 17:43:10.754690048,2019-10-28 17:43:10.754669057,8578408,T,IEX,118.440000,500
2019-10-28 17:43:12.64236032,2019-10-28 17:43:12.64216875,8578829,T,IEX,118.440000,500
2019-10-28 17:43:38.68844032,2019-10-28 17:43:38.68826913,8587155,T,IEX,118.440000,500
2019-10-28 17:44:09.960568064,2019-10-28 17:44:09.960552522,8596514,T,IEX,118.430000,500
2019-10-28 17:44:10.207536128,2019-10-28 17:44:10.207518493,8596622,T,IEX,118.430000,100
2019-10-28 17:44:36.628185088,2019-10-28 17:44:36.628164185,8606381,T,IEX,118.445000,600
2019-10-28 17:44:37.744410112,2019-10-28 17:44:37.744390746,8606609,T,IEX,118.445000,100
2019-10-28 17:44:46.686656000,2019-10-28 17:44:46.686636928,8609851,T,IEX,118.435000,100
2019-10-28 17:45:03.233543936,2019-10-28 17:45:03.233522466,8615781,T,IEX,118.450000,100
2019-10-28 17:45:03.811476992,2019-10-28 17:45:03.811455277,8615941,T,IEX,118.440000,500
2019-10-28 17:45:19.963820032,2019-10-28 17:45:19.963801457,8621174,T,IEX,118.475000,916
2019-10-28 17:45:20.332578048,2019-10-28 17:45:20.332555737,8621293,T,IEX,118.475000,1000
2019-10-28 17:45:20.770966016,2019-10-28 17:45:20.770948228,8621427,T,IEX,118.475000,500
2019-10-28 17:45:22.324701952,2019-10-28 17:45:22.324683658,8622032,T,IEX,118.475000,500
2019-10-28 17:45:25.468762112,2019-10-28 17:45:25.468743854,8622810,T,IEX,118.500000,1000
2019-10-28 17:45:25.823632896,2019-10-28 17:45:25.823616295,8622902,T,IEX,118.500000,5
2019-10-28 17:45:26.358496000,2019-10-28 17:45:26.358476491,8622988,T,IEX,118.505000,600
2019-10-28 17:45:26.481585920,2019-10-28 17:45:26.481567639,8623015,T,IEX,118.505000,600
2019-10-28 17:45:28.834902016,2019-10-28 17:45:28.834882364,8623817,T,IEX,118.510000,5
2019-10-28 17:45:38.573862912,2019-10-28 17:45:38.573842428,8627299,T,IEX,118.505000,100
2019-10-28 17:45:52.38467072,2019-10-28 17:45:52.38450435,8630601,T,IEX,118.520000,500
2019-10-28 17:46:00.342866944,2019-10-28 17:46:00.342846582,8632616,T,IEX,118.520000,100
2019-10-28 17:46:00.566159872,2019-10-28 17:46:00.566138600,8632785,T,IEX,118.520000,50
2019-10-28 17:46:38.896512000,2019-10-28 17:46:38.896497352,8644478,T,IEX,118.525000,6
2019-10-28 17:46:46.501136896,2019-10-28 17:46:46.501117264,8647617,T,IEX,118.550000,500
2019-10-28 17:46:46.886821120,2019-10-28 17:46:46.886800633,8647725,T,IEX,118.550000,500
2019-10-28 17:46:48.190129920,2019-10-28 17:46:48.190109539,8648317,T,IEX,118.550000,510
2019-10-28 17:46:55.876203008,2019-10-28 17:46:55.876182043,8651387,T,IEX,118.590000,5
2019-10-28 17:46:57.753249024,2019-10-28 17:46:57.753229735,8652123,T,IEX,118.600000,3515
2019-10-28 17:46:58.965367040,2019-10-28 17:46:58.965220674,8652448,T,IEX,118.600000,700
2019-10-28 17:46:59.522488064,2019-10-28 17:46:59.522469894,8652543,T,IEX,118.600000,500
2019-10-28 17:47:02.3758080,2019-10-28 17:47:02.3740590,8653425,T,IEX,118.580000,100
2019-10-28 17:47:07.738974976,2019-10-28 17:47:07.738954696,8656253,T,IEX,118.580000,100
2019-10-28 17:47:07.739536896,2019-10-28 17:47:07.739521843,8656255,T,IEX,118.580000,100
2019-10-28 17:47:31.179535872,2019-10-28 17:47:31.179516282,8664920,T,IEX,118.570000,500
2019-10-28 17:47:32.677029888,2019-10-28 17:47:32.677010769,8665491,T,IEX,118.570000,6600
2019-10-28 17:47:47.487837952,2019-10-28 17:47:47.487818508,8670642,T,IEX,118.570000,500
2019-10-28 17:48:07.357209088,2019-10-28 17:48:07.357188350,8679007,T,IEX,118.605000,500
2019-10-28 17:48:12.674685952,2019-10-28 17:48:12.674670855,8680338,T,IEX,118.630000,4
2019-10-28 17:48:40.484794112,2019-10-28 17:48:40.484776630,8690615,T,IEX,118.610000,100
2019-10-28 17:49:00.614041088,2019-10-28 17:49:00.614023739,8697329,T,IEX,118.635000,500
2019-10-28 17:49:04.821860096,2019-10-28 17:49:04.821842012,8698967,T,IEX,118.650000,100
2019-10-28 17:49:04.965680896,2019-10-28 17:49:04.965659647,8699164,T,IEX,118.650000,511
2019-10-28 17:49:05.497357056,2019-10-28 17:49:05.497339334,8699406,T,IEX,118.650000,500
2019-10-28 17:49:09.659977984,2019-10-28 17:49:09.659959404,8701366,T,IEX,118.650000,100
2019-10-28 17:49:18.125637888,2019-10-28 17:49:18.125617859,8703816,T,IEX,118.650000,200
2019-10-28 17:49:27.22616064,2019-10-28 17:49:27.22597086,8706798,T,IEX,118.650000,500
2019-10-28 17:49:27.73904896,2019-10-28 17:49:27.73886634,8706833,T,IEX,118.650000,600
2019-10-28 17:49:27.188484096,2019-10-28 17:49:27.188463067,8706861,T,IEX,118.650000,500
2019-10-28 17:49:27.695405056,2019-10-28 17:49:27.695388817,8707030,T,IEX,118.650000,500
2019-10-28 17:49:28.478014976,2019-10-28 17:49:28.477995948,8707222,T,IEX,118.650000,800
2019-10-28 17:49:56.571884032,2019-10-28 17:49:56.571864921,8715922,T,IEX,118.630000,100
2019-10-28 17:49:58.373152000,2019-10-28 17:49:58.373131517,8716363,T,IEX,118.620000,500
2019-10-28 17:50:00.527249920,2019-10-28 17:50:00.527230837,8717288,T,IEX,118.650000,119
2019-10-28 17:50:00.527267072,2019-10-28 17:50:00.527250478,8717289,T,IEX,118.650000,81
2019-10-28 17:50:00.537561088,2019-10-28 17:50:00.537542282,8717292,T,IEX,118.650000,8
2019-10-28 17:50:00.537579008,2019-10-28 17:50:00.537561848,8717293,T,IEX,118.650000,121
2019-10-28 17:50:07.88818944,2019-10-28 17:50:07.88799844,8719078,T,IEX,118.665000,500
2019-10-28 17:50:11.14053120,2019-10-28 17:50:11.14035635,8720681,T,IEX,118.670000,1
2019-10-28 17:50:13.676664064,2019-10-28 17:50:13.676647726,8721520,T,IEX,118.680000,1
2019-10-28 17:50:15.66604032,2019-10-28 17:50:15.66587668,8721966,T,IEX,118.685000,5229
2019-10-28 17:50:15.188312064,2019-10-28 17:50:15.188291006,8721994,T,IEX,118.685000,700
2019-10-28 17:50:15.494260992,2019-10-28 17:50:15.494242824,8722108,T,IEX,118.685000,500
2019-10-28 17:50:16.295778048,2019-10-28 17:50:16.295757302,8722335,T,IEX,118.685000,600
2019-10-28 17:50:16.554230016,2019-10-28 17:50:16.554209751,8722372,T,IEX,118.685000,500
2019-10-28 17:50:17.156175872,2019-10-28 17:50:17.156154586,8722509,T,IEX,118.685000,500
2019-10-28 17:50:18.424781056,2019-10-28 17:50:18.424760776,8722782,T,IEX,118.670000,100
2019-10-28 17:50:18.616197888,2019-10-28 17:50:18.616178570,8722859,T,IEX,118.650000,5
2019-10-28 17:50:18.653270016,2019-10-28 17:50:18.653248206,8722869,T,IEX,118.650000,2
2019-10-28 17:50:21.387132928,2019-10-28 17:50:21.387113338,8723601,T,IEX,118.670000,1
2019-10-28 17:50:26.294816000,2019-10-28 17:50:26.294796162,8724801,T,IEX,118.665000,1
2019-10-28 17:50:26.294832896,2019-10-28 17:50:26.294817392,8724802,T,IEX,118.665000,100
2019-10-28 17:50:26.666233088,2019-10-28 17:50:26.666216465,8724886,T,IEX,118.670000,100
2019-10-28 17:50:30.340596992,2019-10-28 17:50:30.340578730,8725532,T,IEX,118.675000,1
2019-10-28 17:50:35.118017024,2019-10-28 17:50:35.117996549,8727175,T,IEX,118.680000,1
2019-10-28 17:50:53.324684032,2019-10-28 17:50:53.324661451,8731928,T,IEX,118.690000,1
2019-10-28 17:50:53.333517056,2019-10-28 17:50:53.333497324,8731936,T,IEX,118.690000,8
2019-10-28 17:50:53.414188032,2019-10-28 17:50:53.414166118,8731947,T,IEX,118.700000,91
2019-10-28 17:50:53.773623040,2019-10-28 17:50:53.773602886,8732083,T,IEX,118.690000,1
2019-10-28 17:50:55.697871872,2019-10-28 17:50:55.697850166,8732766,T,IEX,118.690000,1
2019-10-28 17:50:55.930522112,2019-10-28 17:50:55.930502933,8732865,T,IEX,118.700000,9
2019-10-28 17:51:03.210418944,2019-10-28 17:51:03.210399729,8736501,T,IEX,118.685000,500
2019-10-28 17:51:03.912569088,2019-10-28 17:51:03.912550572,8736713,T,IEX,118.685000,1
2019-10-28 17:51:03.953358080,2019-10-28 17:51:03.953342520,8736724,T,IEX,118.685000,6
2019-10-28 17:51:05.638963968,2019-10-28 17:51:05.638943728,8737338,T,IEX,118.695000,1
2019-10-28 17:51:18.987441920,2019-10-28 17:51:18.987420931,8742927,T,IEX,118.705000,502
2019-10-28 17:51:21.986801920,2019-10-28 17:51:21.986782501,8743785,T,IEX,118.705000,500
2019-10-28 17:51:32.389872128,2019-10-28 17:51:32.389852946,8746511,T,IEX,118.705000,1
2019-10-28 17:51:32.427335936,2019-10-28 17:51:32.427315959,8746518,T,IEX,118.705000,12
2019-10-28 17:51:37.258264064,2019-10-28 17:51:37.258246093,8747818,T,IEX,118.670000,1
2019-10-28 17:51:41.386131968,2019-10-28 17:51:41.386113093,8748627,T,IEX,118.680000,2
2019-10-28 17:51:42.721053952,2019-10-28 17:51:42.721029179,8748882,T,IEX,118.680000,500
2019-10-28 17:51:51.150245888,2019-10-28 17:51:51.150224758,8751397,T,IEX,118.700000,500
2019-10-28 17:51:51.913818880,2019-10-28 17:51:51.913801153,8751566,T,IEX,118.700000,500
2019-10-28 17:52:14.479282944,2019-10-28 17:52:14.479267493,8757182,T,IEX,118.680000,500
2019-10-28 17:52:17.535897088,2019-10-28 17:52:17.535876194,8757844,T,IEX,118.685000,500
2019-10-28 17:52:28.577331968,2019-10-28 17:52:28.577315141,8762680,T,IEX,118.620000,40
2019-10-28 17:52:33.611623936,2019-10-28 17:52:33.611603889,8764254,T,IEX,118.665000,500
2019-10-28 17:52:34.237456896,2019-10-28 17:52:34.237433569,8764357,T,IEX,118.665000,500
2019-10-28 17:52:47.914204928,2019-10-28 17:52:47.914185586,8768360,T,IEX,118.685000,500
2019-10-28 17:52:50.528430080,2019-10-28 17:52:50.528407520,8769038,T,IEX,118.680000,100
2019-10-28 17:52:50.530194944,2019-10-28 17:52:50.530175409,8769039,T,IEX,118.680000,100
2019-10-28 17:52:51.66714112,2019-10-28 17:52:51.66693530,8769200,T,IEX,118.680000,100
2019-10-28 17:52:51.68338944,2019-10-28 17:52:51.68318693,8769201,T,IEX,118.680000,100
2019-10-28 17:52:51.68456960,2019-10-28 17:52:51.68440411,8769202,T,IEX,118.680000,100
2019-10-28 17:52:52.130241024,2019-10-28 17:52:52.130224392,8769511,T,IEX,118.670000,500
2019-10-28 17:52:56.427442944,2019-10-28 17:52:56.427424044,8773323,T,IEX,118.700000,1369
2019-10-28 17:52:59.475099904,2019-10-28 17:52:59.475083143,8774686,T,IEX,118.560000,100
2019-10-28 17:53:02.700448000,2019-10-28 17:53:02.700426756,8775872,T,IEX,118.530000,16
2019-10-28 17:54:00.57227008,2019-10-28 17:54:00.57208673,8795115,T,IEX,118.590000,100
2019-10-28 17:54:01.630119936,2019-10-28 17:54:01.630103216,8795738,T,IEX,118.595000,100
2019-10-28 17:54:36.986458112,2019-10-28 17:54:36.986441052,8807934,T,IEX,118.600000,2
2019-10-28 17:54:36.986478080,2019-10-28 17:54:36.986460888,8807935,T,IEX,118.610000,98
2019-10-28 17:54:48.46649088,2019-10-28 17:54:48.46629224,8811921,T,IEX,118.610000,100
2019-10-28 17:54:51.119257088,2019-10-28 17:54:51.119236110,8812687,T,IEX,118.590000,100
2019-10-28 17:54:51.509216000,2019-10-28 17:54:51.509197814,8812772,T,IEX,118.590000,100
2019-10-28 17:55:04.801009920,2019-10-28 17:55:04.800989821,8817687,T,IEX,118.570000,100
2019-10-28 17:55:09.408952064,2019-10-28 17:55:09.408931344,8819336,T,IEX,118.580000,100
2019-10-28 17:55:14.872979968,2019-10-28 17:55:14.872959874,8820762,T,IEX,118.580000,100
2019-10-28 17:55:15.708591104,2019-10-28 17:55:15.708571146,8821075,T,IEX,118.575000,100
2019-10-28 17:55:21.675056896,2019-10-28 17:55:21.675037552,8822285,T,IEX,118.560000,100
2019-10-28 17:55:21.705682944,2019-10-28 17:55:21.705667348,8822292,T,IEX,118.565000,1
2019-10-28 17:56:09.443049984,2019-10-28 17:56:09.443029408,8836348,T,IEX,118.560000,1
2019-10-28 17:57:08.766401024,2019-10-28 17:57:08.766385369,8854946,T,IEX,118.540000,2
2019-10-28 17:57:43.348549888,2019-10-28 17:57:43.348529520,8864383,T,IEX,118.545000,35
2019-10-28 17:59:04.558883072,2019-10-28 17:59:04.558860238,8926132,T,IEX,118.540000,2
2019-10-28 17:59:33.658433024,2019-10-28 17:59:33.658413293,8945007,T,IEX,118.560000,100
2019-10-28 18:00:04.121158912,2019-10-28 18:00:04.121138297,8958972,T,IEX,118.560000,2
2019-10-28 18:00:18.863280128,2019-10-28 18:00:18.863262195,8965967,T,IEX,118.560000,1
2019-10-28 18:00:43.12288000,2019-10-28 18:00:43.12270560,8977197,T,IEX,118.560000,100
2019-10-28 18:02:08.491619072,2019-10-28 18:02:08.491597143,9016692,T,IEX,118.490000,100
2019-10-28 18:02:26.2096128,2019-10-28 18:02:26.2076754,9025206,T,IEX,118.510000,1
2019-10-28 18:02:42.359848960,2019-10-28 18:02:42.359830363,9031819,T,IEX,118.520000,100
2019-10-28 18:03:07.819527936,2019-10-28 18:03:07.819510847,9041159,T,IEX,118.510000,100
2019-10-28 18:03:58.161368064,2019-10-28 18:03:58.161347877,9063212,T,IEX,118.495000,300
2019-10-28 18:03:58.163418880,2019-10-28 18:03:58.163399563,9063214,T,IEX,118.495000,300
2019-10-28 18:03:58.165220096,2019-10-28 18:03:58.165199113,9063215,T,IEX,118.495000,300
2019-10-28 18:04:45.31726080,2019-10-28 18:04:45.31698795,9084672,T,IEX,118.490000,79
2019-10-28 18:05:43.54017024,2019-10-28 18:05:43.54000724,9109128,T,IEX,118.525000,100
2019-10-28 18:05:53.141207040,2019-10-28 18:05:53.141185151,9113402,T,IEX,118.510000,1
2019-10-28 18:06:45.799610880,2019-10-28 18:06:45.799592240,9132651,T,IEX,118.490000,13
2019-10-28 18:06:45.802748928,2019-10-28 18:06:45.802727224,9132653,T,IEX,118.490000,13
2019-10-28 18:06:45.807415040,2019-10-28 18:06:45.807393290,9132655,T,IEX,118.490000,11
2019-10-28 18:06:45.810478080,2019-10-28 18:06:45.810455290,9132658,T,IEX,118.490000,11
2019-10-28 18:06:45.813534976,2019-10-28 18:06:45.813514604,9132660,T,IEX,118.490000,11
2019-10-28 18:06:45.818237952,2019-10-28 18:06:45.818219481,9132663,T,IEX,118.490000,9
2019-10-28 18:06:45.821294080,2019-10-28 18:06:45.821272760,9132665,T,IEX,118.490000,9
2019-10-28 18:06:45.824357120,2019-10-28 18:06:45.824335027,9132671,T,IEX,118.490000,9
2019-10-28 18:06:45.828974080,2019-10-28 18:06:45.828954156,9132681,T,IEX,118.490000,7
2019-10-28 18:06:45.832034048,2019-10-28 18:06:45.832013436,9132685,T,IEX,118.490000,7
2019-10-28 18:07:03.689029120,2019-10-28 18:07:03.689012183,9138882,T,IEX,118.490000,100
2019-10-28 18:07:04.361897984,2019-10-28 18:07:04.361877512,9139031,T,IEX,118.490000,100
2019-10-28 18:07:23.82735104,2019-10-28 18:07:23.82713177,9145555,T,IEX,118.490000,100
2019-10-28 18:07:45.736647936,2019-10-28 18:07:45.736628943,9153006,T,IEX,118.490000,11
2019-10-28 18:07:45.740806912,2019-10-28 18:07:45.740789310,9153024,T,IEX,118.490000,9
2019-10-28 18:07:45.743883008,2019-10-28 18:07:45.743860571,9153030,T,IEX,118.490000,9
2019-10-28 18:07:52.726770944,2019-10-28 18:07:52.726748528,9155608,T,IEX,118.490000,92
2019-10-28 18:08:17.268744960,2019-10-28 18:08:17.268724564,9166174,T,IEX,118.460000,3
2019-10-28 18:08:17.268836096,2019-10-28 18:08:17.268818425,9166175,T,IEX,118.460000,63
2019-10-28 18:08:27.365146880,2019-10-28 18:08:27.365129690,9170079,T,IEX,118.470000,100
2019-10-28 18:08:27.740790016,2019-10-28 18:08:27.740769062,9170366,T,IEX,118.470000,50
2019-10-28 18:08:37.819630080,2019-10-28 18:08:37.819607570,9174000,T,IEX,118.460000,3
2019-10-28 18:08:37.819643904,2019-10-28 18:08:37.819626779,9174001,T,IEX,118.460000,22
2019-10-28 18:08:42.479654912,2019-10-28 18:08:42.479638496,9175708,T,IEX,118.460000,74
2019-10-28 18:09:12.894360064,2019-10-28 18:09:12.894340229,9186411,T,IEX,118.430000,63
2019-10-28 18:09:12.894400000,2019-10-28 18:09:12.894381701,9186414,T,IEX,118.430000,63
2019-10-28 18:09:12.894443008,2019-10-28 18:09:12.894424290,9186416,T,IEX,118.430000,374
2019-10-28 18:09:14.939288064,2019-10-28 18:09:14.939270888,9187555,T,IEX,118.440000,100
2019-10-28 18:09:17.616833024,2019-10-28 18:09:17.616815968,9188827,T,IEX,118.450000,100
2019-10-28 18:09:17.722629120,2019-10-28 18:09:17.722608398,9189191,T,IEX,118.460000,2
2019-10-28 18:10:40.446028032,2019-10-28 18:10:40.446005273,9218413,T,IEX,118.455000,100
2019-10-28 18:10:40.756669952,2019-10-28 18:10:40.756651646,9218523,T,IEX,118.450000,1
2019-10-28 18:10:40.756718080,2019-10-28 18:10:40.756700329,9218524,T,IEX,118.450000,1
2019-10-28 18:11:45.447545088,2019-10-28 18:11:45.447524320,9240342,T,IEX,118.445000,3
2019-10-28 18:13:22.980625920,2019-10-28 18:13:22.980606564,9273941,T,IEX,118.435000,100
2019-10-28 18:14:38.446102016,2019-10-28 18:14:38.446083084,9298040,T,IEX,118.455000,1
2019-10-28 18:14:38.446112000,2019-10-28 18:14:38.446093734,9298041,T,IEX,118.460000,3
2019-10-28 18:14:38.446123008,2019-10-28 18:14:38.446104112,9298042,T,IEX,118.460000,2
2019-10-28 18:14:38.446135040,2019-10-28 18:14:38.446117087,9298043,T,IEX,118.460000,94
2019-10-28 18:18:19.858902016,2019-10-28 18:18:19.858883727,9374226,T,IEX,118.395000,5
2019-10-28 18:18:53.707574016,2019-10-28 18:18:53.707555968,9385742,T,IEX,118.390000,200
2019-10-28 18:19:12.743035904,2019-10-28 18:19:12.743014053,9393329,T,IEX,118.395000,208
2019-10-28 18:19:13.857192960,2019-10-28 18:19:13.857172745,9393768,T,IEX,118.395000,200
2019-10-28 18:19:23.748979968,2019-10-28 18:19:23.748960084,9396253,T,IEX,118.405000,2
2019-10-28 18:20:30.16809984,2019-10-28 18:20:30.16788714,9420069,T,IEX,118.420000,100
2019-10-28 18:24:44.683952896,2019-10-28 18:24:44.683933795,9499537,T,IEX,118.410000,100
2019-10-28 18:26:16.34123008,2019-10-28 18:26:16.34107580,9532347,T,IEX,118.445000,100
2019-10-28 18:29:19.690721024,2019-10-28 18:29:19.690701949,9595967,T,IEX,118.375000,1
2019-10-28 18:29:20.949319936,2019-10-28 18:29:20.949302679,9596366,T,IEX,118.380000,50
2019-10-28 18:35:34.524302080,2019-10-28 18:35:34.524281851,9727665,T,IEX,118.315000,100
2019-10-28 18:35:34.524312064,2019-10-28 18:35:34.524294728,9727666,T,IEX,118.315000,400
2019-10-28 18:35:37.544399104,2019-10-28 18:35:37.544379036,9728619,T,IEX,118.320000,10
2019-10-28 18:35:43.768353024,2019-10-28 18:35:43.768332167,9730126,T,IEX,118.330000,100
2019-10-28 18:37:03.40203008,2019-10-28 18:37:03.40183331,9753918,T,IEX,118.350000,8
2019-10-28 18:42:11.342420992,2019-10-28 18:42:11.342404688,9854213,T,IEX,118.390000,41
2019-10-28 18:42:46.135345920,2019-10-28 18:42:46.135323928,9865312,T,IEX,118.400000,41
2019-10-28 18:42:50.32372992,2019-10-28 18:42:50.32352023,9866431,T,IEX,118.410000,100
2019-10-28 18:42:50.585614080,2019-10-28 18:42:50.585593409,9866725,T,IEX,118.420000,59
2019-10-28 18:44:10.977711104,2019-10-28 18:44:10.977690204,9893608,T,IEX,118.445000,100
2019-10-28 18:44:36.703793920,2019-10-28 18:44:36.703773318,9901968,T,IEX,118.440000,103
2019-10-28 18:44:57.687835904,2019-10-28 18:44:57.687816456,9909414,T,IEX,118.470000,100
2019-10-28 18:45:08.396258048,2019-10-28 18:45:08.396238289,9913757,T,IEX,118.450000,100
2019-10-28 18:46:20.557676032,2019-10-28 18:46:20.557655805,9941451,T,IEX,118.455000,114
2019-10-28 18:47:00.959481088,2019-10-28 18:47:00.959454379,9955472,T,IEX,118.450000,100
2019-10-28 18:49:15.423344896,2019-10-28 18:49:15.423326498,10005480,T,IEX,118.480000,30
2019-10-28 18:49:51.767496960,2019-10-28 18:49:51.767476648,10015798,T,IEX,118.470000,2
2019-10-28 18:50:07.587913984,2019-10-28 18:50:07.587893128,10020466,T,IEX,118.470000,103
2019-10-28 18:50:10.4908032,2019-10-28 18:50:10.4888620,10021050,T,IEX,118.470000,100
2019-10-28 18:50:47.723677952,2019-10-28 18:50:47.723658022,10032377,T,IEX,118.465000,200
2019-10-28 18:52:27.649448960,2019-10-28 18:52:27.649430338,10064776,T,IEX,118.485000,6
2019-10-28 18:52:27.649457920,2019-10-28 18:52:27.649439901,10064777,T,IEX,118.485000,3
2019-10-28 18:52:27.649477120,2019-10-28 18:52:27.649459943,10064778,T,IEX,118.485000,6
2019-10-28 18:52:27.649485056,2019-10-28 18:52:27.649469096,10064779,T,IEX,118.485000,1
2019-10-28 18:52:27.649506048,2019-10-28 18:52:27.649489173,10064780,T,IEX,118.485000,1
2019-10-28 18:52:27.649521920,2019-10-28 18:52:27.649506255,10064781,T,IEX,118.485000,3
2019-10-28 18:52:27.649549056,2019-10-28 18:52:27.649532635,10064782,T,IEX,118.485000,1
2019-10-28 18:53:24.715971072,2019-10-28 18:53:24.715948916,10083081,T,IEX,118.495000,100
2019-10-28 18:54:17.977620992,2019-10-28 18:54:17.977602725,10098937,T,IEX,118.480000,109
2019-10-28 18:54:17.977658112,2019-10-28 18:54:17.977641395,10098938,T,IEX,118.480000,100
2019-10-28 18:54:18.21942016,2019-10-28 18:54:18.21923457,10098979,T,IEX,118.480000,3
2019-10-28 18:54:48.271851008,2019-10-28 18:54:48.271828758,10111018,T,IEX,118.500000,110
2019-10-28 18:54:48.327822080,2019-10-28 18:54:48.327802732,10111038,T,IEX,118.510000,100
2019-10-28 18:57:03.161413120,2019-10-28 18:57:03.161392981,10166172,T,IEX,118.550000,140
2019-10-28 18:57:11.805848064,2019-10-28 18:57:11.805827473,10169713,T,IEX,118.535000,100
2019-10-28 18:59:34.473689088,2019-10-28 18:59:34.473667242,10223508,T,IEX,118.595000,1
2019-10-28 18:59:42.894066944,2019-10-28 18:59:42.894046441,10227134,T,IEX,118.600000,8
2019-10-28 19:03:36.59984896,2019-10-28 19:03:36.59964269,10320646,T,IEX,118.525000,2
2019-10-28 19:03:36.60001024,2019-10-28 19:03:36.59984361,10320647,T,IEX,118.525000,1
2019-10-28 19:03:37.404904960,2019-10-28 19:03:37.404885495,10321012,T,IEX,118.525000,2
2019-10-28 19:05:04.108217088,2019-10-28 19:05:04.108200515,10351285,T,IEX,118.540000,10
2019-10-28 19:07:00.665810944,2019-10-28 19:07:00.665793431,10387662,T,IEX,118.540000,29
2019-10-28 19:07:10.8482048,2019-10-28 19:07:10.8465730,10390700,T,IEX,118.535000,3
2019-10-28 19:07:10.8502016,2019-10-28 19:07:10.8485490,10390701,T,IEX,118.535000,71
2019-10-28 19:08:49.719943936,2019-10-28 19:08:49.719925507,10428184,T,IEX,118.520000,16691
2019-10-28 19:09:59.230142976,2019-10-28 19:09:59.230121443,10447604,T,IEX,118.480000,100
2019-10-28 19:10:22.232641024,2019-10-28 19:10:22.232621465,10454763,T,IEX,118.475000,100
2019-10-28 19:10:22.233596928,2019-10-28 19:10:22.233577840,10454764,T,IEX,118.475000,155
2019-10-28 19:11:47.670554112,2019-10-28 19:11:47.670534981,10486174,T,IEX,118.540000,1
2019-10-28 19:13:20.701914112,2019-10-28 19:13:20.701894896,10521510,T,IEX,118.550000,3
2019-10-28 19:14:00.486089984,2019-10-28 19:14:00.486070129,10537393,T,IEX,118.555000,100
2019-10-28 19:14:53.833096960,2019-10-28 19:14:53.833075900,10556197,T,IEX,118.555000,10436
2019-10-28 19:14:58.120706048,2019-10-28 19:14:58.120684869,10558527,T,IEX,118.555000,100
2019-10-28 19:14:58.127908096,2019-10-28 19:14:58.127888971,10558529,T,IEX,118.560000,97
2019-10-28 19:15:46.403638016,2019-10-28 19:15:46.403621755,10573957,T,IEX,118.545000,10436
2019-10-28 19:15:57.266767872,2019-10-28 19:15:57.266749409,10578212,T,IEX,118.530000,100
2019-10-28 19:16:24.244246016,2019-10-28 19:16:24.244223911,10590820,T,IEX,118.520000,100
2019-10-28 19:16:32.190413056,2019-10-28 19:16:32.190392394,10593042,T,IEX,118.515000,100
2019-10-28 19:16:49.170426880,2019-10-28 19:16:49.170407742,10598498,T,IEX,118.515000,100
2019-10-28 19:18:14.70568960,2019-10-28 19:18:14.70549878,10627592,T,IEX,118.500000,100
2019-10-28 19:19:44.916060928,2019-10-28 19:19:44.916043865,10657995,T,IEX,118.530000,100
2019-10-28 19:20:02.765268992,2019-10-28 19:20:02.765247594,10664852,T,IEX,118.535000,5
2019-10-28 19:21:32.176378880,2019-10-28 19:21:32.176352280,10697529,T,IEX,118.530000,100
2019-10-28 19:24:15.149683968,2019-10-28 19:24:15.149663669,10756078,T,IEX,118.585000,100
2019-10-28 19:24:20.27371008,2019-10-28 19:24:20.27350375,10757993,T,IEX,118.580000,27
2019-10-28 19:24:20.27714048,2019-10-28 19:24:20.27696477,10757995,T,IEX,118.580000,100
2019-10-28 19:24:20.27888128,2019-10-28 19:24:20.27871351,10757997,T,IEX,118.580000,100
2019-10-28 19:24:20.27904000,2019-10-28 19:24:20.27887061,10757998,T,IEX,118.580000,13
2019-10-28 19:26:46.161936896,2019-10-28 19:26:46.161918281,10813258,T,IEX,118.550000,100
2019-10-28 19:27:47.742963968,2019-10-28 19:27:47.742945662,10832849,T,IEX,118.545000,100
2019-10-28 19:28:28.748088064,2019-10-28 19:28:28.748066055,10850265,T,IEX,118.540000,8
2019-10-28 19:28:31.679923968,2019-10-28 19:28:31.679904150,10851135,T,IEX,118.540000,85
2019-10-28 19:29:28.240449024,2019-10-28 19:29:28.240431478,10869994,T,IEX,118.600000,100
2019-10-28 19:29:55.316187904,2019-10-28 19:29:55.316168045,10878598,T,IEX,118.615000,3
2019-10-28 19:29:55.316199936,2019-10-28 19:29:55.316183993,10878599,T,IEX,118.615000,97
2019-10-28 19:29:55.318019072,2019-10-28 19:29:55.317998523,10878600,T,IEX,118.615000,3
2019-10-28 19:29:57.772751872,2019-10-28 19:29:57.772731208,10879428,T,IEX,118.615000,100
2019-10-28 19:30:18.389209088,2019-10-28 19:30:18.389187989,10892439,T,IEX,118.640000,100
2019-10-28 19:30:21.224912896,2019-10-28 19:30:21.224894058,10893346,T,IEX,118.635000,200
2019-10-28 19:30:46.208944128,2019-10-28 19:30:46.208923714,10903157,T,IEX,118.660000,100
2019-10-28 19:31:46.831686912,2019-10-28 19:31:46.831666235,10926560,T,IEX,118.685000,100
2019-10-28 19:32:13.186082048,2019-10-28 19:32:13.186064131,10937333,T,IEX,118.695000,100
2019-10-28 19:32:21.235085056,2019-10-28 19:32:21.235064390,10940726,T,IEX,118.700000,100
2019-10-28 19:32:27.73782016,2019-10-28 19:32:27.73764494,10942554,T,IEX,118.715000,100
2019-10-28 19:32:36.223382016,2019-10-28 19:32:36.223366545,10947443,T,IEX,118.700000,2
2019-10-28 19:33:02.77370112,2019-10-28 19:33:02.77351016,10958452,T,IEX,118.685000,100
2019-10-28 19:34:23.497033984,2019-10-28 19:34:23.497013903,10991604,T,IEX,118.685000,1
2019-10-28 19:34:31.276925952,2019-10-28 19:34:31.276908176,10994414,T,IEX,118.680000,6
2019-10-28 19:34:53.934182912,2019-10-28 19:34:53.934165837,11002814,T,IEX,118.670000,100
2019-10-28 19:34:56.42808064,2019-10-28 19:34:56.42787958,11003932,T,IEX,118.660000,100
2019-10-28 19:35:00.765178880,2019-10-28 19:35:00.765162220,11006162,T,IEX,118.650000,40
2019-10-28 19:35:04.824136960,2019-10-28 19:35:04.824119537,11009584,T,IEX,118.650000,10
2019-10-28 19:35:55.467140096,2019-10-28 19:35:55.467118073,11033069,T,IEX,118.690000,100
2019-10-28 19:35:56.831539968,2019-10-28 19:35:56.831524391,11033684,T,IEX,118.690000,100
2019-10-28 19:36:15.219602944,2019-10-28 19:36:15.219586097,11042492,T,IEX,118.680000,100
2019-10-28 19:36:15.219703040,2019-10-28 19:36:15.219684941,11042495,T,IEX,118.680000,4
2019-10-28 19:36:15.219717120,2019-10-28 19:36:15.219699702,11042496,T,IEX,118.680000,38
2019-10-28 19:36:29.950311936,2019-10-28 19:36:29.950292224,11047609,T,IEX,118.685000,100
2019-10-28 19:37:08.551590912,2019-10-28 19:37:08.551571335,11065678,T,IEX,118.675000,100
2019-10-28 19:38:59.248281088,2019-10-28 19:38:59.248258365,11117072,T,IEX,118.660000,100
2019-10-28 19:38:59.249010944,2019-10-28 19:38:59.248994089,11117075,T,IEX,118.655000,100
2019-10-28 19:40:10.558287872,2019-10-28 19:40:10.558267421,11153513,T,IEX,118.655000,100
2019-10-28 19:40:28.588722944,2019-10-28 19:40:28.588701205,11163730,T,IEX,118.655000,100
2019-10-28 19:40:33.627162112,2019-10-28 19:40:33.627143071,11166334,T,IEX,118.650000,100
2019-10-28 19:40:33.628805120,2019-10-28 19:40:33.628787547,11166357,T,IEX,118.650000,100
2019-10-28 19:40:38.527520000,2019-10-28 19:40:38.527500670,11168563,T,IEX,118.650000,100
2019-10-28 19:40:42.242362880,2019-10-28 19:40:42.242343279,11170070,T,IEX,118.640000,6
2019-10-28 19:40:42.904997888,2019-10-28 19:40:42.904977163,11170397,T,IEX,118.630000,19
2019-10-28 19:40:42.905006080,2019-10-28 19:40:42.904988157,11170398,T,IEX,118.630000,3
2019-10-28 19:40:42.905071104,2019-10-28 19:40:42.905052305,11170399,T,IEX,118.630000,200
2019-10-28 19:40:42.906883072,2019-10-28 19:40:42.906864118,11170410,T,IEX,118.625000,100
2019-10-28 19:40:44.820320000,2019-10-28 19:40:44.820297256,11171343,T,IEX,118.625000,188
2019-10-28 19:40:44.822086912,2019-10-28 19:40:44.822066314,11171346,T,IEX,118.625000,186
2019-10-28 19:40:45.807184896,2019-10-28 19:40:45.807165705,11171881,T,IEX,118.625000,100
2019-10-28 19:40:48.807081984,2019-10-28 19:40:48.807061581,11173311,T,IEX,118.625000,100
2019-10-28 19:40:51.885019904,2019-10-28 19:40:51.885001916,11174605,T,IEX,118.620000,3
2019-10-28 19:40:54.332992000,2019-10-28 19:40:54.332971730,11175558,T,IEX,118.620000,197
2019-10-28 19:40:58.807237888,2019-10-28 19:40:58.807216510,11177651,T,IEX,118.625000,100
2019-10-28 19:41:04.633846016,2019-10-28 19:41:04.633829010,11181045,T,IEX,118.625000,100
2019-10-28 19:42:00.770829056,2019-10-28 19:42:00.770804105,11205627,T,IEX,118.610000,1
2019-10-28 19:42:29.13300992,2019-10-28 19:42:29.13284973,11219362,T,IEX,118.585000,100
2019-10-28 19:43:26.659204096,2019-10-28 19:43:26.659185312,11247103,T,IEX,118.610000,100
2019-10-28 19:43:26.818354944,2019-10-28 19:43:26.818337735,11247341,T,IEX,118.605000,100
2019-10-28 19:44:08.259683072,2019-10-28 19:44:08.259662794,11268795,T,IEX,118.600000,41
2019-10-28 19:45:02.148090880,2019-10-28 19:45:02.148071276,11296855,T,IEX,118.635000,100
2019-10-28 19:45:02.149231104,2019-10-28 19:45:02.149211943,11296856,T,IEX,118.635000,100
2019-10-28 19:45:05.297396992,2019-10-28 19:45:05.297375436,11300282,T,IEX,118.635000,100
2019-10-28 19:45:05.297413120,2019-10-28 19:45:05.297395213,11300283,T,IEX,118.635000,100
2019-10-28 19:45:09.573550080,2019-10-28 19:45:09.573531407,11303780,T,IEX,118.620000,100
2019-10-28 19:45:09.666033920,2019-10-28 19:45:09.666016615,11303898,T,IEX,118.610000,100
2019-10-28 19:45:31.211948032,2019-10-28 19:45:31.211927447,11323923,T,IEX,118.575000,100
2019-10-28 19:46:06.674947072,2019-10-28 19:46:06.674927442,11348173,T,IEX,118.560000,100
2019-10-28 19:46:06.675077120,2019-10-28 19:46:06.675056012,11348177,T,IEX,118.560000,1
2019-10-28 19:46:08.929456896,2019-10-28 19:46:08.929437957,11350491,T,IEX,118.550000,100
2019-10-28 19:46:09.756564992,2019-10-28 19:46:09.756549749,11352285,T,IEX,118.495000,100
2019-10-28 19:46:19.695433984,2019-10-28 19:46:19.695414051,11360024,T,IEX,118.480000,100
2019-10-28 19:47:05.85971968,2019-10-28 19:47:05.85952188,11390480,T,IEX,118.490000,389
2019-10-28 19:47:05.98227968,2019-10-28 19:47:05.98212157,11390494,T,IEX,118.490000,300
2019-10-28 19:47:06.101373952,2019-10-28 19:47:06.101352683,11390938,T,IEX,118.490000,400
2019-10-28 19:47:06.220463104,2019-10-28 19:47:06.220440364,11390981,T,IEX,118.490000,300
2019-10-28 19:47:08.56914944,2019-10-28 19:47:08.56894362,11392364,T,IEX,118.490000,300
2019-10-28 19:47:14.498308096,2019-10-28 19:47:14.498288005,11395880,T,IEX,118.490000,300
2019-10-28 19:47:24.559678976,2019-10-28 19:47:24.559663481,11401146,T,IEX,118.500000,41
2019-10-28 19:47:25.729309952,2019-10-28 19:47:25.729295213,11401699,T,IEX,118.495000,100
2019-10-28 19:47:25.736765952,2019-10-28 19:47:25.736744803,11401701,T,IEX,118.495000,100
2019-10-28 19:47:27.484013056,2019-10-28 19:47:27.483991409,11402483,T,IEX,118.495000,500
2019-10-28 19:47:28.836300032,2019-10-28 19:47:28.836280250,11403221,T,IEX,118.495000,100
2019-10-28 19:47:30.181145088,2019-10-28 19:47:30.181128100,11404092,T,IEX,118.490000,5
2019-10-28 19:47:32.414087936,2019-10-28 19:47:32.414069499,11405330,T,IEX,118.485000,503
2019-10-28 19:47:41.10542080,2019-10-28 19:47:41.10524388,11409155,T,IEX,118.485000,100
2019-10-28 19:47:44.551234048,2019-10-28 19:47:44.551213432,11410667,T,IEX,118.485000,300
2019-10-28 19:47:53.911643904,2019-10-28 19:47:53.911622857,11414791,T,IEX,118.485000,700
2019-10-28 19:47:54.98678016,2019-10-28 19:47:54.98655971,11414917,T,IEX,118.485000,1900
2019-10-28 19:47:58.42202112,2019-10-28 19:47:58.42184479,11417499,T,IEX,118.475000,300
2019-10-28 19:48:02.558156032,2019-10-28 19:48:02.558133691,11420626,T,IEX,118.465000,300
2019-10-28 19:48:20.904139008,2019-10-28 19:48:20.904121219,11432335,T,IEX,118.440000,100
2019-10-28 19:48:39.192870912,2019-10-28 19:48:39.192850445,11443461,T,IEX,118.435000,300
2019-10-28 19:48:43.441518080,2019-10-28 19:48:43.441501443,11445662,T,IEX,118.435000,300
2019-10-28 19:48:51.650792960,2019-10-28 19:48:51.650769947,11452063,T,IEX,118.450000,100
2019-10-28 19:48:51.658710016,2019-10-28 19:48:51.658690723,11452068,T,IEX,118.455000,100
2019-10-28 19:49:08.808001024,2019-10-28 19:49:08.807982502,11463621,T,IEX,118.445000,300
2019-10-28 19:49:18.551712000,2019-10-28 19:49:18.551695188,11468876,T,IEX,118.445000,1
2019-10-28 19:49:20.416079872,2019-10-28 19:49:20.416062844,11469739,T,IEX,118.440000,100
2019-10-28 19:49:30.359055104,2019-10-28 19:49:30.359034636,11475896,T,IEX,118.440000,3
2019-10-28 19:49:38.563589888,2019-10-28 19:49:38.563569746,11481356,T,IEX,118.445000,100
2019-10-28 19:49:51.987385088,2019-10-28 19:49:51.987368896,11490037,T,IEX,118.455000,2
2019-10-28 19:49:52.196064000,2019-10-28 19:49:52.196043192,11490373,T,IEX,118.460000,100
2019-10-28 19:49:52.196101888,2019-10-28 19:49:52.196078489,11490376,T,IEX,118.460000,100
2019-10-28 19:49:57.534479104,2019-10-28 19:49:57.534457381,11494394,T,IEX,118.455000,1
2019-10-28 19:50:00.373136896,2019-10-28 19:50:00.373119423,11497759,T,IEX,118.455000,1
2019-10-28 19:50:00.399244032,2019-10-28 19:50:00.399226128,11497802,T,IEX,118.480000,4
2019-10-28 19:50:00.536948992,2019-10-28 19:50:00.536930979,11498559,T,IEX,118.470000,1
2019-10-28 19:50:02.330196992,2019-10-28 19:50:02.330179709,11503203,T,IEX,118.510000,1
2019-10-28 19:50:02.337807872,2019-10-28 19:50:02.337789994,11503236,T,IEX,118.510000,3
2019-10-28 19:50:03.450884096,2019-10-28 19:50:03.450862341,11504627,T,IEX,118.515000,1
2019-10-28 19:50:07.291180032,2019-10-28 19:50:07.291161414,11508805,T,IEX,118.515000,100
2019-10-28 19:50:20.468990976,2019-10-28 19:50:20.468972206,11520769,T,IEX,118.525000,100
2019-10-28 19:50:43.871631104,2019-10-28 19:50:43.871610528,11536575,T,IEX,118.520000,10
2019-10-28 19:50:43.871649024,2019-10-28 19:50:43.871624894,11536577,T,IEX,118.520000,21
2019-10-28 19:50:51.736379904,2019-10-28 19:50:51.736359791,11543690,T,IEX,118.530000,100
2019-10-28 19:50:53.553934080,2019-10-28 19:50:53.553917141,11545131,T,IEX,118.530000,100
2019-10-28 19:51:24.654205952,2019-10-28 19:51:24.654184976,11567882,T,IEX,118.550000,4
2019-10-28 19:51:34.335279104,2019-10-28 19:51:34.335258851,11573762,T,IEX,118.545000,100
2019-10-28 19:51:34.345672960,2019-10-28 19:51:34.345651999,11573773,T,IEX,118.545000,200
2019-10-28 19:51:54.167676928,2019-10-28 19:51:54.167656894,11587452,T,IEX,118.545000,100
2019-10-28 19:51:58.177044992,2019-10-28 19:51:58.177027401,11590268,T,IEX,118.550000,3
2019-10-28 19:51:58.181616896,2019-10-28 19:51:58.181597732,11590292,T,IEX,118.550000,4
2019-10-28 19:51:58.183024128,2019-10-28 19:51:58.183007636,11590298,T,IEX,118.550000,10
2019-10-28 19:51:58.183045120,2019-10-28 19:51:58.183027660,11590299,T,IEX,118.550000,31
2019-10-28 19:51:58.183386112,2019-10-28 19:51:58.183368996,11590300,T,IEX,118.550000,41
2019-10-28 19:52:01.927302912,2019-10-28 19:52:01.927282217,11593350,T,IEX,118.575000,4
2019-10-28 19:52:01.927319040,2019-10-28 19:52:01.927302523,11593351,T,IEX,118.575000,4
2019-10-28 19:52:11.513712128,2019-10-28 19:52:11.513691124,11601729,T,IEX,118.560000,100
2019-10-28 19:52:13.589359104,2019-10-28 19:52:13.589337398,11603221,T,IEX,118.560000,100
2019-10-28 19:52:29.531892992,2019-10-28 19:52:29.531873361,11613632,T,IEX,118.560000,200
2019-10-28 19:52:35.679614976,2019-10-28 19:52:35.679594934,11617404,T,IEX,118.560000,100
2019-10-28 19:52:35.679624960,2019-10-28 19:52:35.679607926,11617405,T,IEX,118.560000,100
2019-10-28 19:52:38.508508928,2019-10-28 19:52:38.508488772,11618936,T,IEX,118.560000,200
2019-10-28 19:52:43.714752000,2019-10-28 19:52:43.714734353,11622086,T,IEX,118.560000,100
2019-10-28 19:52:49.109593088,2019-10-28 19:52:49.109575700,11625793,T,IEX,118.560000,200
2019-10-28 19:52:54.728982016,2019-10-28 19:52:54.728960110,11629204,T,IEX,118.565000,100
2019-10-28 19:52:59.427457024,2019-10-28 19:52:59.427434215,11633105,T,IEX,118.565000,100
2019-10-28 19:53:07.130103040,2019-10-28 19:53:07.130082365,11639428,T,IEX,118.565000,200
2019-10-28 19:53:12.839479040,2019-10-28 19:53:12.839453245,11643411,T,IEX,118.555000,2
2019-10-28 19:53:12.850903040,2019-10-28 19:53:12.850882764,11643416,T,IEX,118.550000,2
2019-10-28 19:53:12.850919936,2019-10-28 19:53:12.850902852,11643417,T,IEX,118.550000,22
2019-10-28 19:53:18.53977088,2019-10-28 19:53:18.53956261,11647462,T,IEX,118.555000,100
2019-10-28 19:53:18.971255040,2019-10-28 19:53:18.971233896,11648214,T,IEX,118.555000,100
2019-10-28 19:53:19.75224064,2019-10-28 19:53:19.75206391,11648283,T,IEX,118.555000,55
2019-10-28 19:53:20.973602048,2019-10-28 19:53:20.973580799,11649498,T,IEX,118.565000,45
2019-10-28 19:53:38.795152896,2019-10-28 19:53:38.795135227,11663613,T,IEX,118.560000,5
2019-10-28 19:53:58.711087104,2019-10-28 19:53:58.711068945,11679054,T,IEX,118.600000,4
2019-10-28 19:54:06.685752064,2019-10-28 19:54:06.685732363,11686903,T,IEX,118.620000,100
2019-10-28 19:54:06.685768960,2019-10-28 19:54:06.685752190,11686904,T,IEX,118.620000,200
2019-10-28 19:54:06.693697024,2019-10-28 19:54:06.693677995,11686911,T,IEX,118.620000,100
2019-10-28 19:54:20.662458880,2019-10-28 19:54:20.662439199,11699223,T,IEX,118.615000,100
2019-10-28 19:54:29.668395008,2019-10-28 19:54:29.668375223,11706118,T,IEX,118.600000,100
2019-10-28 19:54:40.692108032,2019-10-28 19:54:40.692091727,11714919,T,IEX,118.575000,100
2019-10-28 19:54:40.692135936,2019-10-28 19:54:40.692118224,11714920,T,IEX,118.575000,100
2019-10-28 19:55:00.117870080,2019-10-28 19:55:00.117850439,11734920,T,IEX,118.580000,5
2019-10-28 19:55:00.153884928,2019-10-28 19:55:00.153866923,11735392,T,IEX,118.585000,100
2019-10-28 19:55:03.833774080,2019-10-28 19:55:03.833754873,11743995,T,IEX,118.595000,50
2019-10-28 19:55:03.851979008,2019-10-28 19:55:03.851959900,11744013,T,IEX,118.600000,1
2019-10-28 19:55:03.851995904,2019-10-28 19:55:03.851978138,11744014,T,IEX,118.600000,9
2019-10-28 19:55:08.112306944,2019-10-28 19:55:08.112290135,11751600,T,IEX,118.565000,100
2019-10-28 19:55:17.181612032,2019-10-28 19:55:17.181593413,11764266,T,IEX,118.580000,2
2019-10-28 19:55:18.366366976,2019-10-28 19:55:18.366345323,11765574,T,IEX,118.590000,100
2019-10-28 19:55:18.366382080,2019-10-28 19:55:18.366365188,11765575,T,IEX,118.590000,100
2019-10-28 19:55:20.816237056,2019-10-28 19:55:20.816218083,11767805,T,IEX,118.585000,100
2019-10-28 19:55:27.100942080,2019-10-28 19:55:27.100924829,11773154,T,IEX,118.550000,100
2019-10-28 19:55:27.100961024,2019-10-28 19:55:27.100944260,11773155,T,IEX,118.550000,100
2019-10-28 19:55:30.981731072,2019-10-28 19:55:30.981711355,11776594,T,IEX,118.535000,100
2019-10-28 19:55:34.396464128,2019-10-28 19:55:34.396446019,11780692,T,IEX,118.520000,1
2019-10-28 19:55:42.936368896,2019-10-28 19:55:42.936350335,11789127,T,IEX,118.515000,100
2019-10-28 19:55:43.365731072,2019-10-28 19:55:43.365710466,11789524,T,IEX,118.515000,3
2019-10-28 19:55:57.443213056,2019-10-28 19:55:57.443193257,11803771,T,IEX,118.540000,4
2019-10-28 19:56:03.557787904,2019-10-28 19:56:03.557768343,11810688,T,IEX,118.550000,100
2019-10-28 19:56:08.818766080,2019-10-28 19:56:08.818746624,11815582,T,IEX,118.545000,100
2019-10-28 19:56:19.820200960,2019-10-28 19:56:19.820183010,11827165,T,IEX,118.560000,100
2019-10-28 19:56:22.410874880,2019-10-28 19:56:22.410858609,11829855,T,IEX,118.560000,100
2019-10-28 19:56:23.822588928,2019-10-28 19:56:23.822570790,11830862,T,IEX,118.565000,100
2019-10-28 19:56:34.62947072,2019-10-28 19:56:34.62925714,11840100,T,IEX,118.550000,2
2019-10-28 19:56:34.63006976,2019-10-28 19:56:34.62990297,11840101,T,IEX,118.545000,100
2019-10-28 19:56:39.970636032,2019-10-28 19:56:39.970620120,11845522,T,IEX,118.530000,19
2019-10-28 19:57:00.50176000,2019-10-28 19:57:00.50154934,11865103,T,IEX,118.535000,100
2019-10-28 19:57:05.880343040,2019-10-28 19:57:05.880324001,11872312,T,IEX,118.535000,100
2019-10-28 19:57:07.815766016,2019-10-28 19:57:07.815748715,11874458,T,IEX,118.535000,100
2019-10-28 19:57:08.47159040,2019-10-28 19:57:08.47141340,11874804,T,IEX,118.540000,100
2019-10-28 19:57:16.258529024,2019-10-28 19:57:16.258512937,11883012,T,IEX,118.535000,100
2019-10-28 19:57:27.465355008,2019-10-28 19:57:27.465332622,11894443,T,IEX,118.535000,100
2019-10-28 19:57:32.48816896,2019-10-28 19:57:32.48799215,11900589,T,IEX,118.540000,100
2019-10-28 19:57:36.453550080,2019-10-28 19:57:36.453527757,11906727,T,IEX,118.540000,100
2019-10-28 19:57:37.169672960,2019-10-28 19:57:37.169651317,11907514,T,IEX,118.540000,100
2019-10-28 19:57:40.598772992,2019-10-28 19:57:40.598751144,11911040,T,IEX,118.530000,4
2019-10-28 19:57:40.598778880,2019-10-28 19:57:40.598759993,11911041,T,IEX,118.530000,3
2019-10-28 19:57:40.598797056,2019-10-28 19:57:40.598779392,11911042,T,IEX,118.530000,3
2019-10-28 19:57:40.656248064,2019-10-28 19:57:40.656231194,11911131,T,IEX,118.535000,100
2019-10-28 19:57:40.657681920,2019-10-28 19:57:40.657663556,11911135,T,IEX,118.535000,100
2019-10-28 19:57:40.657846016,2019-10-28 19:57:40.657827782,11911136,T,IEX,118.535000,100
2019-10-28 19:57:40.658899968,2019-10-28 19:57:40.658882719,11911138,T,IEX,118.535000,100
2019-10-28 19:57:41.457411072,2019-10-28 19:57:41.457390226,11912069,T,IEX,118.535000,100
2019-10-28 19:57:42.41835008,2019-10-28 19:57:42.41813819,11912611,T,IEX,118.535000,100
2019-10-28 19:57:42.41843968,2019-10-28 19:57:42.41826673,11912612,T,IEX,118.535000,100
2019-10-28 19:57:46.125872128,2019-10-28 19:57:46.125851860,11917741,T,IEX,118.525000,100
2019-10-28 19:57:47.831212032,2019-10-28 19:57:47.831195853,11919553,T,IEX,118.520000,5
2019-10-28 19:57:48.747795968,2019-10-28 19:57:48.747776626,11920643,T,IEX,118.510000,32
2019-10-28 19:57:55.210148096,2019-10-28 19:57:55.210127236,11928188,T,IEX,118.520000,100
2019-10-28 19:58:00.559021056,2019-10-28 19:58:00.559002503,11934474,T,IEX,118.525000,100
2019-10-28 19:58:02.601784064,2019-10-28 19:58:02.601763732,11939811,T,IEX,118.495000,100
2019-10-28 19:58:09.854406912,2019-10-28 19:58:09.854387018,11949611,T,IEX,118.480000,8
2019-10-28 19:58:09.855569920,2019-10-28 19:58:09.855550701,11949612,T,IEX,118.480000,1
2019-10-28 19:58:09.869637120,2019-10-28 19:58:09.869617142,11949619,T,IEX,118.480000,7
2019-10-28 19:58:11.161495040,2019-10-28 19:58:11.161475320,11951248,T,IEX,118.495000,100
2019-10-28 19:58:24.562258944,2019-10-28 19:58:24.562240207,11967635,T,IEX,118.480000,50
2019-10-28 19:58:24.562276096,2019-10-28 19:58:24.562259708,11967636,T,IEX,118.470000,300
2019-10-28 19:58:24.562291968,2019-10-28 19:58:24.562276438,11967637,T,IEX,118.470000,100
2019-10-28 19:58:24.562311936,2019-10-28 19:58:24.562296209,11967638,T,IEX,118.470000,100
2019-10-28 19:58:24.562339072,2019-10-28 19:58:24.562321709,11967639,T,IEX,118.470000,200
2019-10-28 19:58:24.578217984,2019-10-28 19:58:24.578201256,11967654,T,IEX,118.470000,100
2019-10-28 19:58:25.761718016,2019-10-28 19:58:25.761701486,11969074,T,IEX,118.470000,100
2019-10-28 19:58:32.162334976,2019-10-28 19:58:32.162315119,11976722,T,IEX,118.465000,100
2019-10-28 19:58:33.918233088,2019-10-28 19:58:33.918215839,11978407,T,IEX,118.465000,100
2019-10-28 19:58:38.727739904,2019-10-28 19:58:38.727720471,11984322,T,IEX,118.450000,100
2019-10-28 19:58:46.521072128,2019-10-28 19:58:46.521049184,11992790,T,IEX,118.445000,100
2019-10-28 19:58:51.562848000,2019-10-28 19:58:51.562831902,11998471,T,IEX,118.445000,100
2019-10-28 19:58:52.175002112,2019-10-28 19:58:52.174980567,11999015,T,IEX,118.445000,100
2019-10-28 19:59:00.126674944,2019-10-28 19:59:00.126657764,12010783,T,IEX,118.450000,13
2019-10-28 19:59:00.143883008,2019-10-28 19:59:00.143864027,12010860,T,IEX,118.450000,9
2019-10-28 19:59:00.143899904,2019-10-28 19:59:00.143884149,12010861,T,IEX,118.450000,7
2019-10-28 19:59:01.861654016,2019-10-28 19:59:01.861637963,12017252,T,IEX,118.450000,100
2019-10-28 19:59:01.861669120,2019-10-28 19:59:01.861651059,12017253,T,IEX,118.450000,100
2019-10-28 19:59:01.861682944,2019-10-28 19:59:01.861667513,12017254,T,IEX,118.450000,100
2019-10-28 19:59:01.887127040,2019-10-28 19:59:01.887107553,12017287,T,IEX,118.450000,200
2019-10-28 19:59:01.887143936,2019-10-28 19:59:01.887126599,12017288,T,IEX,118.450000,100
2019-10-28 19:59:06.913027072,2019-10-28 19:59:06.913007663,12026286,T,IEX,118.455000,100
2019-10-28 19:59:09.578289920,2019-10-28 19:59:09.578271611,12032087,T,IEX,118.455000,100
2019-10-28 19:59:10.862586112,2019-10-28 19:59:10.862565968,12035071,T,IEX,118.460000,100
2019-10-28 19:59:11.820762880,2019-10-28 19:59:11.820745387,12039520,T,IEX,118.470000,170
2019-10-28 19:59:12.425882112,2019-10-28 19:59:12.425863237,12040785,T,IEX,118.480000,100
2019-10-28 19:59:17.761135104,2019-10-28 19:59:17.761116397,12050976,T,IEX,118.495000,100
2019-10-28 19:59:24.224613120,2019-10-28 19:59:24.224592083,12061300,T,IEX,118.505000,100
2019-10-28 19:59:30.223980032,2019-10-28 19:59:30.223962824,12073508,T,IEX,118.505000,100
2019-10-28 19:59:30.234629120,2019-10-28 19:59:30.234610898,12073673,T,IEX,118.500000,100
2019-10-28 19:59:30.234669056,2019-10-28 19:59:30.234648822,12073676,T,IEX,118.500000,100
2019-10-28 19:59:30.235012096,2019-10-28 19:59:30.234993838,12073682,T,IEX,118.500000,100
2019-10-28 19:59:30.859529984,2019-10-28 19:59:30.859513901,12078831,T,IEX,118.500000,100
2019-10-28 19:59:36.761839104,2019-10-28 19:59:36.761810165,12112098,T,IEX,118.530000,100
2019-10-28 19:59:40.82253056,2019-10-28 19:59:40.82235493,12132876,T,IEX,118.490000,100
2019-10-28 19:59:40.83077120,2019-10-28 19:59:40.83055926,12132887,T,IEX,118.490000,100
2019-10-28 19:59:41.495476992,2019-10-28 19:59:41.495454660,12143845,T,IEX,118.480000,100
2019-10-28 19:59:43.322125056,2019-10-28 19:59:43.322106391,12153284,T,IEX,118.490000,100
2019-10-28 19:59:43.323320064,2019-10-28 19:59:43.323303342,12153286,T,IEX,118.490000,100
2019-10-28 19:59:43.324452096,2019-10-28 19:59:43.324435844,12153292,T,IEX,118.490000,200
2019-10-28 19:59:50.844886016,2019-10-28 19:59:50.844867792,12196410,T,IEX,118.470000,100
2019-10-28 19:59:50.844902912,2019-10-28 19:59:50.844886896,12196411,T,IEX,118.470000,200
2019-10-28 19:59:54.101616128,2019-10-28 19:59:54.101598071,12210180,T,IEX,118.490000,100
2019-10-28 19:59:54.740555008,2019-10-28 19:59:54.740536099,12213867,T,IEX,118.490000,100
2019-10-28 19:59:54.740572928,2019-10-28 19:59:54.740555811,12213869,T,IEX,118.490000,100
2019-10-28 19:59:54.947270912,2019-10-28 19:59:54.947250787,12214563,T,IEX,118.480000,100
2019-10-28 19:59:55.965150976,2019-10-28 19:59:55.965132243,12221646,T,IEX,118.490000,100
2019-10-28 19:59:56.10269952,2019-10-28 19:59:56.10240183,12222007,T,IEX,118.480000,100
