2019-10-18 19:15:27.547631104,2019-10-18 19:15:27.547607440,12065846,T,IEX,27.210000,500
2019-10-18 19:55:00.100054016,2019-10-18 19:55:00.100034733,13317677,T,IEX,27.260000,200
2019-10-18 19:55:00.100080896,2019-10-18 19:55:00.100061285,13317678,T,IEX,27.260000,300
2019-10-18 19:55:00.100093952,2019-10-18 19:55:00.100075878,13317679,T,IEX,27.260000,600
2019-10-18 19:55:00.128950016,2019-10-18 19:55:00.128931257,13318580,T,IEX,27.260000,100
2019-10-18 19:55:00.433652992,2019-10-18 19:55:00.433634790,13322555,T,IEX,27.275000,100
