2019-11-01 13:47:49.625156096,2019-11-01 13:47:49.625136470,1130444,T,IEX,56.180000,200
2019-11-01 13:52:55.3739904,2019-11-01 13:52:55.3717410,1371282,T,IEX,56.230000,100
2019-11-01 13:56:40.294980096,2019-11-01 13:56:40.294962636,1575811,T,IEX,56.285000,100
2019-11-01 14:00:00.16461056,2019-11-01 14:00:00.16444327,1722153,T,IEX,56.230000,100
2019-11-01 14:00:07.670707968,2019-11-01 14:00:07.670687680,1736138,T,IEX,56.200000,200
2019-11-01 14:00:56.812347904,2019-11-01 14:00:56.812320053,1829976,T,IEX,56.260000,100
2019-11-01 14:11:40.355377920,2019-11-01 14:11:40.355361889,2498106,T,IEX,56.595000,100
2019-11-01 14:15:43.604818944,2019-11-01 14:15:43.604798931,2695548,T,IEX,56.620000,100
2019-11-01 14:15:57.378048000,2019-11-01 14:15:57.378029755,2704185,T,IEX,56.605000,100
2019-11-01 14:17:58.389583104,2019-11-01 14:17:58.389567283,2789082,T,IEX,56.590000,100
2019-11-01 14:21:33.347603968,2019-11-01 14:21:33.347582864,2962538,T,IEX,56.510000,100
2019-11-01 14:25:45.92179968,2019-11-01 14:25:45.92159140,3152062,T,IEX,56.520000,100
2019-11-01 14:28:21.422812928,2019-11-01 14:28:21.422792684,3258426,T,IEX,56.455000,100
2019-11-01 14:30:31.808285952,2019-11-01 14:30:31.808266198,3349077,T,IEX,56.530000,100
2019-11-01 14:36:05.746438912,2019-11-01 14:36:05.746421151,3586619,T,IEX,56.445000,100
2019-11-01 14:36:11.448889088,2019-11-01 14:36:11.448867572,3590720,T,IEX,56.435000,100
2019-11-01 14:48:03.252892928,2019-11-01 14:48:03.252876841,4029128,T,IEX,56.465000,100
2019-11-01 14:57:02.977410048,2019-11-01 14:57:02.977393953,4338844,T,IEX,56.505000,100
2019-11-01 15:01:50.586201088,2019-11-01 15:01:50.586184138,4493593,T,IEX,56.530000,100
2019-11-01 15:01:50.694253056,2019-11-01 15:01:50.694237572,4494830,T,IEX,56.525000,100
2019-11-01 15:02:12.500121088,2019-11-01 15:02:12.500101719,4511753,T,IEX,56.480000,100
2019-11-01 15:10:27.912244992,2019-11-01 15:10:27.912227417,4770807,T,IEX,56.515000,100
2019-11-01 15:10:40.593049088,2019-11-01 15:10:40.593031736,4776994,T,IEX,56.505000,100
2019-11-01 15:21:48.940257024,2019-11-01 15:21:48.940240824,5072435,T,IEX,56.465000,100
2019-11-01 15:22:07.838793984,2019-11-01 15:22:07.838775454,5080025,T,IEX,56.465000,100
2019-11-01 15:28:42.361603072,2019-11-01 15:28:42.361585730,5267247,T,IEX,56.395000,100
2019-11-01 15:37:36.122359040,2019-11-01 15:37:36.122340601,5509324,T,IEX,56.450000,100
2019-11-01 15:46:03.651225088,2019-11-01 15:46:03.651209035,5721953,T,IEX,56.465000,100
2019-11-01 15:49:13.641839104,2019-11-01 15:49:13.641820286,5808329,T,IEX,56.490000,100
2019-11-01 15:53:08.827535872,2019-11-01 15:53:08.827520734,5914702,T,IEX,56.485000,100
2019-11-01 15:54:59.778115072,2019-11-01 15:54:59.778097478,5964317,T,IEX,56.475000,100
2019-11-01 15:55:23.386147072,2019-11-01 15:55:23.386128663,5974252,T,IEX,56.475000,100
2019-11-01 16:00:18.349231104,2019-11-01 16:00:18.349215932,6104918,T,IEX,56.470000,200
2019-11-01 16:01:16.579663872,2019-11-01 16:01:16.579648171,6133221,T,IEX,56.445000,100
2019-11-01 16:01:17.511300096,2019-11-01 16:01:17.511283101,6133746,T,IEX,56.445000,100
2019-11-01 16:32:02.563862016,2019-11-01 16:32:02.563841799,7037887,T,IEX,56.360000,75
2019-11-01 16:37:38.291360000,2019-11-01 16:37:38.291340262,7177259,T,IEX,56.450000,100
2019-11-01 16:46:34.22571008,2019-11-01 16:46:34.22543016,7362588,T,IEX,56.420000,100
2019-11-01 16:57:48.723023104,2019-11-01 16:57:48.723006478,7600418,T,IEX,56.355000,100
2019-11-01 17:50:40.455631104,2019-11-01 17:50:40.455613376,8812943,T,IEX,56.685000,100
2019-11-01 18:16:45.819729920,2019-11-01 18:16:45.819706751,9432881,T,IEX,56.610000,12
2019-11-01 18:16:45.819819008,2019-11-01 18:16:45.819802322,9432885,T,IEX,56.610000,75
2019-11-01 18:16:45.819872000,2019-11-01 18:16:45.819853819,9432888,T,IEX,56.610000,13
2019-11-01 18:23:44.356634880,2019-11-01 18:23:44.356619457,9609324,T,IEX,56.545000,100
2019-11-01 18:32:48.174972928,2019-11-01 18:32:48.174953474,9873434,T,IEX,56.650000,100
2019-11-01 18:33:17.529473024,2019-11-01 18:33:17.529456989,9885375,T,IEX,56.645000,100
2019-11-01 18:48:28.214704128,2019-11-01 18:48:28.214685083,10206649,T,IEX,56.600000,100
2019-11-01 18:54:40.550392064,2019-11-01 18:54:40.550374486,10339135,T,IEX,56.555000,100
2019-11-01 19:10:49.295193088,2019-11-01 19:10:49.295177223,10683159,T,IEX,56.575000,100
2019-11-01 19:32:15.784609024,2019-11-01 19:32:15.784578781,11252561,T,IEX,56.650000,100
2019-11-01 19:39:10.738118912,2019-11-01 19:39:10.738098258,11463640,T,IEX,56.700000,100
2019-11-01 19:54:02.928740096,2019-11-01 19:54:02.928721684,12053590,T,IEX,56.560000,100
2019-11-01 19:58:00.406583040,2019-11-01 19:58:00.406563871,12344635,T,IEX,56.650000,100
