2019-10-22 12:26:26.392666112,2019-10-22 12:26:26.392622558,37275,T,IEX,1787.500000,100
2019-10-22 12:26:26.393552896,2019-10-22 12:26:26.393529829,37276,T,IEX,1787.500000,17
2019-10-22 12:26:53.365772032,2019-10-22 12:26:53.365735906,37363,T,IEX,1787.500000,23
2019-10-22 12:26:53.366116096,2019-10-22 12:26:53.366092702,37365,T,IEX,1787.500000,50
2019-10-22 13:30:00.167631104,2019-10-22 13:30:00.167601077,88560,T,IEX,1788.450000,1
2019-10-22 13:30:00.167681024,2019-10-22 13:30:00.167655715,88562,T,IEX,1788.450000,1
2019-10-22 13:30:00.167740928,2019-10-22 13:30:00.167715718,88564,T,IEX,1788.450000,1
2019-10-22 13:30:01.139357952,2019-10-22 13:30:01.139336678,94610,T,IEX,1788.150000,1
2019-10-22 13:30:01.153480960,2019-10-22 13:30:01.153457287,94727,T,IEX,1788.450000,100
2019-10-22 13:30:03.216219904,2019-10-22 13:30:03.216197848,102315,T,IEX,1787.925000,100
2019-10-22 13:30:04.122273024,2019-10-22 13:30:04.122249194,104632,T,IEX,1787.850000,200
2019-10-22 13:30:04.296442112,2019-10-22 13:30:04.296419171,104882,T,IEX,1787.855000,6
2019-10-22 13:30:04.366572032,2019-10-22 13:30:04.366547943,104944,T,IEX,1787.850000,7
2019-10-22 13:30:04.500104960,2019-10-22 13:30:04.500083482,105101,T,IEX,1787.925000,1
2019-10-22 13:30:19.608261888,2019-10-22 13:30:19.608238282,127717,T,IEX,1787.680000,100
2019-10-22 13:30:20.199920896,2019-10-22 13:30:20.199895479,128528,T,IEX,1788.055000,100
2019-10-22 13:30:36.531024896,2019-10-22 13:30:36.530998427,145081,T,IEX,1789.750000,14
2019-10-22 13:31:13.586295040,2019-10-22 13:31:13.586270432,184268,T,IEX,1789.000000,50
2019-10-22 13:31:13.586789120,2019-10-22 13:31:13.586765951,184286,T,IEX,1789.000000,50
2019-10-22 13:31:27.590159872,2019-10-22 13:31:27.590135327,197018,T,IEX,1788.840000,100
2019-10-22 13:31:39.484184064,2019-10-22 13:31:39.484157710,208518,T,IEX,1788.825000,30
2019-10-22 13:31:39.852750080,2019-10-22 13:31:39.852728518,208824,T,IEX,1788.825000,20
2019-10-22 13:31:47.833988096,2019-10-22 13:31:47.833966859,216230,T,IEX,1788.825000,15
2019-10-22 13:31:54.580654080,2019-10-22 13:31:54.580632723,223067,T,IEX,1788.505000,100
2019-10-22 13:31:57.764333056,2019-10-22 13:31:57.764309335,225921,T,IEX,1788.590000,25
2019-10-22 13:32:08.186679040,2019-10-22 13:32:08.186657541,238265,T,IEX,1788.500000,1
2019-10-22 13:32:08.200229888,2019-10-22 13:32:08.200211374,238274,T,IEX,1788.500000,2
2019-10-22 13:32:10.631802880,2019-10-22 13:32:10.631780889,241060,T,IEX,1788.650000,200
2019-10-22 13:33:08.899753984,2019-10-22 13:33:08.899730150,296422,T,IEX,1786.270000,2
2019-10-22 13:34:00.89574912,2019-10-22 13:34:00.89557611,346547,T,IEX,1783.120000,100
2019-10-22 13:34:01.717591040,2019-10-22 13:34:01.717572104,348587,T,IEX,1784.295000,10
2019-10-22 13:34:01.718461952,2019-10-22 13:34:01.718443716,348589,T,IEX,1784.295000,10
2019-10-22 13:34:01.719311872,2019-10-22 13:34:01.719296155,348592,T,IEX,1784.295000,10
2019-10-22 13:34:01.720172032,2019-10-22 13:34:01.720155429,348596,T,IEX,1784.295000,10
2019-10-22 13:34:01.721025024,2019-10-22 13:34:01.721006007,348597,T,IEX,1784.295000,10
2019-10-22 13:34:03.69049088,2019-10-22 13:34:03.69025613,350786,T,IEX,1785.065000,10
2019-10-22 13:34:03.139546880,2019-10-22 13:34:03.139531365,351079,T,IEX,1784.680000,36
2019-10-22 13:34:31.105441024,2019-10-22 13:34:31.105423283,378572,T,IEX,1785.700000,92
2019-10-22 13:34:31.105607936,2019-10-22 13:34:31.105590584,378574,T,IEX,1785.700000,8
2019-10-22 13:34:31.106304000,2019-10-22 13:34:31.106286969,378579,T,IEX,1785.700000,100
2019-10-22 13:34:45.806384896,2019-10-22 13:34:45.806369994,391489,T,IEX,1786.005000,5
2019-10-22 13:34:45.806490112,2019-10-22 13:34:45.806472993,391490,T,IEX,1786.120000,100
2019-10-22 13:35:18.971067904,2019-10-22 13:35:18.971048972,433173,T,IEX,1783.340000,60
2019-10-22 13:35:18.971462912,2019-10-22 13:35:18.971447000,433175,T,IEX,1783.340000,40
2019-10-22 13:35:19.196123904,2019-10-22 13:35:19.196105136,433364,T,IEX,1783.330000,25
2019-10-22 13:36:25.168727040,2019-10-22 13:36:25.168707253,508848,T,IEX,1783.105000,100
2019-10-22 13:36:25.176880128,2019-10-22 13:36:25.176861161,508852,T,IEX,1783.750000,100
2019-10-22 13:37:41.903970048,2019-10-22 13:37:41.903951274,580081,T,IEX,1782.845000,200
2019-10-22 13:37:56.730716928,2019-10-22 13:37:56.730699442,591477,T,IEX,1782.720000,75
2019-10-22 13:39:43.300832000,2019-10-22 13:39:43.300814414,683276,T,IEX,1779.290000,100
2019-10-22 13:40:48.681372928,2019-10-22 13:40:48.681351113,742866,T,IEX,1778.765000,1
2019-10-22 13:40:48.962373888,2019-10-22 13:40:48.962354636,743024,T,IEX,1778.765000,7
2019-10-22 13:41:04.197434880,2019-10-22 13:41:04.197412270,755749,T,IEX,1778.605000,10
2019-10-22 13:41:04.197800960,2019-10-22 13:41:04.197782268,755752,T,IEX,1778.610000,5
2019-10-22 13:41:04.197915904,2019-10-22 13:41:04.197898284,755753,T,IEX,1778.610000,10
2019-10-22 13:41:06.535633920,2019-10-22 13:41:06.535616047,758273,T,IEX,1779.430000,5
2019-10-22 13:41:06.539802112,2019-10-22 13:41:06.539784748,758330,T,IEX,1779.485000,5
2019-10-22 13:41:11.23653888,2019-10-22 13:41:11.23636075,762954,T,IEX,1780.200000,2
2019-10-22 13:41:11.487027968,2019-10-22 13:41:11.487010500,763265,T,IEX,1780.200000,1
2019-10-22 13:41:11.869820928,2019-10-22 13:41:11.869803215,763625,T,IEX,1780.200000,8
2019-10-22 13:41:16.426718976,2019-10-22 13:41:16.426701327,767844,T,IEX,1779.855000,1
2019-10-22 13:41:24.727160064,2019-10-22 13:41:24.727142850,775643,T,IEX,1779.885000,1
2019-10-22 13:41:37.56589056,2019-10-22 13:41:37.56569307,784646,T,IEX,1779.580000,1
2019-10-22 13:41:41.279450112,2019-10-22 13:41:41.279431295,789040,T,IEX,1779.380000,2
2019-10-22 13:41:55.51898112,2019-10-22 13:41:55.51877737,798848,T,IEX,1779.090000,8
2019-10-22 13:42:01.600424960,2019-10-22 13:42:01.600405978,803685,T,IEX,1779.190000,5
2019-10-22 13:42:01.946429952,2019-10-22 13:42:01.946409001,803913,T,IEX,1779.260000,5
2019-10-22 13:42:04.445088000,2019-10-22 13:42:04.445069839,806267,T,IEX,1779.740000,5
2019-10-22 13:42:10.776773120,2019-10-22 13:42:10.776753469,812396,T,IEX,1780.010000,1
2019-10-22 13:42:12.956690944,2019-10-22 13:42:12.956673544,814121,T,IEX,1779.960000,1
2019-10-22 13:42:16.317088000,2019-10-22 13:42:16.317070842,816464,T,IEX,1779.960000,1
2019-10-22 13:42:16.376709888,2019-10-22 13:42:16.376689561,816504,T,IEX,1779.960000,50
2019-10-22 13:42:16.498754048,2019-10-22 13:42:16.498734279,816579,T,IEX,1780.000000,50
2019-10-22 13:42:22.147145984,2019-10-22 13:42:22.147126867,820952,T,IEX,1780.000000,1
2019-10-22 13:42:23.586042880,2019-10-22 13:42:23.586026913,821947,T,IEX,1780.000000,50
2019-10-22 13:42:23.590672896,2019-10-22 13:42:23.590656915,821965,T,IEX,1780.000000,70
2019-10-22 13:42:24.710377984,2019-10-22 13:42:24.710360657,822674,T,IEX,1780.000000,45
2019-10-22 13:42:25.226916096,2019-10-22 13:42:25.226895450,823240,T,IEX,1780.000000,1
2019-10-22 13:42:31.695858944,2019-10-22 13:42:31.695835939,828170,T,IEX,1779.665000,9
2019-10-22 13:42:41.227507968,2019-10-22 13:42:41.227491735,834135,T,IEX,1779.620000,1
2019-10-22 13:42:50.616600064,2019-10-22 13:42:50.616582594,840369,T,IEX,1779.290000,1
2019-10-22 13:43:18.957003008,2019-10-22 13:43:18.956984485,862215,T,IEX,1777.340000,10
2019-10-22 13:43:18.957212928,2019-10-22 13:43:18.957196085,862216,T,IEX,1777.480000,50
2019-10-22 13:43:18.957286912,2019-10-22 13:43:18.957269240,862217,T,IEX,1777.480000,5
2019-10-22 13:43:18.957331968,2019-10-22 13:43:18.957314681,862218,T,IEX,1777.480000,35
2019-10-22 13:44:22.289328128,2019-10-22 13:44:22.289312076,906761,T,IEX,1779.000000,10
2019-10-22 13:44:22.289356032,2019-10-22 13:44:22.289338706,906762,T,IEX,1779.090000,50
2019-10-22 13:44:22.289380096,2019-10-22 13:44:22.289363379,906763,T,IEX,1779.260000,11
2019-10-22 13:45:15.173625088,2019-10-22 13:45:15.173608674,956159,T,IEX,1779.110000,10
2019-10-22 13:45:15.173652992,2019-10-22 13:45:15.173636217,956160,T,IEX,1779.120000,100
2019-10-22 13:45:15.173675008,2019-10-22 13:45:15.173659145,956161,T,IEX,1779.190000,78
2019-10-22 13:45:15.174938880,2019-10-22 13:45:15.174921857,956166,T,IEX,1779.100000,10
2019-10-22 13:45:15.174962944,2019-10-22 13:45:15.174946650,956167,T,IEX,1779.260000,100
2019-10-22 13:45:15.174981120,2019-10-22 13:45:15.174963578,956168,T,IEX,1779.400000,16
2019-10-22 13:46:24.910110976,2019-10-22 13:46:24.910091568,1026169,T,IEX,1776.300000,100
2019-10-22 13:46:36.608048896,2019-10-22 13:46:36.608030256,1034507,T,IEX,1774.730000,4
2019-10-22 13:48:27.744644096,2019-10-22 13:48:27.744626137,1139699,T,IEX,1772.885000,1
2019-10-22 13:55:10.424986880,2019-10-22 13:55:10.424968812,1471350,T,IEX,1775.840000,100
2019-10-22 13:56:24.7138048,2019-10-22 13:56:24.7116574,1529781,T,IEX,1776.415000,100
2019-10-22 13:57:15.829954048,2019-10-22 13:57:15.829934823,1563208,T,IEX,1777.040000,50
2019-10-22 13:57:45.237201920,2019-10-22 13:57:45.237182907,1581530,T,IEX,1777.250000,8
2019-10-22 14:00:03.184057088,2019-10-22 14:00:03.184038118,1667631,T,IEX,1777.230000,100
2019-10-22 14:00:27.290187008,2019-10-22 14:00:27.290170484,1686575,T,IEX,1777.165000,100
2019-10-22 14:00:29.847752960,2019-10-22 14:00:29.847735645,1688597,T,IEX,1777.905000,100
2019-10-22 14:04:01.599350016,2019-10-22 14:04:01.599331125,1872508,T,IEX,1777.610000,75
2019-10-22 14:04:01.599515904,2019-10-22 14:04:01.599496029,1872511,T,IEX,1777.610000,25
2019-10-22 14:04:25.794268928,2019-10-22 14:04:25.794249642,1892753,T,IEX,1776.955000,2
2019-10-22 14:04:30.982125056,2019-10-22 14:04:30.982108555,1899701,T,IEX,1776.005000,100
2019-10-22 14:04:36.79457024,2019-10-22 14:04:36.79439399,1908306,T,IEX,1775.780000,100
2019-10-22 14:05:55.796886016,2019-10-22 14:05:55.796869373,1976713,T,IEX,1775.995000,100
2019-10-22 14:06:56.547312896,2019-10-22 14:06:56.547295127,2032415,T,IEX,1775.950000,1
2019-10-22 14:09:49.802620928,2019-10-22 14:09:49.802602610,2177683,T,IEX,1776.780000,7
2019-10-22 14:10:24.315838976,2019-10-22 14:10:24.315818297,2201319,T,IEX,1775.990000,40
2019-10-22 14:10:24.316054016,2019-10-22 14:10:24.316034239,2201329,T,IEX,1775.990000,60
2019-10-22 14:10:36.185458944,2019-10-22 14:10:36.185440753,2210700,T,IEX,1775.825000,100
2019-10-22 14:11:09.343748096,2019-10-22 14:11:09.343731377,2234742,T,IEX,1775.815000,1
2019-10-22 14:11:17.65555968,2019-10-22 14:11:17.65537143,2239334,T,IEX,1775.470000,96
2019-10-22 14:11:17.65655040,2019-10-22 14:11:17.65637002,2239336,T,IEX,1775.470000,4
2019-10-22 14:12:25.463927040,2019-10-22 14:12:25.463904852,2290664,T,IEX,1772.790000,1
2019-10-22 14:12:25.464363008,2019-10-22 14:12:25.464343730,2290666,T,IEX,1772.760000,100
2019-10-22 14:12:52.882086912,2019-10-22 14:12:52.882068618,2307998,T,IEX,1772.780000,100
2019-10-22 14:12:52.906152960,2019-10-22 14:12:52.906135946,2308250,T,IEX,1772.670000,100
2019-10-22 14:13:30.72643072,2019-10-22 14:13:30.72624991,2335339,T,IEX,1772.595000,100
2019-10-22 14:14:56.484704000,2019-10-22 14:14:56.484682224,2391721,T,IEX,1773.320000,100
2019-10-22 14:16:12.454650112,2019-10-22 14:16:12.454626725,2446101,T,IEX,1773.125000,100
2019-10-22 14:16:44.615000064,2019-10-22 14:16:44.614982717,2466927,T,IEX,1773.240000,100
2019-10-22 14:17:50.399351040,2019-10-22 14:17:50.399332785,2514717,T,IEX,1771.570000,1
2019-10-22 14:17:50.399367936,2019-10-22 14:17:50.399351083,2514718,T,IEX,1771.460000,99
2019-10-22 14:18:14.151777024,2019-10-22 14:18:14.151756997,2535488,T,IEX,1773.420000,10
2019-10-22 14:20:26.457369088,2019-10-22 14:20:26.457347330,2615451,T,IEX,1772.170000,25
2019-10-22 14:23:17.540012032,2019-10-22 14:23:17.539994543,2722331,T,IEX,1774.130000,100
2019-10-22 14:23:22.896742912,2019-10-22 14:23:22.896723142,2724904,T,IEX,1774.325000,50
2019-10-22 14:23:22.896759040,2019-10-22 14:23:22.896741075,2724905,T,IEX,1774.290000,50
2019-10-22 14:25:18.736600064,2019-10-22 14:25:18.736581555,2791812,T,IEX,1775.800000,4
2019-10-22 14:25:43.993803008,2019-10-22 14:25:43.993784903,2813495,T,IEX,1775.420000,100
2019-10-22 14:26:47.605367040,2019-10-22 14:26:47.605348601,2856107,T,IEX,1774.390000,1
2019-10-22 14:28:02.326985984,2019-10-22 14:28:02.326967463,2903395,T,IEX,1775.120000,100
2019-10-22 14:28:39.506528000,2019-10-22 14:28:39.506509137,2924583,T,IEX,1774.500000,100
2019-10-22 14:31:31.228429056,2019-10-22 14:31:31.228396396,3034679,T,IEX,1775.070000,100
2019-10-22 14:31:32.862500096,2019-10-22 14:31:32.862480694,3037018,T,IEX,1775.125000,100
2019-10-22 14:32:17.353470976,2019-10-22 14:32:17.353450079,3071807,T,IEX,1775.710000,100
2019-10-22 14:32:23.172901120,2019-10-22 14:32:23.172877774,3075728,T,IEX,1776.040000,100
2019-10-22 14:32:35.52889088,2019-10-22 14:32:35.52870570,3084728,T,IEX,1775.920000,200
2019-10-22 14:32:35.58237952,2019-10-22 14:32:35.58216768,3084729,T,IEX,1776.190000,100
2019-10-22 14:33:28.897094912,2019-10-22 14:33:28.897077224,3128868,T,IEX,1776.455000,100
2019-10-22 14:33:55.84833024,2019-10-22 14:33:55.84814122,3163636,T,IEX,1775.630000,100
2019-10-22 14:33:55.84852992,2019-10-22 14:33:55.84836057,3163637,T,IEX,1775.730000,50
2019-10-22 14:33:55.84867072,2019-10-22 14:33:55.84849819,3163638,T,IEX,1775.760000,50
2019-10-22 14:34:35.365902080,2019-10-22 14:34:35.365884510,3190353,T,IEX,1774.690000,1
2019-10-22 14:34:41.925458944,2019-10-22 14:34:41.925439329,3195014,T,IEX,1774.880000,100
2019-10-22 14:35:00.77731072,2019-10-22 14:35:00.77710840,3206481,T,IEX,1774.915000,200
2019-10-22 14:35:00.78279936,2019-10-22 14:35:00.78262399,3206499,T,IEX,1774.915000,200
2019-10-22 14:36:53.883805952,2019-10-22 14:36:53.883788101,3279166,T,IEX,1775.510000,100
2019-10-22 14:37:20.459320064,2019-10-22 14:37:20.459301163,3291630,T,IEX,1775.590000,48
2019-10-22 14:38:42.542374912,2019-10-22 14:38:42.542352122,3338980,T,IEX,1776.190000,100
2019-10-22 14:40:23.718427904,2019-10-22 14:40:23.718408059,3404253,T,IEX,1777.565000,1
2019-10-22 14:40:50.479106048,2019-10-22 14:40:50.479088590,3420228,T,IEX,1778.790000,100
2019-10-22 14:40:51.498813952,2019-10-22 14:40:51.498795876,3420769,T,IEX,1778.880000,1
2019-10-22 14:41:08.667377920,2019-10-22 14:41:08.667360474,3433308,T,IEX,1778.975000,50
2019-10-22 14:41:08.811899904,2019-10-22 14:41:08.811882501,3433619,T,IEX,1779.060000,10
2019-10-22 14:41:11.153382912,2019-10-22 14:41:11.153367262,3435082,T,IEX,1779.070000,10
2019-10-22 14:41:11.154620928,2019-10-22 14:41:11.154604716,3435084,T,IEX,1779.070000,10
2019-10-22 14:42:54.211312128,2019-10-22 14:42:54.211293580,3490839,T,IEX,1778.800000,100
2019-10-22 14:44:15.392240896,2019-10-22 14:44:15.392222130,3533032,T,IEX,1778.905000,1
2019-10-22 14:44:43.575745024,2019-10-22 14:44:43.575724074,3548137,T,IEX,1778.950000,1
2019-10-22 14:44:50.300758016,2019-10-22 14:44:50.300740507,3553004,T,IEX,1778.800000,100
2019-10-22 14:44:59.697078016,2019-10-22 14:44:59.697061182,3559161,T,IEX,1778.630000,1
2019-10-22 14:45:13.128193024,2019-10-22 14:45:13.128174428,3569686,T,IEX,1778.640000,1
2019-10-22 14:45:33.807912960,2019-10-22 14:45:33.807895302,3581756,T,IEX,1778.705000,1
2019-10-22 14:45:46.627976960,2019-10-22 14:45:46.627955522,3590665,T,IEX,1778.540000,1
2019-10-22 14:45:54.14668032,2019-10-22 14:45:54.14653060,3595300,T,IEX,1778.575000,1
2019-10-22 14:45:56.189285120,2019-10-22 14:45:56.189267395,3596746,T,IEX,1778.730000,100
2019-10-22 14:45:56.193044992,2019-10-22 14:45:56.193026044,3596749,T,IEX,1778.700000,1
2019-10-22 14:45:57.340178944,2019-10-22 14:45:57.340154027,3597328,T,IEX,1778.820000,1
2019-10-22 14:46:02.821371904,2019-10-22 14:46:02.821355815,3601206,T,IEX,1778.750000,100
2019-10-22 14:46:02.829164032,2019-10-22 14:46:02.829147296,3601208,T,IEX,1778.750000,100
2019-10-22 14:46:19.224710912,2019-10-22 14:46:19.224691578,3609929,T,IEX,1778.645000,1
2019-10-22 14:46:24.244111104,2019-10-22 14:46:24.244091987,3612653,T,IEX,1778.385000,1
2019-10-22 14:46:40.368805120,2019-10-22 14:46:40.368786319,3622014,T,IEX,1778.795000,1
2019-10-22 14:46:50.546821888,2019-10-22 14:46:50.546803940,3628542,T,IEX,1779.155000,1
2019-10-22 14:49:36.342044928,2019-10-22 14:49:36.342027239,3718472,T,IEX,1780.055000,100
2019-10-22 14:50:41.131347968,2019-10-22 14:50:41.131331700,3753205,T,IEX,1780.050000,1
2019-10-22 14:50:51.699394048,2019-10-22 14:50:51.699372400,3758022,T,IEX,1780.000000,70
2019-10-22 14:50:53.2119936,2019-10-22 14:50:53.2102521,3758676,T,IEX,1780.200000,100
2019-10-22 14:52:37.951266048,2019-10-22 14:52:37.951246421,3813073,T,IEX,1780.305000,100
2019-10-22 14:52:45.303192064,2019-10-22 14:52:45.303175208,3816910,T,IEX,1780.315000,8
2019-10-22 14:52:45.303208960,2019-10-22 14:52:45.303193141,3816911,T,IEX,1780.315000,192
2019-10-22 14:52:49.441596928,2019-10-22 14:52:49.441580052,3819705,T,IEX,1780.400000,100
2019-10-22 14:53:01.135458048,2019-10-22 14:53:01.135439426,3828703,T,IEX,1780.600000,100
2019-10-22 14:53:09.153335040,2019-10-22 14:53:09.153315619,3835150,T,IEX,1780.530000,100
2019-10-22 14:53:09.168256000,2019-10-22 14:53:09.168239652,3835154,T,IEX,1780.680000,100
2019-10-22 14:54:22.13702912,2019-10-22 14:54:22.13678108,3873930,T,IEX,1780.510000,5
2019-10-22 14:54:32.177900032,2019-10-22 14:54:32.177882753,3879845,T,IEX,1779.920000,50
2019-10-22 14:55:52.353181952,2019-10-22 14:55:52.353162997,3920275,T,IEX,1779.690000,100
2019-10-22 14:59:37.687073024,2019-10-22 14:59:37.687055545,4105607,T,IEX,1777.860000,4
2019-10-22 15:00:55.620645120,2019-10-22 15:00:55.620626373,4166905,T,IEX,1777.100000,100
2019-10-22 15:01:36.91667968,2019-10-22 15:01:36.91645843,4201034,T,IEX,1777.865000,2
2019-10-22 15:01:47.419110912,2019-10-22 15:01:47.419092941,4208091,T,IEX,1777.865000,300
2019-10-22 15:01:48.421028096,2019-10-22 15:01:48.421007369,4208698,T,IEX,1777.865000,400
2019-10-22 15:03:05.308077056,2019-10-22 15:03:05.308061155,4249940,T,IEX,1778.180000,22
2019-10-22 15:03:14.7909888,2019-10-22 15:03:14.7885814,4254588,T,IEX,1778.265000,100
2019-10-22 15:03:17.862877952,2019-10-22 15:03:17.862849696,4257180,T,IEX,1778.220000,100
2019-10-22 15:03:40.145862912,2019-10-22 15:03:40.145844981,4276970,T,IEX,1776.170000,100
2019-10-22 15:03:40.151046912,2019-10-22 15:03:40.151029584,4277003,T,IEX,1775.905000,50
2019-10-22 15:03:40.151066880,2019-10-22 15:03:40.151050133,4277004,T,IEX,1775.905000,100
2019-10-22 15:03:40.151080960,2019-10-22 15:03:40.151062753,4277005,T,IEX,1775.905000,45
2019-10-22 15:05:15.2053888,2019-10-22 15:05:15.2037264,4341789,T,IEX,1776.540000,22
2019-10-22 15:06:03.595429120,2019-10-22 15:06:03.595410491,4370386,T,IEX,1776.720000,70
2019-10-22 15:07:08.205748992,2019-10-22 15:07:08.205730166,4416331,T,IEX,1777.970000,67
2019-10-22 15:08:03.682192896,2019-10-22 15:08:03.682171263,4447890,T,IEX,1778.525000,50
2019-10-22 15:09:16.70587904,2019-10-22 15:09:16.70568008,4490336,T,IEX,1777.545000,412
2019-10-22 15:09:16.227328000,2019-10-22 15:09:16.227308823,4490404,T,IEX,1777.545000,288
2019-10-22 15:09:52.868974080,2019-10-22 15:09:52.868955661,4516850,T,IEX,1777.210000,112
2019-10-22 15:09:56.59016960,2019-10-22 15:09:56.58994962,4518973,T,IEX,1777.210000,100
2019-10-22 15:10:04.703719936,2019-10-22 15:10:04.703698513,4525075,T,IEX,1777.270000,200
2019-10-22 15:10:59.574566912,2019-10-22 15:10:59.574547149,4564060,T,IEX,1776.870000,6
2019-10-22 15:11:06.950424064,2019-10-22 15:11:06.950404369,4569409,T,IEX,1776.585000,100
2019-10-22 15:12:29.427077888,2019-10-22 15:12:29.427060058,4614424,T,IEX,1776.070000,50
2019-10-22 15:13:14.358274048,2019-10-22 15:13:14.358258877,4636045,T,IEX,1776.380000,100
2019-10-22 15:17:16.585201920,2019-10-22 15:17:16.585184130,4794498,T,IEX,1776.090000,8
2019-10-22 15:17:32.342624000,2019-10-22 15:17:32.342604981,4802565,T,IEX,1775.795000,100
2019-10-22 15:18:11.898861056,2019-10-22 15:18:11.898842455,4823243,T,IEX,1775.745000,200
2019-10-22 15:18:11.902819072,2019-10-22 15:18:11.902799742,4823286,T,IEX,1775.745000,200
2019-10-22 15:18:11.905022976,2019-10-22 15:18:11.905004080,4823299,T,IEX,1775.745000,200
2019-10-22 15:18:40.168318976,2019-10-22 15:18:40.168299677,4842212,T,IEX,1775.495000,4
2019-10-22 15:18:40.176980992,2019-10-22 15:18:40.176961349,4842225,T,IEX,1775.185000,100
2019-10-22 15:19:52.641408000,2019-10-22 15:19:52.641388777,4882280,T,IEX,1775.145000,100
2019-10-22 15:19:54.617975040,2019-10-22 15:19:54.617955093,4882949,T,IEX,1774.680000,100
2019-10-22 15:21:30.56421120,2019-10-22 15:21:30.56400317,4941983,T,IEX,1774.605000,100
2019-10-22 15:21:49.834561024,2019-10-22 15:21:49.834544450,4951623,T,IEX,1774.755000,100
2019-10-22 15:23:17.432807936,2019-10-22 15:23:17.432787256,5011201,T,IEX,1775.530000,100
2019-10-22 15:24:55.309121024,2019-10-22 15:24:55.309099210,5067732,T,IEX,1773.950000,200
2019-10-22 15:25:15.530663936,2019-10-22 15:25:15.530648139,5078008,T,IEX,1773.805000,200
2019-10-22 15:25:20.294617088,2019-10-22 15:25:20.294599364,5081184,T,IEX,1773.540000,50
2019-10-22 15:25:23.751948032,2019-10-22 15:25:23.751930212,5082714,T,IEX,1773.520000,5
2019-10-22 15:25:25.350895104,2019-10-22 15:25:25.350875378,5083962,T,IEX,1773.520000,50
2019-10-22 15:29:17.54192128,2019-10-22 15:29:17.54172974,5208900,T,IEX,1772.500000,5
2019-10-22 15:29:31.456450048,2019-10-22 15:29:31.456434243,5218003,T,IEX,1772.100000,100
2019-10-22 15:30:58.621693952,2019-10-22 15:30:58.621674765,5272813,T,IEX,1771.510000,100
2019-10-22 15:31:36.791941120,2019-10-22 15:31:36.791922600,5293135,T,IEX,1771.730000,100
2019-10-22 15:31:50.147611904,2019-10-22 15:31:50.147592920,5300085,T,IEX,1771.485000,100
2019-10-22 15:33:13.667424000,2019-10-22 15:33:13.667404732,5346078,T,IEX,1772.455000,100
2019-10-22 15:34:07.991443968,2019-10-22 15:34:07.991427074,5371956,T,IEX,1772.770000,100
2019-10-22 15:35:18.332478976,2019-10-22 15:35:18.332456824,5406498,T,IEX,1772.585000,100
2019-10-22 15:36:51.4474112,2019-10-22 15:36:51.4452915,5445841,T,IEX,1773.905000,100
2019-10-22 15:37:33.671549952,2019-10-22 15:37:33.671530229,5465157,T,IEX,1773.380000,100
2019-10-22 15:40:27.839732992,2019-10-22 15:40:27.839714302,5539753,T,IEX,1774.310000,100
2019-10-22 15:40:32.308478976,2019-10-22 15:40:32.308445585,5541195,T,IEX,1774.390000,200
2019-10-22 15:40:57.169689088,2019-10-22 15:40:57.169672205,5548696,T,IEX,1774.280000,49
2019-10-22 15:41:08.791454976,2019-10-22 15:41:08.791439400,5553666,T,IEX,1774.000000,20
2019-10-22 15:42:15.541091072,2019-10-22 15:42:15.541071779,5579011,T,IEX,1773.920000,100
2019-10-22 15:42:36.347482880,2019-10-22 15:42:36.347463734,5588180,T,IEX,1774.280000,100
2019-10-22 15:44:15.676572928,2019-10-22 15:44:15.676553930,5631084,T,IEX,1775.000000,82
2019-10-22 15:44:15.676690944,2019-10-22 15:44:15.676673541,5631086,T,IEX,1775.000000,18
2019-10-22 15:46:40.311600896,2019-10-22 15:46:40.311574355,5694485,T,IEX,1775.930000,100
2019-10-22 15:46:40.312550912,2019-10-22 15:46:40.312532573,5694486,T,IEX,1775.930000,100
2019-10-22 15:46:40.312563968,2019-10-22 15:46:40.312547191,5694487,T,IEX,1775.940000,100
2019-10-22 15:46:49.34949120,2019-10-22 15:46:49.34927038,5696973,T,IEX,1776.090000,55
2019-10-22 15:46:49.237455104,2019-10-22 15:46:49.237437602,5697065,T,IEX,1776.110000,22
2019-10-22 15:46:49.238419968,2019-10-22 15:46:49.238399940,5697066,T,IEX,1776.110000,78
2019-10-22 15:47:53.125513984,2019-10-22 15:47:53.125494693,5724293,T,IEX,1774.970000,100
2019-10-22 15:49:40.534462976,2019-10-22 15:49:40.534440138,5771786,T,IEX,1773.930000,100
2019-10-22 15:50:50.755870976,2019-10-22 15:50:50.755853801,5800416,T,IEX,1774.345000,100
2019-10-22 15:52:23.341424128,2019-10-22 15:52:23.341408404,5838766,T,IEX,1774.075000,100
2019-10-22 15:52:32.673910016,2019-10-22 15:52:32.673892423,5842515,T,IEX,1774.100000,100
2019-10-22 15:53:09.5632000,2019-10-22 15:53:09.5616099,5859618,T,IEX,1774.800000,100
2019-10-22 15:54:49.777356032,2019-10-22 15:54:49.777336931,5900680,T,IEX,1773.250000,2
2019-10-22 15:55:35.269988096,2019-10-22 15:55:35.269968792,5923188,T,IEX,1773.225000,100
2019-10-22 15:57:28.235435008,2019-10-22 15:57:28.235415072,5976640,T,IEX,1771.775000,1
2019-10-22 15:57:28.776987904,2019-10-22 15:57:28.776970769,5977213,T,IEX,1771.950000,20
2019-10-22 15:57:31.516367104,2019-10-22 15:57:31.516348265,5978900,T,IEX,1771.870000,100
2019-10-22 15:57:32.412992000,2019-10-22 15:57:32.412974729,5979601,T,IEX,1772.190000,1
2019-10-22 15:58:04.930305024,2019-10-22 15:58:04.930286744,5997485,T,IEX,1771.500000,100
2019-10-22 15:58:31.4830976,2019-10-22 15:58:31.4811452,6017062,T,IEX,1771.810000,1
2019-10-22 15:58:56.482596096,2019-10-22 15:58:56.482572619,6032369,T,IEX,1771.510000,2
2019-10-22 15:58:58.537367040,2019-10-22 15:58:58.537349420,6033282,T,IEX,1771.435000,100
2019-10-22 15:58:58.537393920,2019-10-22 15:58:58.537370552,6033284,T,IEX,1771.435000,3
2019-10-22 15:59:01.134658048,2019-10-22 15:59:01.134642415,6034664,T,IEX,1771.485000,1
2019-10-22 15:59:10.286595072,2019-10-22 15:59:10.286575099,6040753,T,IEX,1771.420000,1
2019-10-22 15:59:20.123403008,2019-10-22 15:59:20.123383137,6045308,T,IEX,1771.670000,4
2019-10-22 15:59:28.877711104,2019-10-22 15:59:28.877689402,6050362,T,IEX,1771.660000,100
2019-10-22 15:59:33.383214080,2019-10-22 15:59:33.383195503,6052519,T,IEX,1771.700000,1
2019-10-22 15:59:56.540347904,2019-10-22 15:59:56.540328494,6062742,T,IEX,1771.730000,1
2019-10-22 16:00:08.878787072,2019-10-22 16:00:08.878769151,6069185,T,IEX,1771.795000,1
2019-10-22 16:00:11.28399104,2019-10-22 16:00:11.28380766,6069945,T,IEX,1771.650000,100
2019-10-22 16:00:30.69095936,2019-10-22 16:00:30.69071409,6080688,T,IEX,1771.265000,200
2019-10-22 16:00:30.70481920,2019-10-22 16:00:30.70462809,6080705,T,IEX,1770.975000,1
2019-10-22 16:00:30.968096000,2019-10-22 16:00:30.968076979,6081995,T,IEX,1770.830000,1
2019-10-22 16:00:32.491013120,2019-10-22 16:00:32.490995595,6083918,T,IEX,1771.140000,5
2019-10-22 16:00:39.756800000,2019-10-22 16:00:39.756780361,6089609,T,IEX,1771.170000,1
2019-10-22 16:00:39.760532992,2019-10-22 16:00:39.760515382,6089710,T,IEX,1771.260000,10
2019-10-22 16:00:39.761854976,2019-10-22 16:00:39.761836790,6089744,T,IEX,1771.255000,173
2019-10-22 16:00:39.762615040,2019-10-22 16:00:39.762595690,6089764,T,IEX,1771.270000,90
2019-10-22 16:01:04.636004096,2019-10-22 16:01:04.635985992,6102836,T,IEX,1771.225000,1
2019-10-22 16:01:07.891681024,2019-10-22 16:01:07.891664655,6103796,T,IEX,1771.240000,1527
2019-10-22 16:01:31.508506112,2019-10-22 16:01:31.508486906,6115035,T,IEX,1771.050000,1
2019-10-22 16:01:40.777363968,2019-10-22 16:01:40.777343597,6118846,T,IEX,1771.310000,1
2019-10-22 16:01:42.820375040,2019-10-22 16:01:42.820356804,6119793,T,IEX,1771.395000,100
2019-10-22 16:01:45.658945024,2019-10-22 16:01:45.658925434,6123309,T,IEX,1771.400000,100
2019-10-22 16:02:02.162934016,2019-10-22 16:02:02.162915733,6131601,T,IEX,1771.880000,1
2019-10-22 16:02:06.504653056,2019-10-22 16:02:06.504632719,6133555,T,IEX,1771.875000,1
2019-10-22 16:02:09.523830016,2019-10-22 16:02:09.523813448,6134805,T,IEX,1771.875000,1
2019-10-22 16:02:11.685539072,2019-10-22 16:02:11.685519924,6135709,T,IEX,1771.875000,1
2019-10-22 16:02:53.582206976,2019-10-22 16:02:53.582188068,6153739,T,IEX,1772.240000,1
2019-10-22 16:03:05.311305984,2019-10-22 16:03:05.311286961,6159287,T,IEX,1771.930000,73
2019-10-22 16:03:22.275549952,2019-10-22 16:03:22.275529986,6167374,T,IEX,1772.085000,1
2019-10-22 16:03:31.635750912,2019-10-22 16:03:31.635730077,6171063,T,IEX,1772.070000,1
2019-10-22 16:03:35.531570944,2019-10-22 16:03:35.531551775,6172254,T,IEX,1772.320000,9
2019-10-22 16:04:06.388400128,2019-10-22 16:04:06.388382103,6187931,T,IEX,1772.475000,100
2019-10-22 16:04:06.389509120,2019-10-22 16:04:06.389490129,6187932,T,IEX,1772.650000,1
2019-10-22 16:04:06.645394944,2019-10-22 16:04:06.645376027,6187987,T,IEX,1772.650000,1
2019-10-22 16:04:22.255664128,2019-10-22 16:04:22.255642706,6194410,T,IEX,1772.575000,1
2019-10-22 16:04:53.534723072,2019-10-22 16:04:53.534701580,6206726,T,IEX,1772.450000,1
2019-10-22 16:05:12.983304960,2019-10-22 16:05:12.983285059,6215957,T,IEX,1772.990000,1
2019-10-22 16:05:12.992311040,2019-10-22 16:05:12.992294278,6216036,T,IEX,1772.945000,1
2019-10-22 16:05:29.437106944,2019-10-22 16:05:29.437088877,6225243,T,IEX,1773.085000,1
2019-10-22 16:05:57.288207872,2019-10-22 16:05:57.288183339,6235901,T,IEX,1773.270000,1
2019-10-22 16:06:21.296003072,2019-10-22 16:06:21.295983071,6247110,T,IEX,1773.325000,1
2019-10-22 16:06:49.11715072,2019-10-22 16:06:49.11695404,6260242,T,IEX,1773.530000,1
2019-10-22 16:07:20.412421888,2019-10-22 16:07:20.412402585,6272067,T,IEX,1772.845000,1
2019-10-22 16:08:35.980709120,2019-10-22 16:08:35.980690439,6303289,T,IEX,1772.240000,1
2019-10-22 16:08:35.986019072,2019-10-22 16:08:35.985999961,6303292,T,IEX,1772.245000,100
2019-10-22 16:09:13.793057024,2019-10-22 16:09:13.793037050,6318162,T,IEX,1772.800000,1
2019-10-22 16:09:40.5491968,2019-10-22 16:09:40.5472698,6328372,T,IEX,1773.190000,1
2019-10-22 16:09:40.494251008,2019-10-22 16:09:40.494235350,6328976,T,IEX,1773.275000,100
2019-10-22 16:09:45.823566080,2019-10-22 16:09:45.823548413,6330725,T,IEX,1773.370000,100
2019-10-22 16:09:46.510377984,2019-10-22 16:09:46.510359423,6331301,T,IEX,1773.420000,1
2019-10-22 16:10:50.660377088,2019-10-22 16:10:50.660361451,6359446,T,IEX,1773.660000,1
2019-10-22 16:11:09.50917120,2019-10-22 16:11:09.50897409,6366629,T,IEX,1773.755000,1
2019-10-22 16:12:15.725655040,2019-10-22 16:12:15.725636026,6393045,T,IEX,1773.900000,1
2019-10-22 16:12:17.384422912,2019-10-22 16:12:17.384406391,6393874,T,IEX,1773.770000,100
2019-10-22 16:12:20.465686016,2019-10-22 16:12:20.465666672,6394747,T,IEX,1773.695000,1
2019-10-22 16:13:03.787243008,2019-10-22 16:13:03.787225207,6409261,T,IEX,1773.105000,1
2019-10-22 16:14:10.517960960,2019-10-22 16:14:10.517939864,6438057,T,IEX,1773.530000,1
2019-10-22 16:14:51.329267968,2019-10-22 16:14:51.329249117,6454905,T,IEX,1774.160000,1
2019-10-22 16:14:55.780588032,2019-10-22 16:14:55.780564228,6457105,T,IEX,1774.350000,100
2019-10-22 16:16:07.915620096,2019-10-22 16:16:07.915600161,6481851,T,IEX,1774.130000,1
2019-10-22 16:16:30.219763968,2019-10-22 16:16:30.219740798,6491439,T,IEX,1773.645000,1
2019-10-22 16:17:13.884581120,2019-10-22 16:17:13.884561631,6509727,T,IEX,1773.420000,1
2019-10-22 16:17:16.533424128,2019-10-22 16:17:16.533405596,6511219,T,IEX,1773.580000,1
2019-10-22 16:17:16.541124096,2019-10-22 16:17:16.541104695,6511231,T,IEX,1773.535000,1
2019-10-22 16:17:38.486121984,2019-10-22 16:17:38.486101328,6520228,T,IEX,1773.900000,1
2019-10-22 16:19:01.599465984,2019-10-22 16:19:01.599444310,6553528,T,IEX,1773.920000,1
2019-10-22 16:21:01.846128896,2019-10-22 16:21:01.846111196,6607615,T,IEX,1773.620000,3
2019-10-22 16:22:15.864733952,2019-10-22 16:22:15.864709140,6634241,T,IEX,1774.280000,50
2019-10-22 16:22:52.229892096,2019-10-22 16:22:52.229873992,6648984,T,IEX,1774.230000,47
2019-10-22 16:24:02.859833088,2019-10-22 16:24:02.859810676,6678852,T,IEX,1773.560000,1
2019-10-22 16:24:03.763729920,2019-10-22 16:24:03.763711941,6679328,T,IEX,1773.865000,100
2019-10-22 16:24:24.370824960,2019-10-22 16:24:24.370806633,6688482,T,IEX,1773.900000,1
2019-10-22 16:24:36.584578048,2019-10-22 16:24:36.584559042,6692879,T,IEX,1774.120000,1
2019-10-22 16:25:42.572093952,2019-10-22 16:25:42.572075210,6717579,T,IEX,1773.540000,1
2019-10-22 16:26:09.245189120,2019-10-22 16:26:09.245164671,6725910,T,IEX,1773.830000,2
2019-10-22 16:26:09.765232896,2019-10-22 16:26:09.765213219,6726271,T,IEX,1773.815000,1
2019-10-22 16:26:10.365569024,2019-10-22 16:26:10.365550465,6726444,T,IEX,1773.935000,1
2019-10-22 16:26:21.314182912,2019-10-22 16:26:21.314164805,6730236,T,IEX,1774.260000,100
2019-10-22 16:26:23.44985088,2019-10-22 16:26:23.44967333,6730731,T,IEX,1774.120000,1
2019-10-22 16:27:01.451309056,2019-10-22 16:27:01.451292941,6744025,T,IEX,1774.060000,1
2019-10-22 16:27:22.988773120,2019-10-22 16:27:22.988754515,6752441,T,IEX,1774.240000,1
2019-10-22 16:27:40.424492032,2019-10-22 16:27:40.424471970,6758532,T,IEX,1774.470000,1
2019-10-22 16:28:10.896293888,2019-10-22 16:28:10.896278782,6769493,T,IEX,1774.610000,1
2019-10-22 16:28:26.600507904,2019-10-22 16:28:26.600489513,6776725,T,IEX,1774.605000,1
2019-10-22 16:28:52.401540096,2019-10-22 16:28:52.401524469,6789061,T,IEX,1774.845000,1
2019-10-22 16:29:02.177871872,2019-10-22 16:29:02.177853442,6791913,T,IEX,1775.010000,1
2019-10-22 16:29:13.994690048,2019-10-22 16:29:13.994669481,6799618,T,IEX,1775.040000,1
2019-10-22 16:29:22.416877056,2019-10-22 16:29:22.416857101,6803656,T,IEX,1775.020000,1
2019-10-22 16:29:35.743002112,2019-10-22 16:29:35.742983741,6809370,T,IEX,1774.765000,1
2019-10-22 16:30:35.180253952,2019-10-22 16:30:35.180234298,6834834,T,IEX,1774.615000,1
2019-10-22 16:31:31.972099072,2019-10-22 16:31:31.972078149,6853297,T,IEX,1774.620000,1
2019-10-22 16:31:57.105030912,2019-10-22 16:31:57.105012890,6861252,T,IEX,1774.775000,1
2019-10-22 16:32:28.220740096,2019-10-22 16:32:28.220716815,6873720,T,IEX,1775.000000,1
2019-10-22 16:32:28.234080000,2019-10-22 16:32:28.234061687,6874000,T,IEX,1775.100000,100
2019-10-22 16:32:33.693165056,2019-10-22 16:32:33.693146998,6876839,T,IEX,1775.330000,1
2019-10-22 16:32:51.734406912,2019-10-22 16:32:51.734387757,6886004,T,IEX,1775.160000,100
2019-10-22 16:32:54.69939968,2019-10-22 16:32:54.69922292,6886694,T,IEX,1775.210000,1
2019-10-22 16:33:01.889901056,2019-10-22 16:33:01.889880316,6890741,T,IEX,1775.530000,1
2019-10-22 16:33:16.35045120,2019-10-22 16:33:16.35020716,6896363,T,IEX,1775.590000,1
2019-10-22 16:35:21.533254912,2019-10-22 16:35:21.533236944,6947237,T,IEX,1774.545000,1
2019-10-22 16:35:22.410658048,2019-10-22 16:35:22.410637071,6947429,T,IEX,1774.545000,4
2019-10-22 16:35:31.800740096,2019-10-22 16:35:31.800716616,6950233,T,IEX,1774.590000,96
2019-10-22 16:35:31.800749056,2019-10-22 16:35:31.800731180,6950234,T,IEX,1774.590000,100
2019-10-22 16:35:31.800762880,2019-10-22 16:35:31.800746828,6950235,T,IEX,1774.590000,4
2019-10-22 16:36:52.94747904,2019-10-22 16:36:52.94727097,6978868,T,IEX,1774.150000,46
2019-10-22 16:36:52.94970880,2019-10-22 16:36:52.94952013,6978871,T,IEX,1774.150000,54
2019-10-22 16:36:52.102386944,2019-10-22 16:36:52.102369470,6978903,T,IEX,1773.935000,1
2019-10-22 16:37:27.602070016,2019-10-22 16:37:27.602049671,6992907,T,IEX,1774.035000,3
2019-10-22 16:38:12.296593920,2019-10-22 16:38:12.296574951,7006815,T,IEX,1773.850000,1
2019-10-22 16:38:12.321305088,2019-10-22 16:38:12.321288021,7007264,T,IEX,1773.840000,1
2019-10-22 16:39:01.453985024,2019-10-22 16:39:01.453966385,7023282,T,IEX,1773.900000,1
2019-10-22 16:39:17.325082880,2019-10-22 16:39:17.325066058,7029720,T,IEX,1774.070000,100
2019-10-22 16:39:17.325345024,2019-10-22 16:39:17.325326800,7029722,T,IEX,1774.070000,100
2019-10-22 16:39:30.482917120,2019-10-22 16:39:30.482895484,7034190,T,IEX,1774.050000,100
2019-10-22 16:39:30.493020928,2019-10-22 16:39:30.493003208,7034201,T,IEX,1773.815000,100
2019-10-22 16:39:31.380059904,2019-10-22 16:39:31.380040728,7034467,T,IEX,1773.670000,100
2019-10-22 16:39:31.421658880,2019-10-22 16:39:31.421641124,7034480,T,IEX,1773.430000,14
2019-10-22 16:39:31.421669888,2019-10-22 16:39:31.421654196,7034481,T,IEX,1773.390000,86
2019-10-22 16:39:34.899901952,2019-10-22 16:39:34.899881054,7035705,T,IEX,1773.670000,1
2019-10-22 16:39:36.619529984,2019-10-22 16:39:36.619510011,7036181,T,IEX,1773.670000,1
2019-10-22 16:40:06.265036032,2019-10-22 16:40:06.265016967,7045476,T,IEX,1773.585000,1
2019-10-22 16:41:22.606861056,2019-10-22 16:41:22.606842683,7074356,T,IEX,1773.750000,1
2019-10-22 16:41:56.10347008,2019-10-22 16:41:56.10327114,7085403,T,IEX,1773.695000,1
2019-10-22 16:42:10.624670976,2019-10-22 16:42:10.624655350,7090234,T,IEX,1773.760000,100
2019-10-22 16:42:27.339482112,2019-10-22 16:42:27.339460446,7096394,T,IEX,1774.170000,1
2019-10-22 16:42:45.226520064,2019-10-22 16:42:45.226504281,7103132,T,IEX,1774.240000,5
2019-10-22 16:42:45.226670080,2019-10-22 16:42:45.226651693,7103133,T,IEX,1774.120000,100
2019-10-22 16:42:45.226757120,2019-10-22 16:42:45.226736631,7103134,T,IEX,1774.200000,5
2019-10-22 16:42:45.226842112,2019-10-22 16:42:45.226823973,7103135,T,IEX,1774.200000,50
2019-10-22 16:42:45.227208960,2019-10-22 16:42:45.227192962,7103136,T,IEX,1774.200000,5
2019-10-22 16:42:45.227247104,2019-10-22 16:42:45.227228068,7103137,T,IEX,1774.200000,5
2019-10-22 16:42:45.227501056,2019-10-22 16:42:45.227482506,7103139,T,IEX,1774.200000,30
2019-10-22 16:42:48.107343872,2019-10-22 16:42:48.107322800,7104091,T,IEX,1774.185000,1
2019-10-22 16:42:48.107352064,2019-10-22 16:42:48.107334893,7104092,T,IEX,1774.185000,1
2019-10-22 16:43:29.624647936,2019-10-22 16:43:29.624630097,7118735,T,IEX,1774.280000,100
2019-10-22 16:43:29.624730880,2019-10-22 16:43:29.624710725,7118737,T,IEX,1774.320000,1
2019-10-22 16:44:35.607483904,2019-10-22 16:44:35.607465392,7141805,T,IEX,1774.160000,1
2019-10-22 16:45:22.511113984,2019-10-22 16:45:22.511095984,7158571,T,IEX,1774.265000,100
2019-10-22 16:45:22.511136000,2019-10-22 16:45:22.511118501,7158572,T,IEX,1774.265000,1
2019-10-22 16:45:39.834703872,2019-10-22 16:45:39.834685275,7165185,T,IEX,1774.165000,1
2019-10-22 16:45:39.835343872,2019-10-22 16:45:39.835323596,7165186,T,IEX,1774.235000,100
2019-10-22 16:45:51.905714944,2019-10-22 16:45:51.905693048,7169538,T,IEX,1774.195000,1
2019-10-22 16:45:56.525538048,2019-10-22 16:45:56.525515628,7172803,T,IEX,1774.460000,1
2019-10-22 16:46:13.733551104,2019-10-22 16:46:13.733531758,7179740,T,IEX,1774.270000,100
2019-10-22 16:46:25.346582016,2019-10-22 16:46:25.346559925,7183054,T,IEX,1774.575000,100
2019-10-22 16:46:25.619638016,2019-10-22 16:46:25.619619037,7183158,T,IEX,1774.575000,1
2019-10-22 16:47:13.264875008,2019-10-22 16:47:13.264857049,7200481,T,IEX,1774.915000,1
2019-10-22 16:47:19.687459072,2019-10-22 16:47:19.687434552,7203555,T,IEX,1774.600000,1
2019-10-22 16:48:01.804605952,2019-10-22 16:48:01.804586276,7216730,T,IEX,1774.660000,1
2019-10-22 16:48:46.194560000,2019-10-22 16:48:46.194539875,7232956,T,IEX,1774.435000,100
2019-10-22 16:49:09.201427968,2019-10-22 16:49:09.201406040,7242433,T,IEX,1773.830000,100
2019-10-22 16:49:09.202680064,2019-10-22 16:49:09.202660192,7242434,T,IEX,1773.830000,100
2019-10-22 16:49:42.901719040,2019-10-22 16:49:42.901697851,7256036,T,IEX,1774.075000,1
2019-10-22 16:49:44.114842880,2019-10-22 16:49:44.114824024,7256627,T,IEX,1774.075000,3
2019-10-22 16:50:00.961555968,2019-10-22 16:50:00.961538958,7263333,T,IEX,1774.080000,100
2019-10-22 16:50:00.981470976,2019-10-22 16:50:00.981450116,7263344,T,IEX,1774.135000,1
2019-10-22 16:51:31.293519872,2019-10-22 16:51:31.293502075,7298827,T,IEX,1774.170000,1
2019-10-22 16:51:59.668254976,2019-10-22 16:51:59.668234841,7309149,T,IEX,1774.000000,5
2019-10-22 16:52:17.538725120,2019-10-22 16:52:17.538705483,7315793,T,IEX,1774.040000,2
2019-10-22 16:52:17.546574080,2019-10-22 16:52:17.546552821,7315796,T,IEX,1774.130000,2
2019-10-22 16:52:44.487589888,2019-10-22 16:52:44.487569469,7326061,T,IEX,1773.840000,1
2019-10-22 16:52:44.487822080,2019-10-22 16:52:44.487803097,7326069,T,IEX,1773.795000,100
2019-10-22 16:52:51.352828928,2019-10-22 16:52:51.352807212,7328370,T,IEX,1774.020000,1
2019-10-22 16:52:51.359643904,2019-10-22 16:52:51.359621465,7328372,T,IEX,1774.020000,1
2019-10-22 16:53:08.414982912,2019-10-22 16:53:08.414965750,7333800,T,IEX,1774.095000,100
2019-10-22 16:53:11.845565952,2019-10-22 16:53:11.845547264,7335653,T,IEX,1774.095000,200
2019-10-22 16:53:11.850810112,2019-10-22 16:53:11.850791656,7335687,T,IEX,1774.095000,1
2019-10-22 16:53:11.853702912,2019-10-22 16:53:11.853681234,7335702,T,IEX,1774.175000,200
2019-10-22 16:53:55.783516928,2019-10-22 16:53:55.783499490,7351543,T,IEX,1774.480000,1
2019-10-22 16:55:26.144442880,2019-10-22 16:55:26.144423662,7381912,T,IEX,1773.780000,100
2019-10-22 16:55:26.144460032,2019-10-22 16:55:26.144441712,7381913,T,IEX,1773.780000,100
2019-10-22 16:55:41.266696960,2019-10-22 16:55:41.266679765,7386851,T,IEX,1773.805000,1
2019-10-22 16:56:52.423792896,2019-10-22 16:56:52.423770195,7408756,T,IEX,1773.450000,1
2019-10-22 16:57:04.874718976,2019-10-22 16:57:04.874700490,7412586,T,IEX,1773.580000,1
2019-10-22 16:57:05.769486080,2019-10-22 16:57:05.769465519,7413225,T,IEX,1773.520000,100
2019-10-22 16:57:05.774515968,2019-10-22 16:57:05.774494972,7413230,T,IEX,1773.520000,1
2019-10-22 16:57:15.2728960,2019-10-22 16:57:15.2710067,7417150,T,IEX,1773.650000,10
2019-10-22 16:57:20.379075072,2019-10-22 16:57:20.379058501,7419502,T,IEX,1773.610000,100
2019-10-22 16:57:20.384197120,2019-10-22 16:57:20.384179358,7419516,T,IEX,1773.610000,1
2019-10-22 16:57:58.877182976,2019-10-22 16:57:58.877162390,7431750,T,IEX,1773.660000,2
2019-10-22 16:58:13.329554944,2019-10-22 16:58:13.329534086,7436578,T,IEX,1773.500000,100
2019-10-22 16:58:28.721903104,2019-10-22 16:58:28.721883663,7440452,T,IEX,1773.525000,1
2019-10-22 16:58:36.114875904,2019-10-22 16:58:36.114857181,7442918,T,IEX,1773.525000,100
2019-10-22 16:58:50.95105024,2019-10-22 16:58:50.95087604,7447574,T,IEX,1773.550000,1
2019-10-22 16:58:55.688528896,2019-10-22 16:58:55.688512756,7450517,T,IEX,1773.740000,100
2019-10-22 16:59:17.59729920,2019-10-22 16:59:17.59709392,7456957,T,IEX,1773.770000,1
2019-10-22 16:59:17.699205888,2019-10-22 16:59:17.699187450,7457239,T,IEX,1773.725000,100
2019-10-22 16:59:25.93595904,2019-10-22 16:59:25.93577137,7460094,T,IEX,1773.925000,100
2019-10-22 16:59:33.650541056,2019-10-22 16:59:33.650523666,7462960,T,IEX,1773.925000,1
2019-10-22 16:59:39.773718016,2019-10-22 16:59:39.773698196,7464540,T,IEX,1773.925000,100
2019-10-22 16:59:56.586676992,2019-10-22 16:59:56.586661731,7471121,T,IEX,1773.925000,100
2019-10-22 17:00:01.747833088,2019-10-22 17:00:01.747813813,7473569,T,IEX,1773.805000,200
2019-10-22 17:00:02.649357056,2019-10-22 17:00:02.649339905,7474080,T,IEX,1773.650000,100
2019-10-22 17:00:13.333003008,2019-10-22 17:00:13.332983895,7478372,T,IEX,1773.645000,3100
2019-10-22 17:00:20.489030912,2019-10-22 17:00:20.489010537,7480940,T,IEX,1773.985000,1
2019-10-22 17:00:20.489040896,2019-10-22 17:00:20.489023005,7480941,T,IEX,1773.985000,100
2019-10-22 17:00:31.743801088,2019-10-22 17:00:31.743782031,7484828,T,IEX,1774.020000,1
2019-10-22 17:00:39.686989056,2019-10-22 17:00:39.686969265,7487700,T,IEX,1774.015000,1
2019-10-22 17:00:58.104957952,2019-10-22 17:00:58.104937347,7492300,T,IEX,1773.965000,1
2019-10-22 17:01:30.558440960,2019-10-22 17:01:30.558425092,7500907,T,IEX,1774.070000,6
2019-10-22 17:01:30.567858944,2019-10-22 17:01:30.567836621,7500910,T,IEX,1774.035000,100
2019-10-22 17:01:31.786120960,2019-10-22 17:01:31.786097036,7501213,T,IEX,1774.105000,1
2019-10-22 17:02:02.169952000,2019-10-22 17:02:02.169934217,7513874,T,IEX,1773.780000,100
2019-10-22 17:02:07.536816128,2019-10-22 17:02:07.536791762,7517606,T,IEX,1773.660000,1
2019-10-22 17:03:23.430380032,2019-10-22 17:03:23.430361442,7546002,T,IEX,1771.660000,50
2019-10-22 17:03:23.430394112,2019-10-22 17:03:23.430376679,7546003,T,IEX,1771.650000,50
2019-10-22 17:03:23.432070912,2019-10-22 17:03:23.432052061,7546004,T,IEX,1771.650000,50
2019-10-22 17:03:23.432083968,2019-10-22 17:03:23.432065270,7546005,T,IEX,1771.650000,50
2019-10-22 17:03:23.433693952,2019-10-22 17:03:23.433674454,7546006,T,IEX,1771.650000,50
2019-10-22 17:03:23.433705984,2019-10-22 17:03:23.433685303,7546007,T,IEX,1771.570000,100
2019-10-22 17:03:23.433714944,2019-10-22 17:03:23.433697677,7546008,T,IEX,1771.560000,100
2019-10-22 17:03:23.433726976,2019-10-22 17:03:23.433710167,7546009,T,IEX,1771.560000,50
2019-10-22 17:03:32.831366912,2019-10-22 17:03:32.831350047,7555127,T,IEX,1770.975000,100
2019-10-22 17:03:33.409276928,2019-10-22 17:03:33.409257546,7555536,T,IEX,1770.940000,50
2019-10-22 17:03:38.264999936,2019-10-22 17:03:38.264979434,7557439,T,IEX,1771.390000,100
2019-10-22 17:03:38.265601024,2019-10-22 17:03:38.265584350,7557445,T,IEX,1771.390000,100
2019-10-22 17:03:38.727228928,2019-10-22 17:03:38.727207619,7557574,T,IEX,1771.620000,100
2019-10-22 17:03:55.692193024,2019-10-22 17:03:55.692176906,7565187,T,IEX,1771.650000,100
2019-10-22 17:03:59.822707968,2019-10-22 17:03:59.822684732,7567032,T,IEX,1772.020000,80
2019-10-22 17:04:13.804100096,2019-10-22 17:04:13.804079497,7574880,T,IEX,1772.500000,34
2019-10-22 17:04:26.762992128,2019-10-22 17:04:26.762969458,7580337,T,IEX,1771.880000,100
2019-10-22 17:05:28.692828928,2019-10-22 17:05:28.692810646,7599552,T,IEX,1772.460000,100
2019-10-22 17:06:11.88940032,2019-10-22 17:06:11.88920857,7612162,T,IEX,1772.360000,100
2019-10-22 17:07:15.461177088,2019-10-22 17:07:15.461158250,7631915,T,IEX,1771.920000,50
2019-10-22 17:07:15.461195008,2019-10-22 17:07:15.461178018,7631916,T,IEX,1771.820000,50
2019-10-22 17:07:46.302763008,2019-10-22 17:07:46.302745719,7641605,T,IEX,1771.850000,100
2019-10-22 17:08:17.511739904,2019-10-22 17:08:17.511718857,7651748,T,IEX,1771.070000,20
2019-10-22 17:09:08.901765120,2019-10-22 17:09:08.901744566,7668856,T,IEX,1771.630000,100
2019-10-22 17:09:09.635085056,2019-10-22 17:09:09.635066459,7669048,T,IEX,1771.695000,100
2019-10-22 17:10:04.449300992,2019-10-22 17:10:04.449282199,7685184,T,IEX,1771.740000,100
2019-10-22 17:10:04.450353920,2019-10-22 17:10:04.450336821,7685186,T,IEX,1771.740000,100
2019-10-22 17:10:04.451468032,2019-10-22 17:10:04.451450034,7685187,T,IEX,1771.740000,43
2019-10-22 17:11:26.545818880,2019-10-22 17:11:26.545798649,7712796,T,IEX,1771.730000,100
2019-10-22 17:13:10.369817088,2019-10-22 17:13:10.369799205,7744258,T,IEX,1772.010000,100
2019-10-22 17:13:53.207429888,2019-10-22 17:13:53.207414101,7758655,T,IEX,1772.005000,100
2019-10-22 17:14:34.950065920,2019-10-22 17:14:34.950047012,7780578,T,IEX,1772.695000,100
2019-10-22 17:15:16.417137920,2019-10-22 17:15:16.417121260,7802012,T,IEX,1772.610000,100
2019-10-22 17:15:35.633424896,2019-10-22 17:15:35.633404333,7808313,T,IEX,1772.075000,100
2019-10-22 17:20:23.179881984,2019-10-22 17:20:23.179865017,7893723,T,IEX,1771.565000,100
2019-10-22 17:23:15.535228928,2019-10-22 17:23:15.535203005,7945520,T,IEX,1772.490000,100
2019-10-22 17:23:46.817712128,2019-10-22 17:23:46.817690859,7955361,T,IEX,1772.320000,3
2019-10-22 17:23:49.662955008,2019-10-22 17:23:49.662936151,7956026,T,IEX,1772.320000,100
2019-10-22 17:29:10.298883072,2019-10-22 17:29:10.298867497,8045717,T,IEX,1772.370000,16
2019-10-22 17:32:29.715078912,2019-10-22 17:32:29.715060228,8103209,T,IEX,1771.425000,100
2019-10-22 17:33:29.867962880,2019-10-22 17:33:29.867942432,8124097,T,IEX,1771.360000,100
2019-10-22 17:35:42.166723072,2019-10-22 17:35:42.166702142,8168033,T,IEX,1771.330000,100
2019-10-22 17:35:42.166737920,2019-10-22 17:35:42.166721000,8168034,T,IEX,1771.310000,37
2019-10-22 17:36:49.870829056,2019-10-22 17:36:49.870809554,8190246,T,IEX,1770.650000,45
2019-10-22 17:36:49.870995968,2019-10-22 17:36:49.870978294,8190249,T,IEX,1770.650000,12
2019-10-22 17:36:49.871197952,2019-10-22 17:36:49.871180749,8190253,T,IEX,1770.650000,43
2019-10-22 17:37:26.623708928,2019-10-22 17:37:26.623685734,8203109,T,IEX,1770.980000,100
2019-10-22 17:37:29.76162048,2019-10-22 17:37:29.76142226,8203934,T,IEX,1771.040000,19
2019-10-22 17:37:29.76569088,2019-10-22 17:37:29.76550167,8203950,T,IEX,1771.040000,81
2019-10-22 17:38:41.199055872,2019-10-22 17:38:41.199035577,8230834,T,IEX,1771.470000,5
2019-10-22 17:38:42.218624000,2019-10-22 17:38:42.218606779,8231530,T,IEX,1771.610000,10
2019-10-22 17:38:42.235909888,2019-10-22 17:38:42.235888900,8231541,T,IEX,1771.610000,40
2019-10-22 17:39:19.743843072,2019-10-22 17:39:19.743824366,8243957,T,IEX,1771.480000,50
2019-10-22 17:42:59.339838976,2019-10-22 17:42:59.339819713,8324262,T,IEX,1772.040000,1
2019-10-22 17:43:59.15635968,2019-10-22 17:43:59.15621340,8340595,T,IEX,1771.770000,5
2019-10-22 17:45:05.376596992,2019-10-22 17:45:05.376572525,8361504,T,IEX,1771.100000,47
2019-10-22 17:45:05.376774912,2019-10-22 17:45:05.376754523,8361506,T,IEX,1771.100000,53
2019-10-22 17:45:05.624251904,2019-10-22 17:45:05.624233897,8361603,T,IEX,1771.230000,5
2019-10-22 17:45:10.730210048,2019-10-22 17:45:10.730188622,8364064,T,IEX,1771.480000,1
2019-10-22 17:45:10.741037056,2019-10-22 17:45:10.741014632,8364065,T,IEX,1771.365000,100
2019-10-22 17:45:39.409532928,2019-10-22 17:45:39.409511443,8373050,T,IEX,1771.280000,1
2019-10-22 17:48:01.432581120,2019-10-22 17:48:01.432562965,8414865,T,IEX,1770.620000,15
2019-10-22 17:49:36.662971904,2019-10-22 17:49:36.662951236,8443477,T,IEX,1770.860000,100
2019-10-22 17:50:09.982618112,2019-10-22 17:50:09.982599259,8454707,T,IEX,1771.220000,100
2019-10-22 17:53:19.554650112,2019-10-22 17:53:19.554629338,8523022,T,IEX,1769.010000,100
2019-10-22 17:54:17.254392064,2019-10-22 17:54:17.254373662,8545015,T,IEX,1768.080000,50
2019-10-22 17:54:17.254405888,2019-10-22 17:54:17.254388648,8545016,T,IEX,1768.010000,50
2019-10-22 17:54:35.42426112,2019-10-22 17:54:35.42407615,8551833,T,IEX,1768.700000,100
2019-10-22 17:55:54.715344896,2019-10-22 17:55:54.715325507,8580511,T,IEX,1767.470000,15
2019-10-22 17:55:54.773748992,2019-10-22 17:55:54.773727792,8580542,T,IEX,1767.020000,5
2019-10-22 17:57:05.558285056,2019-10-22 17:57:05.558265586,8612387,T,IEX,1768.145000,100
2019-10-22 17:57:05.558299904,2019-10-22 17:57:05.558281866,8612388,T,IEX,1768.145000,100
2019-10-22 17:57:51.419586048,2019-10-22 17:57:51.419562879,8633159,T,IEX,1768.270000,1
2019-10-22 17:59:23.708385024,2019-10-22 17:59:23.708366679,8665772,T,IEX,1767.490000,2
2019-10-22 17:59:52.880314112,2019-10-22 17:59:52.880294323,8677752,T,IEX,1768.020000,1
2019-10-22 18:00:29.623388928,2019-10-22 18:00:29.623370559,8696035,T,IEX,1767.980000,100
2019-10-22 18:02:31.398596096,2019-10-22 18:02:31.398577122,8747242,T,IEX,1768.340000,100
2019-10-22 18:05:27.991934976,2019-10-22 18:05:27.991915356,8809763,T,IEX,1768.940000,1
2019-10-22 18:08:27.156710912,2019-10-22 18:08:27.156689822,8875954,T,IEX,1768.830000,100
2019-10-22 18:09:06.187232000,2019-10-22 18:09:06.187210457,8888385,T,IEX,1768.350000,100
2019-10-22 18:09:58.157928960,2019-10-22 18:09:58.157910790,8906403,T,IEX,1768.990000,100
2019-10-22 18:10:03.608084992,2019-10-22 18:10:03.608065532,8908893,T,IEX,1769.140000,100
2019-10-22 18:11:06.488621056,2019-10-22 18:11:06.488603263,8931066,T,IEX,1769.830000,100
2019-10-22 18:11:06.488636928,2019-10-22 18:11:06.488618740,8931067,T,IEX,1769.830000,100
2019-10-22 18:12:05.315072000,2019-10-22 18:12:05.315053116,8956449,T,IEX,1770.420000,100
2019-10-22 18:16:12.115023872,2019-10-22 18:16:12.115005438,9064014,T,IEX,1771.180000,100
2019-10-22 18:18:36.898757888,2019-10-22 18:18:36.898738400,9118689,T,IEX,1770.470000,2
2019-10-22 18:22:19.342057984,2019-10-22 18:22:19.342038116,9232012,T,IEX,1771.570000,1
2019-10-22 18:22:39.831121920,2019-10-22 18:22:39.831101321,9246131,T,IEX,1770.830000,127
2019-10-22 18:25:02.373058048,2019-10-22 18:25:02.373040699,9326108,T,IEX,1770.410000,100
2019-10-22 18:25:20.887042048,2019-10-22 18:25:20.887018713,9335305,T,IEX,1771.075000,100
2019-10-22 18:25:20.888385024,2019-10-22 18:25:20.888366597,9335310,T,IEX,1771.260000,1
2019-10-22 18:25:20.888399104,2019-10-22 18:25:20.888380015,9335311,T,IEX,1771.510000,100
2019-10-22 18:25:20.907557888,2019-10-22 18:25:20.907537017,9335336,T,IEX,1771.680000,100
2019-10-22 18:28:26.140730880,2019-10-22 18:28:26.140713705,9435797,T,IEX,1771.040000,100
2019-10-22 18:28:56.663191040,2019-10-22 18:28:56.663174071,9455691,T,IEX,1771.310000,100
2019-10-22 18:29:58.252443904,2019-10-22 18:29:58.252424868,9501198,T,IEX,1770.730000,100
2019-10-22 18:30:04.405261056,2019-10-22 18:30:04.405231725,9528762,T,IEX,1771.540000,9
2019-10-22 18:30:04.420950016,2019-10-22 18:30:04.420931147,9529397,T,IEX,1770.920000,10
2019-10-22 18:30:04.429076992,2019-10-22 18:30:04.429057822,9529674,T,IEX,1770.880000,10
2019-10-22 18:30:35.648071936,2019-10-22 18:30:35.648052705,9591935,T,IEX,1770.260000,5
2019-10-22 18:31:00.759176960,2019-10-22 18:31:00.759157140,9626934,T,IEX,1770.180000,100
2019-10-22 18:31:04.294812928,2019-10-22 18:31:04.294795146,9632358,T,IEX,1769.890000,8
2019-10-22 18:31:06.935429120,2019-10-22 18:31:06.935413107,9637236,T,IEX,1770.445000,100
2019-10-22 18:31:40.525739008,2019-10-22 18:31:40.525717903,9671077,T,IEX,1770.020000,50
2019-10-22 18:31:41.22458112,2019-10-22 18:31:41.22438800,9673451,T,IEX,1769.780000,9
2019-10-22 18:31:57.698874880,2019-10-22 18:31:57.698857075,9695091,T,IEX,1769.320000,100
2019-10-22 18:32:04.100762880,2019-10-22 18:32:04.100742756,9711697,T,IEX,1768.580000,109
2019-10-22 18:32:42.533750016,2019-10-22 18:32:42.533731395,9756845,T,IEX,1768.380000,5
2019-10-22 18:33:02.204513024,2019-10-22 18:33:02.204494596,9781804,T,IEX,1768.320000,6
2019-10-22 18:33:14.998720000,2019-10-22 18:33:14.998696313,9797172,T,IEX,1768.030000,7
2019-10-22 18:33:38.942519040,2019-10-22 18:33:38.942498822,9834525,T,IEX,1767.420000,11
2019-10-22 18:34:34.852561920,2019-10-22 18:34:34.852537258,9896266,T,IEX,1767.805000,9
2019-10-22 18:34:38.157455872,2019-10-22 18:34:38.157440581,9898165,T,IEX,1767.670000,100
2019-10-22 18:34:45.347980032,2019-10-22 18:34:45.347958289,9902180,T,IEX,1767.870000,100
2019-10-22 18:35:15.242580992,2019-10-22 18:35:15.242563448,9928909,T,IEX,1768.100000,10
2019-10-22 18:36:16.705786112,2019-10-22 18:36:16.705767683,9981750,T,IEX,1767.920000,41
2019-10-22 18:36:16.705920000,2019-10-22 18:36:16.705902215,9981757,T,IEX,1767.920000,59
2019-10-22 18:36:27.780026112,2019-10-22 18:36:27.780006208,9992099,T,IEX,1768.310000,7
2019-10-22 18:37:12.565065984,2019-10-22 18:37:12.565048052,10019212,T,IEX,1768.245000,10
2019-10-22 18:37:32.747653888,2019-10-22 18:37:32.747634327,10035272,T,IEX,1769.160000,10
2019-10-22 18:37:45.887065088,2019-10-22 18:37:45.887045624,10044996,T,IEX,1768.775000,50
2019-10-22 18:38:20.475950080,2019-10-22 18:38:20.475931018,10065713,T,IEX,1769.385000,1
2019-10-22 18:38:33.857447936,2019-10-22 18:38:33.857427069,10071054,T,IEX,1769.360000,5
2019-10-22 18:38:39.843446016,2019-10-22 18:38:39.843428202,10073650,T,IEX,1769.415000,3
2019-10-22 18:39:09.916923904,2019-10-22 18:39:09.916905299,10087949,T,IEX,1768.905000,10
2019-10-22 18:40:03.776400896,2019-10-22 18:40:03.776386050,10118919,T,IEX,1768.745000,200
2019-10-22 18:40:10.381922048,2019-10-22 18:40:10.381902310,10122368,T,IEX,1768.710000,6
2019-10-22 18:40:18.907653120,2019-10-22 18:40:18.907630767,10128190,T,IEX,1768.710000,18
2019-10-22 18:40:22.506397952,2019-10-22 18:40:22.506379433,10131193,T,IEX,1768.595000,12
2019-10-22 18:41:34.99931904,2019-10-22 18:41:34.99911434,10177033,T,IEX,1768.750000,100
2019-10-22 18:41:34.101134080,2019-10-22 18:41:34.101116200,10177080,T,IEX,1768.750000,100
2019-10-22 18:41:37.958300928,2019-10-22 18:41:37.958284357,10178825,T,IEX,1768.700000,9
2019-10-22 18:42:05.241089024,2019-10-22 18:42:05.241069554,10194202,T,IEX,1768.520000,8
2019-10-22 18:43:46.221089024,2019-10-22 18:43:46.221069413,10241802,T,IEX,1768.505000,6
2019-10-22 18:43:52.424559104,2019-10-22 18:43:52.424538975,10244202,T,IEX,1768.470000,3
2019-10-22 18:44:45.77974016,2019-10-22 18:44:45.77955883,10283072,T,IEX,1767.975000,300
2019-10-22 18:44:49.587824128,2019-10-22 18:44:49.587805909,10285381,T,IEX,1767.930000,7
2019-10-22 18:44:50.951473920,2019-10-22 18:44:50.951457171,10286414,T,IEX,1767.895000,3
2019-10-22 18:45:06.583475968,2019-10-22 18:45:06.583459915,10295994,T,IEX,1767.315000,100
2019-10-22 18:45:33.721423872,2019-10-22 18:45:33.721408133,10317771,T,IEX,1766.660000,100
2019-10-22 18:45:37.698125056,2019-10-22 18:45:37.698106683,10322175,T,IEX,1766.525000,9
2019-10-22 18:46:02.537673984,2019-10-22 18:46:02.537652163,10343278,T,IEX,1765.980000,3
2019-10-22 18:46:28.287267072,2019-10-22 18:46:28.287247565,10361580,T,IEX,1766.175000,10
2019-10-22 18:47:25.758089984,2019-10-22 18:47:25.758063865,10402282,T,IEX,1766.200000,100
2019-10-22 18:47:36.129408000,2019-10-22 18:47:36.129390996,10408693,T,IEX,1766.000000,11
2019-10-22 18:48:06.382552064,2019-10-22 18:48:06.382534004,10426226,T,IEX,1765.610000,8
2019-10-22 18:49:27.184755968,2019-10-22 18:49:27.184735755,10477959,T,IEX,1765.920000,5
2019-10-22 18:49:27.185702912,2019-10-22 18:49:27.185679420,10477974,T,IEX,1765.910000,4
2019-10-22 18:50:15.718519040,2019-10-22 18:50:15.718500383,10504684,T,IEX,1766.450000,100
2019-10-22 18:50:27.57073920,2019-10-22 18:50:27.57051505,10509338,T,IEX,1766.100000,11
2019-10-22 18:50:27.60642048,2019-10-22 18:50:27.60619368,10509476,T,IEX,1766.050000,6
2019-10-22 18:50:39.319879936,2019-10-22 18:50:39.319861515,10519432,T,IEX,1765.700000,4
2019-10-22 18:51:07.745547008,2019-10-22 18:51:07.745530271,10541920,T,IEX,1764.805000,1
2019-10-22 18:51:07.745562880,2019-10-22 18:51:07.745547482,10541921,T,IEX,1764.805000,4
2019-10-22 18:51:40.622274048,2019-10-22 18:51:40.622254425,10575343,T,IEX,1765.370000,9
2019-10-22 18:52:02.806322944,2019-10-22 18:52:02.806302811,10590987,T,IEX,1765.085000,200
2019-10-22 18:52:26.699066880,2019-10-22 18:52:26.699044361,10608251,T,IEX,1765.140000,11
2019-10-22 18:52:47.58096896,2019-10-22 18:52:47.58077462,10631707,T,IEX,1764.540000,200
2019-10-22 18:52:50.69969920,2019-10-22 18:52:50.69949058,10634200,T,IEX,1764.670000,200
2019-10-22 18:53:14.693176064,2019-10-22 18:53:14.693155690,10657717,T,IEX,1765.870000,100
2019-10-22 18:53:21.484599040,2019-10-22 18:53:21.484577495,10661809,T,IEX,1765.460000,7
2019-10-22 18:54:10.209817088,2019-10-22 18:54:10.209801087,10691860,T,IEX,1765.510000,11
2019-10-22 18:54:52.184844032,2019-10-22 18:54:52.184824371,10709020,T,IEX,1765.340000,8
2019-10-22 18:55:34.16272896,2019-10-22 18:55:34.16253375,10732897,T,IEX,1765.800000,100
2019-10-22 18:55:49.510388992,2019-10-22 18:55:49.510369260,10744238,T,IEX,1766.650000,100
2019-10-22 18:55:56.635386112,2019-10-22 18:55:56.635364250,10749259,T,IEX,1766.630000,10
2019-10-22 18:56:26.73025024,2019-10-22 18:56:26.73007308,10767204,T,IEX,1766.310000,5
2019-10-22 18:56:52.604794112,2019-10-22 18:56:52.604776392,10781651,T,IEX,1766.505000,3
2019-10-22 18:57:52.439031040,2019-10-22 18:57:52.439012322,10811497,T,IEX,1766.485000,6
2019-10-22 18:58:16.263580928,2019-10-22 18:58:16.263560793,10824927,T,IEX,1765.600000,100
2019-10-22 18:58:38.93364992,2019-10-22 18:58:38.93345384,10837380,T,IEX,1764.980000,10
2019-10-22 18:59:07.426961920,2019-10-22 18:59:07.426945159,10861039,T,IEX,1764.270000,1
2019-10-22 18:59:19.373404928,2019-10-22 18:59:19.373386165,10871856,T,IEX,1763.830000,1
2019-10-22 18:59:44.12236032,2019-10-22 18:59:44.12220613,10894053,T,IEX,1764.690000,1
2019-10-22 18:59:48.917694976,2019-10-22 18:59:48.917676524,10897347,T,IEX,1764.670000,1
2019-10-22 18:59:58.213387008,2019-10-22 18:59:58.213363636,10903344,T,IEX,1764.580000,1
2019-10-22 19:00:00.507386880,2019-10-22 19:00:00.507366801,10908385,T,IEX,1764.510000,1
2019-10-22 19:00:07.633947904,2019-10-22 19:00:07.633927401,10916269,T,IEX,1764.560000,1
2019-10-22 19:00:08.8104960,2019-10-22 19:00:08.8086849,10917023,T,IEX,1764.075000,1
2019-10-22 19:00:28.147173120,2019-10-22 19:00:28.147152877,10933517,T,IEX,1764.820000,100
2019-10-22 19:00:29.928865024,2019-10-22 19:00:29.928846406,10934634,T,IEX,1764.695000,1
2019-10-22 19:00:29.936978944,2019-10-22 19:00:29.936958447,10934636,T,IEX,1764.695000,1
2019-10-22 19:01:12.641568000,2019-10-22 19:01:12.641550458,10963563,T,IEX,1763.450000,1
2019-10-22 19:02:06.82863104,2019-10-22 19:02:06.82845641,10993215,T,IEX,1763.025000,1
2019-10-22 19:02:06.88488960,2019-10-22 19:02:06.88473131,10993238,T,IEX,1763.025000,100
2019-10-22 19:02:19.272398080,2019-10-22 19:02:19.272378301,11000828,T,IEX,1763.035000,100
2019-10-22 19:04:28.190657024,2019-10-22 19:04:28.190629615,11111293,T,IEX,1762.700000,100
2019-10-22 19:05:17.927110912,2019-10-22 19:05:17.927091486,11155044,T,IEX,1762.800000,99
2019-10-22 19:05:22.314672896,2019-10-22 19:05:22.314652138,11159849,T,IEX,1762.730000,100
2019-10-22 19:05:26.88871936,2019-10-22 19:05:26.88850983,11162752,T,IEX,1762.885000,100
2019-10-22 19:06:38.54948096,2019-10-22 19:06:38.54929625,11207672,T,IEX,1764.075000,10
2019-10-22 19:06:38.55126016,2019-10-22 19:06:38.55106351,11207677,T,IEX,1764.075000,32
2019-10-22 19:06:38.55143936,2019-10-22 19:06:38.55126524,11207678,T,IEX,1764.290000,68
2019-10-22 19:06:40.554302976,2019-10-22 19:06:40.554283511,11210328,T,IEX,1764.290000,32
2019-10-22 19:07:26.363392000,2019-10-22 19:07:26.363370366,11240900,T,IEX,1765.000000,100
2019-10-22 19:07:26.364756992,2019-10-22 19:07:26.364735371,11240901,T,IEX,1765.000000,100
2019-10-22 19:07:26.366493952,2019-10-22 19:07:26.366474479,11240902,T,IEX,1765.000000,100
2019-10-22 19:08:22.699951104,2019-10-22 19:08:22.699933379,11269920,T,IEX,1765.350000,1
2019-10-22 19:08:37.267368960,2019-10-22 19:08:37.267350954,11275689,T,IEX,1765.420000,1
2019-10-22 19:09:55.757923072,2019-10-22 19:09:55.757900609,11316431,T,IEX,1765.320000,100
2019-10-22 19:11:49.477735936,2019-10-22 19:11:49.477716124,11381781,T,IEX,1765.720000,50
2019-10-22 19:13:38.495599104,2019-10-22 19:13:38.495579572,11446154,T,IEX,1765.990000,5
2019-10-22 19:13:38.918529024,2019-10-22 19:13:38.918502007,11446364,T,IEX,1765.990000,95
2019-10-22 19:13:38.918542080,2019-10-22 19:13:38.918524903,11446366,T,IEX,1766.000000,5
2019-10-22 19:13:39.164791040,2019-10-22 19:13:39.164771470,11446765,T,IEX,1766.010000,5
2019-10-22 19:15:47.983064064,2019-10-22 19:15:47.983046938,11518397,T,IEX,1766.625000,1
2019-10-22 19:16:24.598215936,2019-10-22 19:16:24.598195583,11540872,T,IEX,1766.820000,5
2019-10-22 19:17:05.668824064,2019-10-22 19:17:05.668805069,11576284,T,IEX,1764.925000,100
2019-10-22 19:17:05.668843008,2019-10-22 19:17:05.668824024,11576285,T,IEX,1764.925000,100
2019-10-22 19:17:57.855429888,2019-10-22 19:17:57.855409836,11613338,T,IEX,1765.255000,1
2019-10-22 19:18:44.80754944,2019-10-22 19:18:44.80735622,11637961,T,IEX,1765.360000,100
2019-10-22 19:20:26.352626944,2019-10-22 19:20:26.352609508,11697395,T,IEX,1765.040000,100
2019-10-22 19:22:30.81355008,2019-10-22 19:22:30.81334586,11765143,T,IEX,1766.490000,50
2019-10-22 19:24:37.768112896,2019-10-22 19:24:37.768094775,11823776,T,IEX,1766.130000,1
2019-10-22 19:25:21.29575936,2019-10-22 19:25:21.29556472,11842731,T,IEX,1766.390000,67
2019-10-22 19:25:21.29701888,2019-10-22 19:25:21.29684101,11842733,T,IEX,1766.390000,9
2019-10-22 19:25:21.29944064,2019-10-22 19:25:21.29923620,11842734,T,IEX,1766.390000,24
2019-10-22 19:26:01.766703104,2019-10-22 19:26:01.766686559,11861886,T,IEX,1766.860000,3
2019-10-22 19:26:34.123760128,2019-10-22 19:26:34.123734130,11874335,T,IEX,1766.380000,100
2019-10-22 19:27:14.887849984,2019-10-22 19:27:14.887829650,11894894,T,IEX,1766.680000,50
2019-10-22 19:27:42.852866048,2019-10-22 19:27:42.852846816,11910308,T,IEX,1766.880000,1
2019-10-22 19:27:46.45390080,2019-10-22 19:27:46.45369400,11912878,T,IEX,1766.870000,100
2019-10-22 19:27:46.66254080,2019-10-22 19:27:46.66233419,11913549,T,IEX,1767.320000,100
2019-10-22 19:27:50.433784064,2019-10-22 19:27:50.433764963,11921178,T,IEX,1766.960000,100
2019-10-22 19:28:24.31226880,2019-10-22 19:28:24.31209986,11939993,T,IEX,1767.130000,100
2019-10-22 19:29:06.741772032,2019-10-22 19:29:06.741753538,11960679,T,IEX,1766.540000,11
2019-10-22 19:29:59.712871936,2019-10-22 19:29:59.712854043,11983969,T,IEX,1767.110000,1
2019-10-22 19:30:51.509541120,2019-10-22 19:30:51.509523220,12014499,T,IEX,1767.150000,7
2019-10-22 19:31:44.781443072,2019-10-22 19:31:44.781424324,12039703,T,IEX,1767.800000,1
2019-10-22 19:33:09.775118080,2019-10-22 19:33:09.775100467,12084890,T,IEX,1766.980000,87
2019-10-22 19:33:20.903929088,2019-10-22 19:33:20.903910643,12091831,T,IEX,1766.260000,100
2019-10-22 19:38:06.225570048,2019-10-22 19:38:06.225553310,12233003,T,IEX,1767.090000,20
2019-10-22 19:39:01.492587008,2019-10-22 19:39:01.492567415,12259397,T,IEX,1767.010000,100
2019-10-22 19:39:01.493677056,2019-10-22 19:39:01.493655206,12259398,T,IEX,1767.010000,100
2019-10-22 19:39:01.495028992,2019-10-22 19:39:01.495011301,12259402,T,IEX,1767.010000,100
2019-10-22 19:40:16.70334976,2019-10-22 19:40:16.70314467,12304410,T,IEX,1766.650000,100
2019-10-22 19:40:16.80633088,2019-10-22 19:40:16.80613466,12304413,T,IEX,1766.770000,100
2019-10-22 19:40:47.182545920,2019-10-22 19:40:47.182526534,12321301,T,IEX,1766.280000,25
2019-10-22 19:41:23.555877120,2019-10-22 19:41:23.555857230,12348510,T,IEX,1765.480000,100
2019-10-22 19:41:48.937255936,2019-10-22 19:41:48.937237397,12359884,T,IEX,1765.600000,4
2019-10-22 19:42:59.391840000,2019-10-22 19:42:59.391821356,12400921,T,IEX,1764.635000,100
2019-10-22 19:43:11.932023040,2019-10-22 19:43:11.932003569,12408329,T,IEX,1764.705000,100
2019-10-22 19:44:24.839072000,2019-10-22 19:44:24.839053596,12443010,T,IEX,1764.790000,63
2019-10-22 19:45:00.328055040,2019-10-22 19:45:00.328035850,12466129,T,IEX,1764.460000,100
2019-10-22 19:45:08.109988096,2019-10-22 19:45:08.109964657,12474534,T,IEX,1764.200000,60
2019-10-22 19:45:24.887160064,2019-10-22 19:45:24.887141860,12490355,T,IEX,1763.680000,100
2019-10-22 19:46:01.871556096,2019-10-22 19:46:01.871536695,12528836,T,IEX,1762.260000,100
2019-10-22 19:46:06.832702976,2019-10-22 19:46:06.832680836,12535679,T,IEX,1762.490000,1
2019-10-22 19:46:06.833315072,2019-10-22 19:46:06.833293680,12535704,T,IEX,1762.550000,50
2019-10-22 19:46:23.78439936,2019-10-22 19:46:23.78424162,12551176,T,IEX,1762.890000,10
2019-10-22 19:46:23.191757056,2019-10-22 19:46:23.191739237,12551233,T,IEX,1762.620000,50
2019-10-22 19:46:30.288875008,2019-10-22 19:46:30.288849419,12556556,T,IEX,1762.740000,7
2019-10-22 19:46:34.995106048,2019-10-22 19:46:34.995087042,12560253,T,IEX,1762.645000,10
2019-10-22 19:46:48.332600064,2019-10-22 19:46:48.332581876,12570642,T,IEX,1762.300000,10
2019-10-22 19:46:48.332616960,2019-10-22 19:46:48.332599088,12570643,T,IEX,1762.320000,90
2019-10-22 19:47:16.332890112,2019-10-22 19:47:16.332869211,12598401,T,IEX,1762.140000,100
2019-10-22 19:47:50.813537024,2019-10-22 19:47:50.813517067,12628585,T,IEX,1762.330000,10
2019-10-22 19:48:34.63548928,2019-10-22 19:48:34.63531157,12662233,T,IEX,1762.680000,1
2019-10-22 19:48:38.845174016,2019-10-22 19:48:38.845154689,12664891,T,IEX,1762.840000,57
2019-10-22 19:48:45.38466048,2019-10-22 19:48:45.38450137,12669403,T,IEX,1762.710000,100
2019-10-22 19:48:45.39407104,2019-10-22 19:48:45.39389864,12669405,T,IEX,1762.710000,100
2019-10-22 19:48:45.40404992,2019-10-22 19:48:45.40388937,12669407,T,IEX,1762.710000,100
2019-10-22 19:48:45.41344000,2019-10-22 19:48:45.41326341,12669408,T,IEX,1762.710000,200
2019-10-22 19:48:48.295891968,2019-10-22 19:48:48.295873429,12672014,T,IEX,1763.030000,7
2019-10-22 19:49:51.808049920,2019-10-22 19:49:51.808030071,12719223,T,IEX,1763.340000,50
2019-10-22 19:50:00.509822976,2019-10-22 19:50:00.509804375,12726254,T,IEX,1763.640000,18
2019-10-22 19:50:19.500835072,2019-10-22 19:50:19.500814115,12744993,T,IEX,1763.730000,5
2019-10-22 19:50:20.949680896,2019-10-22 19:50:20.949662681,12746166,T,IEX,1763.750000,28
2019-10-22 19:50:20.950662912,2019-10-22 19:50:20.950642969,12746187,T,IEX,1763.750000,72
2019-10-22 19:50:24.878347008,2019-10-22 19:50:24.878327567,12748778,T,IEX,1763.735000,100
2019-10-22 19:50:29.99086080,2019-10-22 19:50:29.99068845,12752877,T,IEX,1764.230000,100
2019-10-22 19:51:08.6266880,2019-10-22 19:51:08.6248123,12783418,T,IEX,1763.955000,100
2019-10-22 19:51:24.103584000,2019-10-22 19:51:24.103564323,12794919,T,IEX,1764.060000,7
2019-10-22 19:52:00.241197056,2019-10-22 19:52:00.241177721,12824936,T,IEX,1763.840000,100
2019-10-22 19:54:00.525371904,2019-10-22 19:54:00.525352434,12927216,T,IEX,1764.405000,1
2019-10-22 19:54:06.130461952,2019-10-22 19:54:06.130442706,12937279,T,IEX,1764.355000,100
2019-10-22 19:54:35.324740096,2019-10-22 19:54:35.324714717,12956838,T,IEX,1764.740000,7
2019-10-22 19:55:00.73299968,2019-10-22 19:55:00.73280622,12982454,T,IEX,1764.835000,100
2019-10-22 19:55:00.73338880,2019-10-22 19:55:00.73321166,12982457,T,IEX,1764.835000,100
2019-10-22 19:55:00.73381888,2019-10-22 19:55:00.73363623,12982458,T,IEX,1765.000000,100
2019-10-22 19:55:04.398557952,2019-10-22 19:55:04.398536681,12992507,T,IEX,1765.820000,100
2019-10-22 19:55:48.273637120,2019-10-22 19:55:48.273619484,13041118,T,IEX,1765.985000,100
2019-10-22 19:55:48.474746112,2019-10-22 19:55:48.474727788,13041819,T,IEX,1765.980000,100
2019-10-22 19:56:01.309074944,2019-10-22 19:56:01.309054866,13055433,T,IEX,1766.210000,100
2019-10-22 19:56:10.945837056,2019-10-22 19:56:10.945819050,13065389,T,IEX,1766.600000,100
2019-10-22 19:56:14.718400000,2019-10-22 19:56:14.718378754,13069347,T,IEX,1766.640000,7
2019-10-22 19:56:31.808487936,2019-10-22 19:56:31.808470191,13087374,T,IEX,1766.495000,1
2019-10-22 19:56:35.583955968,2019-10-22 19:56:35.583935794,13093215,T,IEX,1766.250000,97
2019-10-22 19:56:35.594990080,2019-10-22 19:56:35.594971479,13093225,T,IEX,1766.150000,100
2019-10-22 19:56:56.854543872,2019-10-22 19:56:56.854525903,13116736,T,IEX,1765.450000,55
2019-10-22 19:57:01.812179968,2019-10-22 19:57:01.812160668,13122574,T,IEX,1765.860000,100
2019-10-22 19:57:05.885861120,2019-10-22 19:57:05.885842754,13127315,T,IEX,1766.050000,61
2019-10-22 19:57:19.549118976,2019-10-22 19:57:19.549101041,13143331,T,IEX,1765.810000,100
2019-10-22 19:57:37.523612928,2019-10-22 19:57:37.523591484,13162289,T,IEX,1766.090000,7
2019-10-22 19:57:49.104218112,2019-10-22 19:57:49.104199657,13173496,T,IEX,1765.905000,100
2019-10-22 19:58:15.926852096,2019-10-22 19:58:15.926835040,13202775,T,IEX,1765.950000,100
2019-10-22 19:58:25.533436928,2019-10-22 19:58:25.533421349,13212530,T,IEX,1765.970000,7
2019-10-22 19:58:33.257299968,2019-10-22 19:58:33.257280285,13220726,T,IEX,1765.855000,55
2019-10-22 19:58:35.325530112,2019-10-22 19:58:35.325512520,13223088,T,IEX,1765.900000,7
2019-10-22 19:58:36.550309888,2019-10-22 19:58:36.550294495,13224417,T,IEX,1765.785000,100
2019-10-22 19:58:39.359618048,2019-10-22 19:58:39.359597753,13227698,T,IEX,1765.620000,100
2019-10-22 19:58:41.503990016,2019-10-22 19:58:41.503968734,13231801,T,IEX,1765.800000,100
2019-10-22 19:58:41.801403904,2019-10-22 19:58:41.801384916,13232784,T,IEX,1765.980000,100
2019-10-22 19:58:45.393187072,2019-10-22 19:58:45.393170924,13237416,T,IEX,1766.020000,100
2019-10-22 19:58:45.874139904,2019-10-22 19:58:45.874122418,13237910,T,IEX,1766.180000,100
2019-10-22 19:59:00.27294976,2019-10-22 19:59:00.27276215,13254692,T,IEX,1766.125000,55
2019-10-22 19:59:03.5361920,2019-10-22 19:59:03.5342365,13260197,T,IEX,1766.250000,100
2019-10-22 19:59:06.136072960,2019-10-22 19:59:06.136055954,13264317,T,IEX,1766.320000,7
2019-10-22 19:59:11.14512128,2019-10-22 19:59:11.14496803,13272837,T,IEX,1766.095000,100
2019-10-22 19:59:11.14530048,2019-10-22 19:59:11.14513523,13272838,T,IEX,1766.095000,100
2019-10-22 19:59:12.32358912,2019-10-22 19:59:12.32341950,13274673,T,IEX,1766.020000,10
2019-10-22 19:59:12.32377088,2019-10-22 19:59:12.32359176,13274674,T,IEX,1766.060000,50
2019-10-22 19:59:12.32391936,2019-10-22 19:59:12.32375013,13274675,T,IEX,1766.100000,40
2019-10-22 19:59:26.328705024,2019-10-22 19:59:26.328684781,13293521,T,IEX,1766.240000,7
2019-10-22 19:59:30.482187008,2019-10-22 19:59:30.482168253,13302038,T,IEX,1766.060000,100
2019-10-22 19:59:31.489780992,2019-10-22 19:59:31.489760838,13307552,T,IEX,1765.880000,100
2019-10-22 19:59:35.45108992,2019-10-22 19:59:35.45090606,13324118,T,IEX,1765.630000,2
2019-10-22 19:59:38.26142976,2019-10-22 19:59:38.26125049,13340024,T,IEX,1765.280000,38
2019-10-22 19:59:40.796054016,2019-10-22 19:59:40.796029365,13356585,T,IEX,1765.170000,100
2019-10-22 19:59:41.163068928,2019-10-22 19:59:41.163049859,13361021,T,IEX,1765.030000,100
2019-10-22 19:59:44.600997120,2019-10-22 19:59:44.600980038,13380005,T,IEX,1765.130000,113
2019-10-22 19:59:44.980965888,2019-10-22 19:59:44.980948062,13381488,T,IEX,1765.260000,14
2019-10-22 19:59:45.59390976,2019-10-22 19:59:45.59359214,13383851,T,IEX,1765.500000,100
2019-10-22 19:59:45.287490048,2019-10-22 19:59:45.286823930,13387071,T,IEX,1765.510000,30
2019-10-22 19:59:45.288029952,2019-10-22 19:59:45.287706554,13387150,T,IEX,1765.510000,26
2019-10-22 19:59:45.288348928,2019-10-22 19:59:45.288277278,13387202,T,IEX,1765.420000,55
2019-10-22 19:59:45.288900096,2019-10-22 19:59:45.288878250,13387248,T,IEX,1765.420000,26
2019-10-22 19:59:46.973199104,2019-10-22 19:59:46.973153927,13395940,T,IEX,1765.680000,100
2019-10-22 19:59:50.15835904,2019-10-22 19:59:50.15792157,13414915,T,IEX,1765.910000,50
2019-10-22 19:59:50.118552064,2019-10-22 19:59:50.118533853,13417107,T,IEX,1766.000000,100
2019-10-22 19:59:50.612014080,2019-10-22 19:59:50.611996569,13420884,T,IEX,1765.670000,3
2019-10-22 19:59:50.612030976,2019-10-22 19:59:50.612013298,13420885,T,IEX,1765.670000,4
2019-10-22 19:59:53.300109056,2019-10-22 19:59:53.300087566,13433675,T,IEX,1766.150000,1
2019-10-22 19:59:55.466475008,2019-10-22 19:59:55.466455383,13453130,T,IEX,1766.310000,1
2019-10-22 19:59:55.569846016,2019-10-22 19:59:55.569817320,13453767,T,IEX,1766.310000,29
2019-10-22 19:59:55.569937920,2019-10-22 19:59:55.569907221,13453775,T,IEX,1766.280000,100
2019-10-22 19:59:55.894789120,2019-10-22 19:59:55.894771214,13458040,T,IEX,1766.100000,36
2019-10-22 19:59:55.894799872,2019-10-22 19:59:55.894783851,13458041,T,IEX,1766.090000,64
