2019-10-10 13:21:58.117160960,2019-10-10 13:21:58.117107757,60036,T,IEX,267.240000,900
2019-10-10 13:21:58.117203968,2019-10-10 13:21:58.117174128,60040,T,IEX,267.260000,900
2019-10-10 13:22:51.904736000,2019-10-10 13:22:51.904696443,61049,T,IEX,267.310000,900
2019-10-10 13:22:51.904794112,2019-10-10 13:22:51.904765008,61052,T,IEX,267.300000,900
2019-10-10 13:22:51.905082112,2019-10-10 13:22:51.905059954,61053,T,IEX,267.290000,900
2019-10-10 13:30:26.820602880,2019-10-10 13:30:26.820577755,134268,T,IEX,267.320000,100
2019-10-10 13:30:27.71721984,2019-10-10 13:30:27.71694681,134687,T,IEX,267.320000,100
2019-10-10 13:49:57.93955072,2019-10-10 13:49:57.93930211,1491888,T,IEX,268.170000,200
2019-10-10 13:49:57.93968896,2019-10-10 13:49:57.93951903,1491889,T,IEX,268.170000,200
2019-10-10 13:50:01.391067904,2019-10-10 13:50:01.391048539,1523925,T,IEX,268.280000,100
2019-10-10 13:58:10.972773120,2019-10-10 13:58:10.972753991,2454275,T,IEX,269.260000,1000
2019-10-10 14:00:01.9306112,2019-10-10 14:00:01.9285521,2593198,T,IEX,269.350000,300
2019-10-10 14:03:02.410977024,2019-10-10 14:03:02.410953873,2828491,T,IEX,269.160000,100
2019-10-10 14:07:50.483518976,2019-10-10 14:07:50.483501301,3141880,T,IEX,268.985000,2
2019-10-10 14:46:23.810715904,2019-10-10 14:46:23.810695630,5507068,T,IEX,269.250000,100
2019-10-10 14:47:09.327442944,2019-10-10 14:47:09.327423698,5545098,T,IEX,269.205000,100
2019-10-10 14:53:36.55033088,2019-10-10 14:53:36.55008960,5889071,T,IEX,269.380000,125
2019-10-10 14:56:21.211579904,2019-10-10 14:56:21.211559754,6040027,T,IEX,269.470000,100
2019-10-10 14:56:45.597497088,2019-10-10 14:56:45.597472639,6057568,T,IEX,269.550000,220
2019-10-10 14:56:45.597581056,2019-10-10 14:56:45.597562863,6057575,T,IEX,269.550000,80
2019-10-10 15:15:31.516366080,2019-10-10 15:15:31.516348748,6949840,T,IEX,270.150000,100
2019-10-10 15:47:58.982674944,2019-10-10 15:47:58.982658829,8166331,T,IEX,269.900000,100
2019-10-10 15:52:42.955676928,2019-10-10 15:52:42.955649791,8334112,T,IEX,269.915000,20
2019-10-10 15:53:55.561253120,2019-10-10 15:53:55.561231779,8371104,T,IEX,269.880000,100
2019-10-10 16:07:02.447708928,2019-10-10 16:07:02.447689763,8790567,T,IEX,269.930000,100
2019-10-10 18:08:38.22308096,2019-10-10 18:08:38.22288706,12636834,T,IEX,268.440000,100
2019-10-10 18:08:40.719898880,2019-10-10 18:08:40.719877786,12640878,T,IEX,268.420000,100
2019-10-10 18:16:49.628869120,2019-10-10 18:16:49.628849725,13308711,T,IEX,269.080000,300
2019-10-10 18:16:49.628996096,2019-10-10 18:16:49.628977580,13308720,T,IEX,269.080000,400
2019-10-10 19:18:08.586481920,2019-10-10 19:18:08.586466203,15425164,T,IEX,269.015000,100
2019-10-10 19:18:51.919872000,2019-10-10 19:18:51.919854665,15444624,T,IEX,269.075000,50
2019-10-10 19:34:24.581680896,2019-10-10 19:34:24.581665560,15949166,T,IEX,269.280000,100
2019-10-10 19:36:25.798448896,2019-10-10 19:36:25.798427303,16024045,T,IEX,269.160000,500
2019-10-10 19:37:22.306407936,2019-10-10 19:37:22.306374572,16056150,T,IEX,269.140000,300
2019-10-10 19:37:43.43770112,2019-10-10 19:37:43.43739347,16065969,T,IEX,269.150000,300
2019-10-10 19:37:43.44463104,2019-10-10 19:37:43.44442379,16066000,T,IEX,269.160000,100
2019-10-10 19:45:50.996986880,2019-10-10 19:45:50.996968118,16366708,T,IEX,269.150000,100
2019-10-10 19:50:21.748854016,2019-10-10 19:50:21.748835999,16586025,T,IEX,269.400000,100
2019-10-10 19:51:47.488218880,2019-10-10 19:51:47.488196465,16650129,T,IEX,269.520000,100
2019-10-10 19:57:33.86894080,2019-10-10 19:57:33.86877327,17034285,T,IEX,269.320000,100
2019-10-10 19:57:42.142209024,2019-10-10 19:57:42.142190551,17045241,T,IEX,269.300000,100
2019-10-10 19:59:39.274132992,2019-10-10 19:59:39.274115670,17263859,T,IEX,269.230000,46
2019-10-10 19:59:53.971122944,2019-10-10 19:59:53.971104956,17387517,T,IEX,269.010000,360
