2019-10-07 13:31:42.493990912,2019-10-07 13:31:42.493962287,191964,T,IEX,68.570000,50
2019-10-07 13:31:42.494191104,2019-10-07 13:31:42.494169788,191966,T,IEX,68.570000,95
2019-10-07 13:31:43.419600896,2019-10-07 13:31:43.419575356,192827,T,IEX,68.560000,800
2019-10-07 13:31:44.711703040,2019-10-07 13:31:44.711677413,193934,T,IEX,68.580000,66
2019-10-07 13:31:44.753144064,2019-10-07 13:31:44.753117640,193959,T,IEX,68.600000,145
2019-10-07 13:31:46.545654016,2019-10-07 13:31:46.545628731,195519,T,IEX,68.600000,100
2019-10-07 13:32:04.310916096,2019-10-07 13:32:04.310893679,213314,T,IEX,68.465000,100
2019-10-07 13:32:42.560080896,2019-10-07 13:32:42.560060239,253194,T,IEX,68.460000,79
2019-10-07 13:33:05.809884928,2019-10-07 13:33:05.809861399,281251,T,IEX,68.360000,100
2019-10-07 13:33:29.20658944,2019-10-07 13:33:29.20639683,307182,T,IEX,68.340000,100
2019-10-07 13:33:32.256334080,2019-10-07 13:33:32.256311823,310548,T,IEX,68.360000,300
2019-10-07 13:34:40.471697920,2019-10-07 13:34:40.471677398,379597,T,IEX,68.385000,1
2019-10-07 13:34:54.795727104,2019-10-07 13:34:54.795705808,392417,T,IEX,68.450000,100
2019-10-07 13:35:01.381627904,2019-10-07 13:35:01.381607507,399578,T,IEX,68.390000,100
2019-10-07 13:35:04.128652032,2019-10-07 13:35:04.128635984,404018,T,IEX,68.390000,100
2019-10-07 13:35:04.130178048,2019-10-07 13:35:04.130160825,404022,T,IEX,68.390000,100
2019-10-07 13:35:04.380295936,2019-10-07 13:35:04.380276289,404394,T,IEX,68.385000,200
2019-10-07 13:35:04.380353024,2019-10-07 13:35:04.380336516,404395,T,IEX,68.385000,63
2019-10-07 13:35:39.416881920,2019-10-07 13:35:39.416860048,440928,T,IEX,68.365000,100
2019-10-07 13:35:39.417103872,2019-10-07 13:35:39.417082399,440940,T,IEX,68.365000,100
2019-10-07 13:35:39.417200128,2019-10-07 13:35:39.417179920,440945,T,IEX,68.365000,100
2019-10-07 13:35:39.417440000,2019-10-07 13:35:39.417420690,440963,T,IEX,68.365000,100
2019-10-07 13:35:39.417927936,2019-10-07 13:35:39.417907569,440985,T,IEX,68.360000,100
2019-10-07 13:35:49.471153920,2019-10-07 13:35:49.471134614,453332,T,IEX,68.340000,1200
2019-10-07 13:35:53.947136000,2019-10-07 13:35:53.947119465,457438,T,IEX,68.335000,100
2019-10-07 13:36:07.196788992,2019-10-07 13:36:07.196771061,472382,T,IEX,68.335000,100
2019-10-07 13:36:13.9700096,2019-10-07 13:36:13.9679134,477538,T,IEX,68.320000,400
2019-10-07 13:36:17.248689920,2019-10-07 13:36:17.248665941,480996,T,IEX,68.315000,100
2019-10-07 13:36:17.248828928,2019-10-07 13:36:17.248811515,481000,T,IEX,68.315000,100
2019-10-07 13:36:17.248963072,2019-10-07 13:36:17.248946591,481002,T,IEX,68.315000,100
2019-10-07 13:36:17.249085952,2019-10-07 13:36:17.249068695,481004,T,IEX,68.315000,100
2019-10-07 13:36:17.249190912,2019-10-07 13:36:17.249172763,481005,T,IEX,68.315000,100
2019-10-07 13:36:17.249324032,2019-10-07 13:36:17.249309665,481007,T,IEX,68.315000,100
2019-10-07 13:36:17.251449088,2019-10-07 13:36:17.251433721,481019,T,IEX,68.315000,100
2019-10-07 13:36:17.252579072,2019-10-07 13:36:17.252562785,481024,T,IEX,68.310000,43
2019-10-07 13:36:17.959920128,2019-10-07 13:36:17.959903728,481516,T,IEX,68.310000,64
2019-10-07 13:36:17.983078912,2019-10-07 13:36:17.983060056,481551,T,IEX,68.300000,100
2019-10-07 13:36:18.80387072,2019-10-07 13:36:18.80367643,481636,T,IEX,68.295000,100
2019-10-07 13:36:18.235328000,2019-10-07 13:36:18.235310638,481909,T,IEX,68.295000,500
2019-10-07 13:36:19.836048896,2019-10-07 13:36:19.836029819,483232,T,IEX,68.300000,100
2019-10-07 13:36:23.300317952,2019-10-07 13:36:23.300302129,486302,T,IEX,68.305000,1600
2019-10-07 13:36:23.302823936,2019-10-07 13:36:23.302805973,486305,T,IEX,68.305000,700
2019-10-07 13:36:25.893454080,2019-10-07 13:36:25.893434737,488170,T,IEX,68.310000,9
2019-10-07 13:36:28.149586944,2019-10-07 13:36:28.149569207,490552,T,IEX,68.335000,100
2019-10-07 13:36:52.312742912,2019-10-07 13:36:52.312724284,515434,T,IEX,68.300000,100
2019-10-07 13:36:59.855187968,2019-10-07 13:36:59.855170201,521786,T,IEX,68.310000,100
2019-10-07 13:37:00.88666112,2019-10-07 13:37:00.88644517,522115,T,IEX,68.300000,3
2019-10-07 13:37:49.296268032,2019-10-07 13:37:49.296246029,564951,T,IEX,68.350000,100
2019-10-07 13:37:49.297857024,2019-10-07 13:37:49.297837570,564954,T,IEX,68.350000,100
2019-10-07 13:38:00.355354112,2019-10-07 13:38:00.355335886,573533,T,IEX,68.350000,100
2019-10-07 13:38:00.356429056,2019-10-07 13:38:00.356414265,573535,T,IEX,68.350000,100
2019-10-07 13:38:21.552121088,2019-10-07 13:38:21.552103313,589024,T,IEX,68.340000,2
2019-10-07 13:38:23.84711936,2019-10-07 13:38:23.84692206,589935,T,IEX,68.350000,3
2019-10-07 13:38:29.421555968,2019-10-07 13:38:29.421538957,593870,T,IEX,68.380000,1
2019-10-07 13:38:29.421657088,2019-10-07 13:38:29.421642156,593872,T,IEX,68.380000,1
2019-10-07 13:38:47.743600128,2019-10-07 13:38:47.743584991,608788,T,IEX,68.400000,100
2019-10-07 13:38:47.743993088,2019-10-07 13:38:47.743975295,608793,T,IEX,68.400000,100
2019-10-07 13:39:37.290356992,2019-10-07 13:39:37.290334019,645803,T,IEX,68.400000,7
2019-10-07 13:39:58.96459008,2019-10-07 13:39:58.96438757,663520,T,IEX,68.395000,100
2019-10-07 13:39:58.97498112,2019-10-07 13:39:58.97480994,663521,T,IEX,68.395000,100
2019-10-07 13:40:19.25508096,2019-10-07 13:40:19.25488752,683340,T,IEX,68.395000,100
2019-10-07 13:41:32.857511936,2019-10-07 13:41:32.857492474,738951,T,IEX,68.415000,100
2019-10-07 13:41:34.5455104,2019-10-07 13:41:34.5433682,739625,T,IEX,68.415000,100
2019-10-07 13:41:42.48636928,2019-10-07 13:41:42.48616975,746403,T,IEX,68.410000,149
2019-10-07 13:41:44.896889088,2019-10-07 13:41:44.896868237,748441,T,IEX,68.425000,100
2019-10-07 13:41:46.759219968,2019-10-07 13:41:46.759201611,749910,T,IEX,68.425000,100
2019-10-07 13:41:46.859529984,2019-10-07 13:41:46.859513486,750124,T,IEX,68.425000,100
2019-10-07 13:41:46.860969984,2019-10-07 13:41:46.860952286,750128,T,IEX,68.420000,100
2019-10-07 13:42:01.15900928,2019-10-07 13:42:01.15884564,761495,T,IEX,68.440000,50
2019-10-07 13:42:05.354945024,2019-10-07 13:42:05.354926911,765969,T,IEX,68.405000,100
2019-10-07 13:42:05.473294080,2019-10-07 13:42:05.473278061,766080,T,IEX,68.395000,100
2019-10-07 13:42:07.960186112,2019-10-07 13:42:07.960167388,768973,T,IEX,68.405000,100
2019-10-07 13:42:08.496736000,2019-10-07 13:42:08.496715116,769396,T,IEX,68.405000,100
2019-10-07 13:42:08.497235968,2019-10-07 13:42:08.497214015,769418,T,IEX,68.405000,100
2019-10-07 13:42:08.497751040,2019-10-07 13:42:08.497729823,769437,T,IEX,68.400000,100
2019-10-07 13:42:08.497922048,2019-10-07 13:42:08.497904321,769444,T,IEX,68.400000,100
2019-10-07 13:42:20.147638016,2019-10-07 13:42:20.147622465,781389,T,IEX,68.415000,100
2019-10-07 13:42:23.218519040,2019-10-07 13:42:23.218503184,783134,T,IEX,68.415000,100
2019-10-07 13:42:23.220498944,2019-10-07 13:42:23.220478202,783136,T,IEX,68.410000,300
2019-10-07 13:42:23.224911104,2019-10-07 13:42:23.224892075,783151,T,IEX,68.400000,100
2019-10-07 13:42:23.226117888,2019-10-07 13:42:23.226101225,783154,T,IEX,68.400000,100
2019-10-07 13:42:51.791409920,2019-10-07 13:42:51.791393675,800196,T,IEX,68.425000,1
2019-10-07 13:42:53.569573120,2019-10-07 13:42:53.569555527,801161,T,IEX,68.440000,5
2019-10-07 13:42:54.203816960,2019-10-07 13:42:54.203796609,801861,T,IEX,68.425000,100
2019-10-07 13:42:54.206053120,2019-10-07 13:42:54.206035014,801864,T,IEX,68.425000,100
2019-10-07 13:42:54.208478976,2019-10-07 13:42:54.208460434,801865,T,IEX,68.425000,100
2019-10-07 13:42:54.210414080,2019-10-07 13:42:54.210398626,801868,T,IEX,68.425000,100
2019-10-07 13:42:54.212291072,2019-10-07 13:42:54.212274514,801869,T,IEX,68.425000,100
2019-10-07 13:43:15.153774080,2019-10-07 13:43:15.153753932,819713,T,IEX,68.440000,2
2019-10-07 13:43:35.658683904,2019-10-07 13:43:35.658665660,834045,T,IEX,68.400000,100
2019-10-07 13:44:54.857562112,2019-10-07 13:44:54.857539474,891975,T,IEX,68.410000,6
2019-10-07 13:45:09.987431936,2019-10-07 13:45:09.987413899,909544,T,IEX,68.425000,100
2019-10-07 13:45:10.94865920,2019-10-07 13:45:10.94846744,909790,T,IEX,68.415000,100
2019-10-07 13:45:36.166812928,2019-10-07 13:45:36.166794409,935472,T,IEX,68.395000,100
2019-10-07 13:45:59.887207936,2019-10-07 13:45:59.887188954,956208,T,IEX,68.400000,4
2019-10-07 13:46:09.978394112,2019-10-07 13:46:09.978378427,967169,T,IEX,68.410000,34
2019-10-07 13:46:37.951522048,2019-10-07 13:46:37.951505452,993149,T,IEX,68.380000,90
2019-10-07 13:47:32.984756992,2019-10-07 13:47:32.984736665,1041959,T,IEX,68.370000,7
2019-10-07 13:47:32.984783104,2019-10-07 13:47:32.984765571,1041960,T,IEX,68.370000,1
2019-10-07 13:47:52.710554880,2019-10-07 13:47:52.710538123,1062559,T,IEX,68.350000,90
2019-10-07 13:48:05.343232000,2019-10-07 13:48:05.343212656,1074306,T,IEX,68.370000,100
2019-10-07 13:48:16.379401984,2019-10-07 13:48:16.379386944,1083873,T,IEX,68.370000,3
2019-10-07 13:48:21.458994944,2019-10-07 13:48:21.458979153,1089358,T,IEX,68.380000,25
2019-10-07 13:48:21.459066880,2019-10-07 13:48:21.459049637,1089360,T,IEX,68.380000,22
2019-10-07 13:48:52.745907968,2019-10-07 13:48:52.745890142,1116396,T,IEX,68.400000,25
2019-10-07 13:48:57.996537088,2019-10-07 13:48:57.996521133,1120395,T,IEX,68.415000,100
2019-10-07 13:48:58.881427968,2019-10-07 13:48:58.881412728,1121219,T,IEX,68.430000,70
2019-10-07 13:49:19.891585024,2019-10-07 13:49:19.891568693,1137760,T,IEX,68.420000,3
2019-10-07 13:49:20.46123008,2019-10-07 13:49:20.46102150,1137992,T,IEX,68.425000,14
2019-10-07 13:49:49.111898112,2019-10-07 13:49:49.111879913,1163891,T,IEX,68.475000,22
2019-10-07 13:50:28.174127104,2019-10-07 13:50:28.174107616,1194882,T,IEX,68.500000,10
2019-10-07 13:50:28.182551040,2019-10-07 13:50:28.182534027,1194967,T,IEX,68.500000,22
2019-10-07 13:51:00.489039872,2019-10-07 13:51:00.489021188,1223491,T,IEX,68.495000,17
2019-10-07 13:51:01.693733120,2019-10-07 13:51:01.693712218,1224539,T,IEX,68.495000,17
2019-10-07 13:51:03.819958016,2019-10-07 13:51:03.819942509,1225899,T,IEX,68.495000,83
2019-10-07 13:51:10.973870080,2019-10-07 13:51:10.973850306,1231666,T,IEX,68.500000,2
2019-10-07 13:51:20.689295872,2019-10-07 13:51:20.689278854,1243537,T,IEX,68.510000,1
2019-10-07 13:52:49.134649088,2019-10-07 13:52:49.134631636,1326229,T,IEX,68.530000,1
2019-10-07 13:53:19.652065024,2019-10-07 13:53:19.652049188,1353731,T,IEX,68.560000,100
2019-10-07 13:53:58.996638976,2019-10-07 13:53:58.996623013,1392928,T,IEX,68.560000,1
2019-10-07 13:55:10.503548928,2019-10-07 13:55:10.503529934,1452982,T,IEX,68.575000,10
2019-10-07 13:55:30.27760896,2019-10-07 13:55:30.27742549,1469914,T,IEX,68.600000,200
2019-10-07 13:55:30.29086976,2019-10-07 13:55:30.29064990,1469915,T,IEX,68.600000,200
2019-10-07 13:55:30.29096960,2019-10-07 13:55:30.29078861,1469916,T,IEX,68.600000,800
2019-10-07 13:55:46.54257920,2019-10-07 13:55:46.54238103,1482596,T,IEX,68.605000,1
2019-10-07 13:56:26.856556032,2019-10-07 13:56:26.856536972,1514737,T,IEX,68.570000,500
2019-10-07 13:56:29.326881024,2019-10-07 13:56:29.326862950,1516141,T,IEX,68.565000,10
2019-10-07 13:56:40.15991040,2019-10-07 13:56:40.15964600,1524508,T,IEX,68.550000,2
2019-10-07 13:56:40.16008960,2019-10-07 13:56:40.15986294,1524510,T,IEX,68.550000,100
2019-10-07 13:57:09.500759040,2019-10-07 13:57:09.500740197,1544046,T,IEX,68.545000,1
2019-10-07 13:57:22.471720960,2019-10-07 13:57:22.471699546,1550814,T,IEX,68.540000,100
2019-10-07 13:57:33.989478912,2019-10-07 13:57:33.989457917,1562690,T,IEX,68.520000,100
2019-10-07 13:57:38.208730112,2019-10-07 13:57:38.208712336,1566857,T,IEX,68.515000,1
2019-10-07 13:57:55.967030016,2019-10-07 13:57:55.967004110,1579754,T,IEX,68.500000,4
2019-10-07 13:58:05.30210048,2019-10-07 13:58:05.30193896,1586670,T,IEX,68.520000,4
2019-10-07 13:58:14.28979968,2019-10-07 13:58:14.28959764,1593337,T,IEX,68.550000,1
2019-10-07 13:58:53.202043904,2019-10-07 13:58:53.202024202,1627586,T,IEX,68.500000,100
2019-10-07 13:59:30.764711936,2019-10-07 13:59:30.764691074,1662546,T,IEX,68.495000,100
2019-10-07 13:59:30.775109120,2019-10-07 13:59:30.775089930,1662594,T,IEX,68.495000,100
2019-10-07 13:59:30.775127040,2019-10-07 13:59:30.775109407,1662595,T,IEX,68.495000,160
2019-10-07 13:59:30.776077056,2019-10-07 13:59:30.776059502,1662599,T,IEX,68.495000,109
2019-10-07 13:59:33.9174016,2019-10-07 13:59:33.9158471,1665222,T,IEX,68.495000,100
2019-10-07 14:00:02.41320960,2019-10-07 14:00:02.41302957,1686402,T,IEX,68.530000,1
2019-10-07 14:00:26.909850880,2019-10-07 14:00:26.909831098,1711852,T,IEX,68.495000,100
2019-10-07 14:00:28.151675904,2019-10-07 14:00:28.151659803,1713376,T,IEX,68.495000,193
2019-10-07 14:00:38.83023872,2019-10-07 14:00:38.83004531,1725074,T,IEX,68.485000,100
2019-10-07 14:00:39.609126912,2019-10-07 14:00:39.609105015,1727047,T,IEX,68.465000,100
2019-10-07 14:01:02.109702912,2019-10-07 14:01:02.109685546,1744679,T,IEX,68.480000,3
2019-10-07 14:01:55.754338048,2019-10-07 14:01:55.754319657,1794956,T,IEX,68.455000,300
2019-10-07 14:01:55.754351104,2019-10-07 14:01:55.754332860,1794957,T,IEX,68.455000,200
2019-10-07 14:02:03.13459968,2019-10-07 14:02:03.13439383,1800239,T,IEX,68.455000,100
2019-10-07 14:02:06.188999936,2019-10-07 14:02:06.188982224,1802998,T,IEX,68.455000,900
2019-10-07 14:02:06.203023872,2019-10-07 14:02:06.203004141,1803011,T,IEX,68.455000,300
2019-10-07 14:02:17.342584064,2019-10-07 14:02:17.342563561,1812285,T,IEX,68.485000,1
2019-10-07 14:03:06.120848896,2019-10-07 14:03:06.120830646,1848415,T,IEX,68.500000,3
2019-10-07 14:03:09.882554112,2019-10-07 14:03:09.882530287,1852209,T,IEX,68.530000,1
2019-10-07 14:03:15.894575104,2019-10-07 14:03:15.894557200,1857471,T,IEX,68.515000,100
2019-10-07 14:03:16.877703936,2019-10-07 14:03:16.877686569,1858187,T,IEX,68.510000,100
2019-10-07 14:04:04.785827072,2019-10-07 14:04:04.785809148,1894873,T,IEX,68.510000,100
2019-10-07 14:04:36.207343104,2019-10-07 14:04:36.207327052,1922266,T,IEX,68.515000,1
2019-10-07 14:04:44.568502016,2019-10-07 14:04:44.568483138,1929085,T,IEX,68.495000,123
2019-10-07 14:04:44.586329088,2019-10-07 14:04:44.586308503,1929172,T,IEX,68.495000,100
2019-10-07 14:04:44.912207104,2019-10-07 14:04:44.912184347,1929618,T,IEX,68.495000,100
2019-10-07 14:04:59.140150016,2019-10-07 14:04:59.140130257,1939140,T,IEX,68.500000,2
2019-10-07 14:04:59.700491008,2019-10-07 14:04:59.700475150,1940111,T,IEX,68.515000,2
2019-10-07 14:05:09.268779008,2019-10-07 14:05:09.268757989,1955688,T,IEX,68.540000,4
2019-10-07 14:05:36.125075968,2019-10-07 14:05:36.125048185,1986864,T,IEX,68.615000,3
2019-10-07 14:06:26.62558976,2019-10-07 14:06:26.62543154,2055060,T,IEX,68.660000,100
2019-10-07 14:06:26.154020096,2019-10-07 14:06:26.154002773,2055130,T,IEX,68.650000,1
2019-10-07 14:06:57.575920896,2019-10-07 14:06:57.575904011,2091125,T,IEX,68.605000,1
2019-10-07 14:07:03.622056960,2019-10-07 14:07:03.622039079,2097162,T,IEX,68.635000,3
2019-10-07 14:07:03.622065920,2019-10-07 14:07:03.622048319,2097163,T,IEX,68.635000,6
2019-10-07 14:07:03.622085888,2019-10-07 14:07:03.622069131,2097164,T,IEX,68.635000,3
2019-10-07 14:07:03.624916992,2019-10-07 14:07:03.624897483,2097172,T,IEX,68.640000,88
2019-10-07 14:07:24.614496000,2019-10-07 14:07:24.614476903,2113487,T,IEX,68.630000,1
2019-10-07 14:08:02.28069888,2019-10-07 14:08:02.28050490,2140287,T,IEX,68.620000,3
2019-10-07 14:08:14.400836096,2019-10-07 14:08:14.400815216,2149876,T,IEX,68.595000,100
2019-10-07 14:08:16.736741120,2019-10-07 14:08:16.736722550,2152042,T,IEX,68.595000,100
2019-10-07 14:08:28.231237888,2019-10-07 14:08:28.231218951,2160703,T,IEX,68.595000,100
2019-10-07 14:08:30.4312064,2019-10-07 14:08:30.4290616,2162305,T,IEX,68.590000,100
2019-10-07 14:08:36.276425984,2019-10-07 14:08:36.276406575,2167518,T,IEX,68.585000,4
2019-10-07 14:08:38.635348992,2019-10-07 14:08:38.635327763,2169350,T,IEX,68.585000,100
2019-10-07 14:08:39.661419008,2019-10-07 14:08:39.661403222,2170020,T,IEX,68.585000,400
2019-10-07 14:08:39.939479040,2019-10-07 14:08:39.939461085,2170146,T,IEX,68.585000,100
2019-10-07 14:08:45.902908928,2019-10-07 14:08:45.902889724,2174019,T,IEX,68.595000,1
2019-10-07 14:09:26.193324032,2019-10-07 14:09:26.193308578,2204917,T,IEX,68.620000,1
2019-10-07 14:09:48.456137984,2019-10-07 14:09:48.456122168,2221440,T,IEX,68.630000,1
2019-10-07 14:10:23.652643072,2019-10-07 14:10:23.652626344,2252610,T,IEX,68.665000,100
2019-10-07 14:10:37.435834112,2019-10-07 14:10:37.435815910,2266265,T,IEX,68.660000,46
2019-10-07 14:10:54.721207040,2019-10-07 14:10:54.721188866,2279528,T,IEX,68.640000,100
2019-10-07 14:10:54.721449984,2019-10-07 14:10:54.721433047,2279530,T,IEX,68.640000,2
2019-10-07 14:11:00.772880896,2019-10-07 14:11:00.772862417,2284453,T,IEX,68.635000,2
2019-10-07 14:11:37.970285056,2019-10-07 14:11:37.970265437,2316634,T,IEX,68.620000,1
2019-10-07 14:11:49.129722112,2019-10-07 14:11:49.129704263,2322410,T,IEX,68.615000,100
2019-10-07 14:11:51.766373888,2019-10-07 14:11:51.766357319,2324414,T,IEX,68.615000,100
2019-10-07 14:11:56.972561920,2019-10-07 14:11:56.972545229,2328266,T,IEX,68.615000,100
2019-10-07 14:11:58.949156096,2019-10-07 14:11:58.949137262,2329883,T,IEX,68.610000,4
2019-10-07 14:12:11.161228032,2019-10-07 14:12:11.161152208,2337949,T,IEX,68.645000,100
2019-10-07 14:12:11.163543040,2019-10-07 14:12:11.163523669,2337960,T,IEX,68.645000,1
2019-10-07 14:12:11.163557120,2019-10-07 14:12:11.163540769,2337961,T,IEX,68.645000,1
2019-10-07 14:12:11.163568896,2019-10-07 14:12:11.163552314,2337962,T,IEX,68.645000,98
2019-10-07 14:12:13.56772096,2019-10-07 14:12:13.56753421,2338681,T,IEX,68.645000,100
2019-10-07 14:12:13.621056000,2019-10-07 14:12:13.621032635,2338959,T,IEX,68.645000,100
2019-10-07 14:12:22.292108032,2019-10-07 14:12:22.292090766,2346486,T,IEX,68.675000,3
2019-10-07 14:12:28.540844032,2019-10-07 14:12:28.540825775,2352433,T,IEX,68.650000,100
2019-10-07 14:12:52.662524928,2019-10-07 14:12:52.662503493,2368077,T,IEX,68.655000,100
2019-10-07 14:13:15.529604096,2019-10-07 14:13:15.529585055,2385226,T,IEX,68.670000,100
2019-10-07 14:13:41.433959936,2019-10-07 14:13:41.433941357,2402672,T,IEX,68.610000,50
2019-10-07 14:13:41.434074880,2019-10-07 14:13:41.434058545,2402673,T,IEX,68.610000,50
2019-10-07 14:13:41.493362944,2019-10-07 14:13:41.493344843,2402705,T,IEX,68.610000,50
2019-10-07 14:13:52.707832064,2019-10-07 14:13:52.707813685,2409269,T,IEX,68.625000,1
2019-10-07 14:14:09.477698048,2019-10-07 14:14:09.477677334,2420452,T,IEX,68.630000,12
2019-10-07 14:14:42.981398016,2019-10-07 14:14:42.981379205,2447488,T,IEX,68.640000,2
2019-10-07 14:15:05.598459904,2019-10-07 14:15:05.598441959,2463037,T,IEX,68.645000,100
2019-10-07 14:15:36.59484928,2019-10-07 14:15:36.59468027,2491657,T,IEX,68.665000,385
2019-10-07 14:16:12.634595072,2019-10-07 14:16:12.634576851,2515969,T,IEX,68.645000,100
2019-10-07 14:16:12.634607104,2019-10-07 14:16:12.634589848,2515970,T,IEX,68.645000,1
2019-10-07 14:16:27.32869120,2019-10-07 14:16:27.32850179,2523366,T,IEX,68.640000,2
2019-10-07 14:16:27.32880128,2019-10-07 14:16:27.32862783,2523367,T,IEX,68.640000,2
2019-10-07 14:16:43.692131072,2019-10-07 14:16:43.692110829,2535207,T,IEX,68.615000,5
2019-10-07 14:17:03.274761984,2019-10-07 14:17:03.274741171,2548195,T,IEX,68.620000,1
2019-10-07 14:17:03.274803968,2019-10-07 14:17:03.274786618,2548196,T,IEX,68.620000,13
2019-10-07 14:17:21.764001024,2019-10-07 14:17:21.763980043,2561395,T,IEX,68.620000,1
2019-10-07 14:17:21.764572928,2019-10-07 14:17:21.764555811,2561398,T,IEX,68.620000,4
2019-10-07 14:18:11.967558912,2019-10-07 14:18:11.967537446,2595326,T,IEX,68.605000,100
2019-10-07 14:18:11.973110016,2019-10-07 14:18:11.973086739,2595363,T,IEX,68.605000,800
2019-10-07 14:18:11.973124096,2019-10-07 14:18:11.973105711,2595364,T,IEX,68.605000,400
2019-10-07 14:18:11.987008000,2019-10-07 14:18:11.986989456,2595386,T,IEX,68.605000,1200
2019-10-07 14:18:23.837406976,2019-10-07 14:18:23.837387978,2602565,T,IEX,68.615000,200
2019-10-07 14:18:56.3051008,2019-10-07 14:18:56.3032817,2624735,T,IEX,68.635000,1
2019-10-07 14:19:06.254740992,2019-10-07 14:19:06.254718820,2631512,T,IEX,68.630000,27
2019-10-07 14:19:25.502054912,2019-10-07 14:19:25.502037746,2641298,T,IEX,68.625000,145
2019-10-07 14:19:32.39481088,2019-10-07 14:19:32.39461412,2646613,T,IEX,68.615000,141
2019-10-07 14:19:33.112637952,2019-10-07 14:19:33.112620729,2647723,T,IEX,68.615000,100
2019-10-07 14:19:39.292470016,2019-10-07 14:19:39.292449084,2651431,T,IEX,68.620000,3
2019-10-07 14:19:40.131638016,2019-10-07 14:19:40.131619484,2652083,T,IEX,68.625000,424
2019-10-07 14:19:52.977690112,2019-10-07 14:19:52.977671257,2660172,T,IEX,68.605000,100
2019-10-07 14:20:06.812288000,2019-10-07 14:20:06.812272788,2672126,T,IEX,68.640000,4
2019-10-07 14:20:41.819160064,2019-10-07 14:20:41.819141564,2693361,T,IEX,68.645000,100
2019-10-07 14:21:03.608823040,2019-10-07 14:21:03.608803908,2704358,T,IEX,68.645000,100
2019-10-07 14:21:22.347267072,2019-10-07 14:21:22.347248363,2724856,T,IEX,68.675000,1
2019-10-07 14:21:33.356509952,2019-10-07 14:21:33.356485082,2735007,T,IEX,68.650000,100
2019-10-07 14:21:34.270298112,2019-10-07 14:21:34.270278025,2735941,T,IEX,68.645000,100
2019-10-07 14:21:43.592094976,2019-10-07 14:21:43.592075190,2742218,T,IEX,68.625000,500
2019-10-07 14:21:45.129251072,2019-10-07 14:21:45.129232357,2743677,T,IEX,68.620000,100
2019-10-07 14:21:53.442089984,2019-10-07 14:21:53.442067282,2748342,T,IEX,68.625000,200
2019-10-07 14:22:20.347298048,2019-10-07 14:22:20.347274931,2768139,T,IEX,68.605000,100
2019-10-07 14:22:20.349088000,2019-10-07 14:22:20.349061676,2768235,T,IEX,68.610000,100
2019-10-07 14:22:32.240126976,2019-10-07 14:22:32.240109383,2775302,T,IEX,68.610000,300
2019-10-07 14:22:40.591715072,2019-10-07 14:22:40.591696492,2778833,T,IEX,68.605000,100
2019-10-07 14:22:54.224744960,2019-10-07 14:22:54.224726063,2786617,T,IEX,68.605000,6
2019-10-07 14:22:54.227390976,2019-10-07 14:22:54.227368478,2786618,T,IEX,68.610000,3
2019-10-07 14:22:54.227399936,2019-10-07 14:22:54.227381852,2786619,T,IEX,68.610000,8
2019-10-07 14:22:54.227416064,2019-10-07 14:22:54.227399867,2786620,T,IEX,68.610000,6
2019-10-07 14:23:03.782298112,2019-10-07 14:23:03.782277167,2791075,T,IEX,68.605000,1100
2019-10-07 14:23:03.783254016,2019-10-07 14:23:03.783234177,2791076,T,IEX,68.605000,1200
2019-10-07 14:23:06.610752000,2019-10-07 14:23:06.610734319,2792760,T,IEX,68.610000,100
2019-10-07 14:23:33.65948928,2019-10-07 14:23:33.65928002,2810626,T,IEX,68.630000,1
2019-10-07 14:23:42.126406912,2019-10-07 14:23:42.126391887,2815159,T,IEX,68.625000,1
2019-10-07 14:23:45.778696960,2019-10-07 14:23:45.778668807,2817134,T,IEX,68.620000,100
2019-10-07 14:23:48.506432000,2019-10-07 14:23:48.506413268,2818604,T,IEX,68.620000,100
2019-10-07 14:23:58.392872960,2019-10-07 14:23:58.392850363,2824712,T,IEX,68.600000,40
2019-10-07 14:24:04.577931008,2019-10-07 14:24:04.577911430,2832007,T,IEX,68.605000,300
2019-10-07 14:24:04.577947904,2019-10-07 14:24:04.577931581,2832008,T,IEX,68.605000,800
2019-10-07 14:24:04.577964032,2019-10-07 14:24:04.577948208,2832009,T,IEX,68.605000,400
2019-10-07 14:24:04.578917120,2019-10-07 14:24:04.578898664,2832010,T,IEX,68.605000,400
2019-10-07 14:24:04.588689920,2019-10-07 14:24:04.588671078,2832016,T,IEX,68.605000,500
2019-10-07 14:24:06.289872896,2019-10-07 14:24:06.289854986,2832924,T,IEX,68.605000,200
2019-10-07 14:24:39.693912064,2019-10-07 14:24:39.693893889,2856872,T,IEX,68.670000,3
2019-10-07 14:24:43.887443968,2019-10-07 14:24:43.887425168,2859087,T,IEX,68.675000,100
2019-10-07 14:24:51.961100032,2019-10-07 14:24:51.961082018,2866221,T,IEX,68.670000,300
2019-10-07 14:25:25.111040000,2019-10-07 14:25:25.111022337,2888976,T,IEX,68.685000,100
2019-10-07 14:25:27.283000064,2019-10-07 14:25:27.282979949,2890269,T,IEX,68.690000,1
2019-10-07 14:25:33.645036032,2019-10-07 14:25:33.645016737,2894240,T,IEX,68.695000,1
2019-10-07 14:26:06.670351872,2019-10-07 14:26:06.670336029,2918905,T,IEX,68.715000,6
2019-10-07 14:26:07.225065984,2019-10-07 14:26:07.225049668,2919257,T,IEX,68.710000,72
2019-10-07 14:26:17.540859904,2019-10-07 14:26:17.540839450,2926495,T,IEX,68.710000,100
2019-10-07 14:26:21.629402880,2019-10-07 14:26:21.629387803,2928301,T,IEX,68.720000,100
2019-10-07 14:26:21.629570048,2019-10-07 14:26:21.629552086,2928303,T,IEX,68.715000,6
2019-10-07 14:26:21.629587968,2019-10-07 14:26:21.629571627,2928304,T,IEX,68.715000,94
2019-10-07 14:26:22.157440000,2019-10-07 14:26:22.157423707,2928598,T,IEX,68.735000,6
2019-10-07 14:27:24.300857088,2019-10-07 14:27:24.300836884,2978429,T,IEX,68.755000,100
2019-10-07 14:27:48.140177920,2019-10-07 14:27:48.140159434,2991593,T,IEX,68.775000,1
2019-10-07 14:27:50.810964992,2019-10-07 14:27:50.810947477,2993412,T,IEX,68.780000,27
2019-10-07 14:27:51.137788928,2019-10-07 14:27:51.137769573,2993576,T,IEX,68.785000,72
2019-10-07 14:27:51.137797120,2019-10-07 14:27:51.137778353,2993577,T,IEX,68.785000,1
2019-10-07 14:27:51.137816064,2019-10-07 14:27:51.137798090,2993578,T,IEX,68.785000,27
2019-10-07 14:28:04.975009024,2019-10-07 14:28:04.974991075,3002534,T,IEX,68.760000,82
2019-10-07 14:28:08.602774016,2019-10-07 14:28:08.602752069,3005284,T,IEX,68.760000,1
2019-10-07 14:28:17.314656000,2019-10-07 14:28:17.314637674,3009026,T,IEX,68.765000,6
2019-10-07 14:28:23.603531008,2019-10-07 14:28:23.603513761,3013506,T,IEX,68.775000,6
2019-10-07 14:28:24.140930048,2019-10-07 14:28:24.140912164,3014292,T,IEX,68.780000,98
2019-10-07 14:28:24.292881920,2019-10-07 14:28:24.292866885,3014715,T,IEX,68.795000,1
2019-10-07 14:28:24.292902912,2019-10-07 14:28:24.292886489,3014716,T,IEX,68.795000,2
2019-10-07 14:28:24.292912128,2019-10-07 14:28:24.292895503,3014717,T,IEX,68.795000,86
2019-10-07 14:28:24.292925952,2019-10-07 14:28:24.292908838,3014718,T,IEX,68.795000,6
2019-10-07 14:28:24.292943104,2019-10-07 14:28:24.292927595,3014719,T,IEX,68.795000,6
2019-10-07 14:29:32.993551104,2019-10-07 14:29:32.993531027,3055973,T,IEX,68.780000,9
2019-10-07 14:30:12.756848128,2019-10-07 14:30:12.756827961,3087218,T,IEX,68.755000,1
2019-10-07 14:30:26.669037056,2019-10-07 14:30:26.669017111,3097465,T,IEX,68.750000,100
2019-10-07 14:30:31.174480896,2019-10-07 14:30:31.174465197,3099840,T,IEX,68.755000,1363
2019-10-07 14:31:21.403105024,2019-10-07 14:31:21.403081819,3135485,T,IEX,68.685000,100
2019-10-07 14:31:34.719979008,2019-10-07 14:31:34.719958095,3146812,T,IEX,68.670000,100
2019-10-07 14:31:41.940916992,2019-10-07 14:31:41.940895336,3153771,T,IEX,68.670000,6
2019-10-07 14:31:41.941780992,2019-10-07 14:31:41.941760613,3153774,T,IEX,68.670000,1
2019-10-07 14:32:06.601299968,2019-10-07 14:32:06.601278703,3168187,T,IEX,68.690000,500
2019-10-07 14:32:07.306415104,2019-10-07 14:32:07.306392588,3168676,T,IEX,68.700000,100
2019-10-07 14:32:07.306650112,2019-10-07 14:32:07.306630277,3168693,T,IEX,68.700000,2
2019-10-07 14:32:07.306903040,2019-10-07 14:32:07.306880623,3168702,T,IEX,68.700000,100
2019-10-07 14:32:23.337568000,2019-10-07 14:32:23.337547662,3179909,T,IEX,68.715000,6
2019-10-07 14:32:24.645899008,2019-10-07 14:32:24.645880247,3181145,T,IEX,68.715000,3
2019-10-07 14:32:38.559501056,2019-10-07 14:32:38.559484784,3190345,T,IEX,68.725000,1
2019-10-07 14:33:19.886810112,2019-10-07 14:33:19.886793489,3215740,T,IEX,68.700000,2
2019-10-07 14:33:25.211673088,2019-10-07 14:33:25.211653366,3221657,T,IEX,68.710000,8
2019-10-07 14:33:28.599569920,2019-10-07 14:33:28.599547683,3223991,T,IEX,68.725000,6
2019-10-07 14:33:39.704904960,2019-10-07 14:33:39.704889319,3233049,T,IEX,68.715000,2
2019-10-07 14:34:03.953088,2019-10-07 14:34:03.935959,3246359,T,IEX,68.740000,1
2019-10-07 14:34:28.699170048,2019-10-07 14:34:28.699153928,3264116,T,IEX,68.730000,475
2019-10-07 14:34:28.707411968,2019-10-07 14:34:28.707395157,3264135,T,IEX,68.750000,2
2019-10-07 14:34:28.710043904,2019-10-07 14:34:28.710023579,3264141,T,IEX,68.760000,1
2019-10-07 14:34:28.710054912,2019-10-07 14:34:28.710037015,3264142,T,IEX,68.760000,2
2019-10-07 14:34:28.713063936,2019-10-07 14:34:28.713045205,3264149,T,IEX,68.760000,1
2019-10-07 14:34:28.714018048,2019-10-07 14:34:28.714001394,3264155,T,IEX,68.760000,199
2019-10-07 14:34:46.411499008,2019-10-07 14:34:46.411477095,3275563,T,IEX,68.775000,1
2019-10-07 14:35:12.503480064,2019-10-07 14:35:12.503461709,3296620,T,IEX,68.800000,1
2019-10-07 14:35:12.503495936,2019-10-07 14:35:12.503479800,3296621,T,IEX,68.800000,5
2019-10-07 14:35:39.989202944,2019-10-07 14:35:39.989182002,3313382,T,IEX,68.805000,100
2019-10-07 14:36:18.241465088,2019-10-07 14:36:18.241446491,3343821,T,IEX,68.765000,1
2019-10-07 14:36:18.245223936,2019-10-07 14:36:18.245205637,3343990,T,IEX,68.765000,5
2019-10-07 14:36:18.531123968,2019-10-07 14:36:18.531106964,3345116,T,IEX,68.765000,10
2019-10-07 14:36:19.942648064,2019-10-07 14:36:19.942624581,3346216,T,IEX,68.765000,2
2019-10-07 14:36:19.944044032,2019-10-07 14:36:19.944023548,3346217,T,IEX,68.765000,3
2019-10-07 14:36:26.418203904,2019-10-07 14:36:26.418182203,3349968,T,IEX,68.745000,19
2019-10-07 14:36:27.259927040,2019-10-07 14:36:27.259910775,3350366,T,IEX,68.745000,6
2019-10-07 14:36:27.259948032,2019-10-07 14:36:27.259930111,3350367,T,IEX,68.745000,58
2019-10-07 14:36:27.337795072,2019-10-07 14:36:27.337777072,3350422,T,IEX,68.745000,23
2019-10-07 14:36:32.806938112,2019-10-07 14:36:32.806920004,3354234,T,IEX,68.745000,100
2019-10-07 14:36:52.844400128,2019-10-07 14:36:52.844382253,3370538,T,IEX,68.760000,6
2019-10-07 14:36:52.859346944,2019-10-07 14:36:52.859325586,3371061,T,IEX,68.750000,100
2019-10-07 14:36:52.859718912,2019-10-07 14:36:52.859701219,3371076,T,IEX,68.750000,100
2019-10-07 14:36:52.860052992,2019-10-07 14:36:52.860034778,3371095,T,IEX,68.750000,100
2019-10-07 14:37:12.457996032,2019-10-07 14:37:12.457970114,3394449,T,IEX,68.705000,1
2019-10-07 14:37:18.47433984,2019-10-07 14:37:18.47418711,3399528,T,IEX,68.710000,9
2019-10-07 14:37:53.310790912,2019-10-07 14:37:53.310772444,3424977,T,IEX,68.720000,100
2019-10-07 14:38:20.396829952,2019-10-07 14:38:20.396810362,3441731,T,IEX,68.715000,100
2019-10-07 14:38:34.246742016,2019-10-07 14:38:34.246720940,3451372,T,IEX,68.690000,100
2019-10-07 14:38:47.880769024,2019-10-07 14:38:47.880751330,3459201,T,IEX,68.690000,3
2019-10-07 14:38:59.953381120,2019-10-07 14:38:59.953360824,3466820,T,IEX,68.690000,46
2019-10-07 14:39:07.901132032,2019-10-07 14:39:07.901110735,3473138,T,IEX,68.685000,100
2019-10-07 14:39:10.111281920,2019-10-07 14:39:10.111266305,3474781,T,IEX,68.685000,100
2019-10-07 14:39:10.382450944,2019-10-07 14:39:10.382431949,3475011,T,IEX,68.685000,100
2019-10-07 14:39:45.852780032,2019-10-07 14:39:45.852762433,3499047,T,IEX,68.660000,1
2019-10-07 14:40:04.90961920,2019-10-07 14:40:04.90945279,3512466,T,IEX,68.660000,4
2019-10-07 14:40:04.90983936,2019-10-07 14:40:04.90965972,3512467,T,IEX,68.660000,1
2019-10-07 14:40:05.674828032,2019-10-07 14:40:05.674811911,3513449,T,IEX,68.665000,1
2019-10-07 14:40:09.326376960,2019-10-07 14:40:09.326360070,3515252,T,IEX,68.670000,3
2019-10-07 14:40:09.326426112,2019-10-07 14:40:09.326409628,3515253,T,IEX,68.670000,2
2019-10-07 14:40:09.326476032,2019-10-07 14:40:09.326456503,3515254,T,IEX,68.670000,1
2019-10-07 14:40:32.627066880,2019-10-07 14:40:32.627048449,3532036,T,IEX,68.695000,2
2019-10-07 14:40:32.704674048,2019-10-07 14:40:32.704655667,3533248,T,IEX,68.700000,1
2019-10-07 14:40:35.416252928,2019-10-07 14:40:35.416234954,3537114,T,IEX,68.690000,100
2019-10-07 14:40:35.416377088,2019-10-07 14:40:35.416360219,3537116,T,IEX,68.690000,100
2019-10-07 14:40:35.416434944,2019-10-07 14:40:35.416418713,3537117,T,IEX,68.690000,100
2019-10-07 14:40:38.272157952,2019-10-07 14:40:38.272134485,3538901,T,IEX,68.685000,1
2019-10-07 14:40:38.283865088,2019-10-07 14:40:38.283844356,3538903,T,IEX,68.685000,2
2019-10-07 14:40:42.395547904,2019-10-07 14:40:42.395531799,3540936,T,IEX,68.685000,45
2019-10-07 14:40:57.704699904,2019-10-07 14:40:57.704677525,3550727,T,IEX,68.715000,100
2019-10-07 14:41:01.94877952,2019-10-07 14:41:01.94860548,3552817,T,IEX,68.715000,2
2019-10-07 14:41:02.57905920,2019-10-07 14:41:02.57885306,3553568,T,IEX,68.720000,1
2019-10-07 14:41:06.349864960,2019-10-07 14:41:06.349845710,3557407,T,IEX,68.730000,1
2019-10-07 14:41:25.40076032,2019-10-07 14:41:25.40056303,3572243,T,IEX,68.735000,2
2019-10-07 14:41:29.207060992,2019-10-07 14:41:29.207035452,3575032,T,IEX,68.735000,1
2019-10-07 14:41:42.540634112,2019-10-07 14:41:42.540614834,3582411,T,IEX,68.715000,2
2019-10-07 14:41:56.964261888,2019-10-07 14:41:56.964244500,3593997,T,IEX,68.725000,1
2019-10-07 14:42:38.38972928,2019-10-07 14:42:38.38953426,3625617,T,IEX,68.700000,7
2019-10-07 14:43:39.219022080,2019-10-07 14:43:39.219004457,3664229,T,IEX,68.695000,6
2019-10-07 14:44:00.626382080,2019-10-07 14:44:00.626366903,3679856,T,IEX,68.715000,5
2019-10-07 14:44:03.853368064,2019-10-07 14:44:03.853349311,3687420,T,IEX,68.705000,1
2019-10-07 14:44:09.869178880,2019-10-07 14:44:09.869161570,3693687,T,IEX,68.710000,100
2019-10-07 14:45:01.605219072,2019-10-07 14:45:01.605200272,3733851,T,IEX,68.680000,100
2019-10-07 14:45:07.291429120,2019-10-07 14:45:07.291412634,3737101,T,IEX,68.670000,100
2019-10-07 14:45:07.291448064,2019-10-07 14:45:07.291432778,3737102,T,IEX,68.670000,200
2019-10-07 14:45:24.374189056,2019-10-07 14:45:24.374173304,3749013,T,IEX,68.660000,11
2019-10-07 14:45:26.334384128,2019-10-07 14:45:26.334363959,3750743,T,IEX,68.665000,700
2019-10-07 14:45:26.342760960,2019-10-07 14:45:26.342742587,3750748,T,IEX,68.665000,500
2019-10-07 14:45:26.351339008,2019-10-07 14:45:26.351314829,3750752,T,IEX,68.665000,100
2019-10-07 14:45:33.29914880,2019-10-07 14:45:33.29897355,3761460,T,IEX,68.655000,100
2019-10-07 14:45:46.112478976,2019-10-07 14:45:46.112451313,3774332,T,IEX,68.655000,6
2019-10-07 14:45:46.117484032,2019-10-07 14:45:46.117465883,3774347,T,IEX,68.645000,4
2019-10-07 14:45:48.53767936,2019-10-07 14:45:48.53747360,3776129,T,IEX,68.660000,20
2019-10-07 14:45:48.58172928,2019-10-07 14:45:48.58153877,3776273,T,IEX,68.660000,8
2019-10-07 14:45:51.842018048,2019-10-07 14:45:51.842000467,3779768,T,IEX,68.665000,2
2019-10-07 14:45:54.790685952,2019-10-07 14:45:54.790669609,3782666,T,IEX,68.675000,6
2019-10-07 14:46:01.910752000,2019-10-07 14:46:01.910734020,3787816,T,IEX,68.655000,100
2019-10-07 14:46:01.922734080,2019-10-07 14:46:01.922711503,3787820,T,IEX,68.655000,100
2019-10-07 14:46:02.216845056,2019-10-07 14:46:02.216823773,3787927,T,IEX,68.655000,100
2019-10-07 14:46:02.220889088,2019-10-07 14:46:02.220871701,3787935,T,IEX,68.655000,100
2019-10-07 14:46:04.32210944,2019-10-07 14:46:04.32190307,3789177,T,IEX,68.655000,100
2019-10-07 14:46:10.111632896,2019-10-07 14:46:10.111613126,3795110,T,IEX,68.675000,300
2019-10-07 14:46:10.745739008,2019-10-07 14:46:10.745719385,3795575,T,IEX,68.675000,1
2019-10-07 14:46:10.745754880,2019-10-07 14:46:10.745739550,3795576,T,IEX,68.675000,2
2019-10-07 14:46:10.745776128,2019-10-07 14:46:10.745759875,3795577,T,IEX,68.675000,3
2019-10-07 14:46:25.111403008,2019-10-07 14:46:25.111384060,3805263,T,IEX,68.655000,100
2019-10-07 14:46:25.202113024,2019-10-07 14:46:25.202097623,3805330,T,IEX,68.655000,1
2019-10-07 14:46:25.355891968,2019-10-07 14:46:25.355873190,3805443,T,IEX,68.655000,3
2019-10-07 14:46:36.141965056,2019-10-07 14:46:36.141946985,3811261,T,IEX,68.655000,300
2019-10-07 14:46:36.150915072,2019-10-07 14:46:36.150896076,3811266,T,IEX,68.655000,300
2019-10-07 14:46:40.111570944,2019-10-07 14:46:40.111552269,3813250,T,IEX,68.655000,100
2019-10-07 14:46:40.236975104,2019-10-07 14:46:40.236956225,3813277,T,IEX,68.655000,6
2019-10-07 14:46:55.464636928,2019-10-07 14:46:55.464620491,3823266,T,IEX,68.645000,5
2019-10-07 14:46:59.709871104,2019-10-07 14:46:59.709851957,3826194,T,IEX,68.640000,10
2019-10-07 14:47:19.317853952,2019-10-07 14:47:19.317835982,3840775,T,IEX,68.655000,11
2019-10-07 14:47:34.322927104,2019-10-07 14:47:34.322906326,3853155,T,IEX,68.690000,50
2019-10-07 14:48:44.788623872,2019-10-07 14:48:44.788607743,3894195,T,IEX,68.665000,1
2019-10-07 14:49:01.165046016,2019-10-07 14:49:01.165030016,3904711,T,IEX,68.660000,4
2019-10-07 14:49:06.163683072,2019-10-07 14:49:06.163667246,3907100,T,IEX,68.675000,2
2019-10-07 14:49:06.163693056,2019-10-07 14:49:06.163676041,3907101,T,IEX,68.675000,3
2019-10-07 14:49:06.163712000,2019-10-07 14:49:06.163696042,3907102,T,IEX,68.675000,1
2019-10-07 14:49:06.213864960,2019-10-07 14:49:06.213846739,3907108,T,IEX,68.675000,1
2019-10-07 14:50:52.184335104,2019-10-07 14:50:52.184315883,3975084,T,IEX,68.700000,9
2019-10-07 14:51:00.998249984,2019-10-07 14:51:00.998233818,3980772,T,IEX,68.705000,1
2019-10-07 14:51:12.281459968,2019-10-07 14:51:12.281444037,3990586,T,IEX,68.705000,3
2019-10-07 14:51:18.490073088,2019-10-07 14:51:18.490053410,3994987,T,IEX,68.705000,300
2019-10-07 14:51:18.728249088,2019-10-07 14:51:18.728230206,3995108,T,IEX,68.700000,16
2019-10-07 14:51:21.490266880,2019-10-07 14:51:21.490245718,3996835,T,IEX,68.700000,56
2019-10-07 14:51:24.265751040,2019-10-07 14:51:24.265728372,3998142,T,IEX,68.710000,10
2019-10-07 14:51:24.536338944,2019-10-07 14:51:24.536316804,3998257,T,IEX,68.715000,400
2019-10-07 14:51:24.537284096,2019-10-07 14:51:24.537263408,3998258,T,IEX,68.715000,1600
2019-10-07 14:51:26.348620032,2019-10-07 14:51:26.348600957,3999309,T,IEX,68.715000,200
2019-10-07 14:51:29.757975040,2019-10-07 14:51:29.757953139,4000769,T,IEX,68.720000,300
2019-10-07 14:51:42.810761984,2019-10-07 14:51:42.810742283,4005582,T,IEX,68.705000,100
2019-10-07 14:52:41.529569024,2019-10-07 14:52:41.529551069,4044029,T,IEX,68.720000,1
2019-10-07 14:53:32.559070976,2019-10-07 14:53:32.559052629,4075325,T,IEX,68.715000,1
2019-10-07 14:54:01.679524096,2019-10-07 14:54:01.679505003,4089979,T,IEX,68.720000,1
2019-10-07 14:54:12.746426880,2019-10-07 14:54:12.746405906,4099463,T,IEX,68.725000,98
2019-10-07 14:54:43.474147072,2019-10-07 14:54:43.474126675,4118914,T,IEX,68.710000,1
2019-10-07 14:54:43.475211008,2019-10-07 14:54:43.475190066,4118916,T,IEX,68.710000,1
2019-10-07 14:55:14.761356032,2019-10-07 14:55:14.761340792,4139984,T,IEX,68.700000,1
2019-10-07 14:55:17.487147008,2019-10-07 14:55:17.487130539,4143308,T,IEX,68.710000,4
2019-10-07 14:55:17.487534080,2019-10-07 14:55:17.487516545,4143313,T,IEX,68.710000,3
2019-10-07 14:55:26.994518016,2019-10-07 14:55:26.994501527,4154750,T,IEX,68.730000,6
2019-10-07 14:55:42.631661056,2019-10-07 14:55:42.631643480,4176791,T,IEX,68.745000,1
2019-10-07 14:56:06.503772928,2019-10-07 14:56:06.503754693,4198018,T,IEX,68.745000,100
2019-10-07 14:56:20.632571904,2019-10-07 14:56:20.632553293,4211005,T,IEX,68.720000,100
2019-10-07 14:56:50.226662912,2019-10-07 14:56:50.226647986,4231048,T,IEX,68.730000,100
2019-10-07 14:57:03.71542016,2019-10-07 14:57:03.71516759,4238235,T,IEX,68.725000,103
2019-10-07 14:57:24.634152960,2019-10-07 14:57:24.634135123,4253056,T,IEX,68.715000,2
2019-10-07 14:57:31.734012928,2019-10-07 14:57:31.733994910,4256560,T,IEX,68.700000,100
2019-10-07 14:57:43.315507968,2019-10-07 14:57:43.315488383,4265313,T,IEX,68.725000,3
2019-10-07 14:57:43.315520000,2019-10-07 14:57:43.315504394,4265314,T,IEX,68.725000,6
2019-10-07 14:57:43.315534080,2019-10-07 14:57:43.315516783,4265315,T,IEX,68.725000,3
2019-10-07 14:57:59.941018112,2019-10-07 14:57:59.940999783,4276303,T,IEX,68.725000,1
