2019-10-25 13:30:01.144244992,2019-10-25 13:30:01.144222615,78915,T,IEX,49.750000,100
2019-10-25 13:32:16.904738048,2019-10-25 13:32:16.904713429,243123,T,IEX,49.290000,100
2019-10-25 13:32:30.301036032,2019-10-25 13:32:30.301014195,256453,T,IEX,49.340000,100
2019-10-25 13:32:34.88807936,2019-10-25 13:32:34.88780999,260438,T,IEX,49.350000,100
2019-10-25 13:33:04.641179904,2019-10-25 13:33:04.641157767,295121,T,IEX,49.420000,11
2019-10-25 13:33:29.745526016,2019-10-25 13:33:29.745509634,328766,T,IEX,49.040000,100
2019-10-25 13:33:45.671115008,2019-10-25 13:33:45.671093359,347741,T,IEX,49.030000,15
2019-10-25 13:33:45.671290112,2019-10-25 13:33:45.671273504,347743,T,IEX,49.030000,85
2019-10-25 13:33:45.671845888,2019-10-25 13:33:45.671824706,347744,T,IEX,49.040000,100
2019-10-25 13:33:46.499539968,2019-10-25 13:33:46.499520769,348814,T,IEX,48.975000,95
2019-10-25 13:33:46.665958912,2019-10-25 13:33:46.665940813,349000,T,IEX,49.025000,100
2019-10-25 13:33:46.666038016,2019-10-25 13:33:46.666021024,349001,T,IEX,49.030000,100
2019-10-25 13:33:51.425140992,2019-10-25 13:33:51.425124129,353896,T,IEX,49.120000,100
2019-10-25 13:33:51.425328896,2019-10-25 13:33:51.425312675,353897,T,IEX,49.130000,100
2019-10-25 13:33:55.114040064,2019-10-25 13:33:55.114019839,357668,T,IEX,49.080000,2
2019-10-25 13:34:08.629722112,2019-10-25 13:34:08.629701398,375328,T,IEX,49.350000,100
2019-10-25 13:35:17.126042880,2019-10-25 13:35:17.126022971,466394,T,IEX,49.410000,100
2019-10-25 13:37:04.377519104,2019-10-25 13:37:04.377502711,575305,T,IEX,49.340000,100
2019-10-25 13:37:16.65477888,2019-10-25 13:37:16.65462200,590341,T,IEX,49.360000,100
2019-10-25 13:37:16.80448000,2019-10-25 13:37:16.80428882,590358,T,IEX,49.360000,100
2019-10-25 13:37:17.855481088,2019-10-25 13:37:17.855462132,592081,T,IEX,49.360000,200
2019-10-25 13:37:17.856591104,2019-10-25 13:37:17.856573907,592082,T,IEX,49.360000,400
2019-10-25 13:37:32.84290048,2019-10-25 13:37:32.84270394,606014,T,IEX,49.390000,200
2019-10-25 13:37:37.879397120,2019-10-25 13:37:37.879377076,610519,T,IEX,49.445000,100
2019-10-25 13:37:44.468555008,2019-10-25 13:37:44.468535057,615482,T,IEX,49.440000,100
2019-10-25 13:38:11.956146944,2019-10-25 13:38:11.956126336,639800,T,IEX,49.470000,100
2019-10-25 13:38:17.874001920,2019-10-25 13:38:17.873982881,645067,T,IEX,49.510000,62
2019-10-25 13:39:45.115665920,2019-10-25 13:39:45.115645403,715351,T,IEX,49.540000,2
2019-10-25 13:39:45.912752128,2019-10-25 13:39:45.912732368,716071,T,IEX,49.550000,100
2019-10-25 13:39:47.316089088,2019-10-25 13:39:47.316072407,716937,T,IEX,49.560000,100
2019-10-25 13:40:36.21424896,2019-10-25 13:40:36.21406612,763568,T,IEX,49.740000,100
2019-10-25 13:40:46.656985088,2019-10-25 13:40:46.656964849,770540,T,IEX,49.840000,100
2019-10-25 13:41:54.605211904,2019-10-25 13:41:54.605189341,827220,T,IEX,49.690000,50
2019-10-25 13:41:54.605293056,2019-10-25 13:41:54.605275111,827222,T,IEX,49.690000,50
2019-10-25 13:41:59.738736128,2019-10-25 13:41:59.738711876,831646,T,IEX,49.700000,100
2019-10-25 13:42:12.849396992,2019-10-25 13:42:12.849376026,844165,T,IEX,49.640000,100
2019-10-25 13:43:05.769553920,2019-10-25 13:43:05.769535821,888890,T,IEX,49.610000,100
2019-10-25 13:43:10.823503104,2019-10-25 13:43:10.823480276,893358,T,IEX,49.480000,3
2019-10-25 13:43:57.276340992,2019-10-25 13:43:57.276322376,927714,T,IEX,49.470000,46
2019-10-25 13:43:57.276459008,2019-10-25 13:43:57.276442573,927716,T,IEX,49.470000,54
2019-10-25 13:44:07.816075008,2019-10-25 13:44:07.816057802,935499,T,IEX,49.490000,100
2019-10-25 13:44:07.816101888,2019-10-25 13:44:07.816086018,935500,T,IEX,49.490000,81
2019-10-25 13:44:07.844007936,2019-10-25 13:44:07.843985765,935523,T,IEX,49.490000,100
2019-10-25 13:44:07.844018944,2019-10-25 13:44:07.844002208,935524,T,IEX,49.490000,339
2019-10-25 13:44:26.932801024,2019-10-25 13:44:26.932779989,949659,T,IEX,49.400000,37
2019-10-25 13:44:26.932956928,2019-10-25 13:44:26.932939641,949662,T,IEX,49.400000,37
2019-10-25 13:44:26.933015040,2019-10-25 13:44:26.932997791,949663,T,IEX,49.400000,26
2019-10-25 13:44:39.409998080,2019-10-25 13:44:39.409979503,964561,T,IEX,49.320000,100
2019-10-25 13:44:39.422098944,2019-10-25 13:44:39.422082128,964573,T,IEX,49.330000,100
2019-10-25 13:44:39.422286080,2019-10-25 13:44:39.422270677,964576,T,IEX,49.330000,100
2019-10-25 13:44:39.422362880,2019-10-25 13:44:39.422344762,964578,T,IEX,49.330000,100
2019-10-25 13:44:39.422435072,2019-10-25 13:44:39.422417802,964580,T,IEX,49.330000,37
2019-10-25 13:44:39.422521088,2019-10-25 13:44:39.422504173,964582,T,IEX,49.330000,100
2019-10-25 13:44:39.422590976,2019-10-25 13:44:39.422574081,964584,T,IEX,49.330000,100
2019-10-25 13:44:39.422667008,2019-10-25 13:44:39.422648699,964586,T,IEX,49.330000,100
2019-10-25 13:44:39.422761984,2019-10-25 13:44:39.422741748,964588,T,IEX,49.330000,27
2019-10-25 13:44:39.422862080,2019-10-25 13:44:39.422843894,964590,T,IEX,49.330000,100
2019-10-25 13:44:39.422946048,2019-10-25 13:44:39.422928178,964592,T,IEX,49.330000,100
2019-10-25 13:44:39.423035904,2019-10-25 13:44:39.423018243,964594,T,IEX,49.330000,100
2019-10-25 13:44:39.423102976,2019-10-25 13:44:39.423085789,964596,T,IEX,49.330000,10
2019-10-25 13:44:39.423212032,2019-10-25 13:44:39.423193166,964598,T,IEX,49.330000,100
2019-10-25 13:44:39.423692032,2019-10-25 13:44:39.423675648,964600,T,IEX,49.330000,100
2019-10-25 13:44:39.423969024,2019-10-25 13:44:39.423952708,964603,T,IEX,49.330000,100
2019-10-25 13:44:39.425041920,2019-10-25 13:44:39.425026459,964607,T,IEX,49.330000,2
2019-10-25 13:45:00.897306112,2019-10-25 13:45:00.897289334,980282,T,IEX,49.305000,1900
2019-10-25 13:45:00.898424064,2019-10-25 13:45:00.898404319,980283,T,IEX,49.305000,600
2019-10-25 13:45:31.380169984,2019-10-25 13:45:31.380150107,1014744,T,IEX,49.350000,75
2019-10-25 13:45:31.380261120,2019-10-25 13:45:31.380244484,1014746,T,IEX,49.350000,50
2019-10-25 13:45:31.380339968,2019-10-25 13:45:31.380323063,1014748,T,IEX,49.350000,25
2019-10-25 13:45:31.380361984,2019-10-25 13:45:31.380344434,1014749,T,IEX,49.350000,50
2019-10-25 13:45:31.380432896,2019-10-25 13:45:31.380416092,1014750,T,IEX,49.340000,100
2019-10-25 13:45:31.380512000,2019-10-25 13:45:31.380494827,1014751,T,IEX,49.340000,100
2019-10-25 13:45:52.624852992,2019-10-25 13:45:52.624831956,1032056,T,IEX,49.270000,2400
2019-10-25 13:46:03.477986048,2019-10-25 13:46:03.477967411,1040877,T,IEX,49.250000,200
2019-10-25 13:46:03.478039040,2019-10-25 13:46:03.478022993,1040878,T,IEX,49.250000,100
2019-10-25 13:46:05.70365952,2019-10-25 13:46:05.70345851,1041717,T,IEX,49.260000,100
2019-10-25 13:46:05.597645056,2019-10-25 13:46:05.597628898,1042278,T,IEX,49.255000,800
2019-10-25 13:46:05.650973952,2019-10-25 13:46:05.650953161,1042342,T,IEX,49.255000,500
2019-10-25 13:46:07.889216000,2019-10-25 13:46:07.889195365,1043957,T,IEX,49.240000,100
2019-10-25 13:46:07.889556992,2019-10-25 13:46:07.889538651,1043958,T,IEX,49.230000,100
2019-10-25 13:46:07.890903040,2019-10-25 13:46:07.890884369,1043959,T,IEX,49.225000,650
2019-10-25 13:46:08.215527936,2019-10-25 13:46:08.215512860,1044244,T,IEX,49.225000,500
2019-10-25 13:46:10.274706944,2019-10-25 13:46:10.274686923,1046072,T,IEX,49.200000,2050
2019-10-25 13:46:34.413849088,2019-10-25 13:46:34.413826849,1065204,T,IEX,49.170000,200
2019-10-25 13:46:34.759596032,2019-10-25 13:46:34.759576903,1065436,T,IEX,49.155000,94
2019-10-25 13:46:34.759617024,2019-10-25 13:46:34.759601534,1065437,T,IEX,49.150000,6
2019-10-25 13:46:34.760474880,2019-10-25 13:46:34.760451314,1065439,T,IEX,49.150000,94
2019-10-25 13:46:54.552051968,2019-10-25 13:46:54.552033716,1080559,T,IEX,49.080000,1600
2019-10-25 13:46:56.674056960,2019-10-25 13:46:56.674038049,1082294,T,IEX,49.040000,100
2019-10-25 13:46:59.54472960,2019-10-25 13:46:59.54453818,1084050,T,IEX,49.020000,1300
2019-10-25 13:47:12.410050048,2019-10-25 13:47:12.410031643,1095637,T,IEX,49.020000,35
2019-10-25 13:47:12.410147072,2019-10-25 13:47:12.410130240,1095639,T,IEX,49.020000,65
2019-10-25 13:47:14.816610048,2019-10-25 13:47:14.816588924,1097172,T,IEX,49.040000,1600
2019-10-25 13:47:23.821027072,2019-10-25 13:47:23.821006639,1106804,T,IEX,49.060000,500
2019-10-25 13:47:25.68198912,2019-10-25 13:47:25.68182749,1108183,T,IEX,49.040000,50
2019-10-25 13:47:25.68307968,2019-10-25 13:47:25.68290457,1108185,T,IEX,49.040000,37
2019-10-25 13:47:25.68364032,2019-10-25 13:47:25.68346630,1108186,T,IEX,49.040000,13
2019-10-25 13:47:26.71104000,2019-10-25 13:47:26.71086893,1108769,T,IEX,49.030000,1600
2019-10-25 13:47:43.610904064,2019-10-25 13:47:43.610886095,1123372,T,IEX,49.030000,700
2019-10-25 13:47:43.626021888,2019-10-25 13:47:43.626002310,1123378,T,IEX,49.060000,100
2019-10-25 13:47:43.627094016,2019-10-25 13:47:43.627076427,1123382,T,IEX,49.070000,100
2019-10-25 13:47:44.83963904,2019-10-25 13:47:44.83945941,1123620,T,IEX,49.050000,1200
2019-10-25 13:48:48.616852992,2019-10-25 13:48:48.616831669,1182046,T,IEX,48.970000,12
2019-10-25 13:48:48.616902912,2019-10-25 13:48:48.616885764,1182048,T,IEX,48.970000,13
2019-10-25 13:48:48.616942080,2019-10-25 13:48:48.616925131,1182049,T,IEX,48.970000,50
2019-10-25 13:48:48.616998912,2019-10-25 13:48:48.616982298,1182050,T,IEX,48.970000,3
2019-10-25 13:48:48.617039872,2019-10-25 13:48:48.617022026,1182051,T,IEX,48.970000,22
2019-10-25 13:49:49.906329088,2019-10-25 13:49:49.906314176,1230040,T,IEX,49.110000,1600
2019-10-25 13:50:06.634100992,2019-10-25 13:50:06.634085172,1246283,T,IEX,49.200000,100
2019-10-25 13:50:06.634120960,2019-10-25 13:50:06.634105106,1246284,T,IEX,49.200000,100
2019-10-25 13:50:06.634138880,2019-10-25 13:50:06.634122211,1246285,T,IEX,49.200000,100
2019-10-25 13:50:50.573959936,2019-10-25 13:50:50.573940630,1302631,T,IEX,49.420000,1200
2019-10-25 13:50:57.731034880,2019-10-25 13:50:57.731016351,1309841,T,IEX,49.445000,100
2019-10-25 13:50:57.741435904,2019-10-25 13:50:57.741414657,1309846,T,IEX,49.445000,100
2019-10-25 13:51:01.689646080,2019-10-25 13:51:01.689628824,1313254,T,IEX,49.470000,11
2019-10-25 13:51:01.689794048,2019-10-25 13:51:01.689775089,1313256,T,IEX,49.470000,89
2019-10-25 13:51:03.947911936,2019-10-25 13:51:03.947892101,1315858,T,IEX,49.480000,2800
2019-10-25 13:51:08.355564032,2019-10-25 13:51:08.355544466,1320262,T,IEX,49.490000,1300
2019-10-25 13:51:24.93265920,2019-10-25 13:51:24.93246645,1334378,T,IEX,49.575000,100
2019-10-25 13:51:59.667087104,2019-10-25 13:51:59.667067482,1362099,T,IEX,49.710000,100
2019-10-25 13:52:22.907106048,2019-10-25 13:52:22.907088980,1382377,T,IEX,49.780000,100
2019-10-25 13:52:31.501089024,2019-10-25 13:52:31.501067661,1390130,T,IEX,49.780000,700
2019-10-25 13:53:21.69227008,2019-10-25 13:53:21.69205513,1431633,T,IEX,49.670000,100
2019-10-25 13:53:31.49189888,2019-10-25 13:53:31.49169082,1440271,T,IEX,49.650000,100
2019-10-25 13:53:37.857636096,2019-10-25 13:53:37.857613063,1444472,T,IEX,49.670000,100
2019-10-25 13:53:37.858162944,2019-10-25 13:53:37.858142924,1444474,T,IEX,49.680000,100
2019-10-25 13:53:38.513625088,2019-10-25 13:53:38.513610515,1445304,T,IEX,49.700000,100
2019-10-25 13:53:39.18206976,2019-10-25 13:53:39.18188195,1445939,T,IEX,49.720000,100
2019-10-25 13:53:39.18214912,2019-10-25 13:53:39.18198046,1445940,T,IEX,49.720000,600
2019-10-25 13:54:06.64370944,2019-10-25 13:54:06.64352617,1465574,T,IEX,49.720000,700
2019-10-25 13:54:20.740126976,2019-10-25 13:54:20.740110442,1478109,T,IEX,49.650000,500
2019-10-25 13:54:27.625213952,2019-10-25 13:54:27.625194604,1484353,T,IEX,49.520000,3
2019-10-25 13:54:30.34809088,2019-10-25 13:54:30.34789569,1486084,T,IEX,49.560000,500
2019-10-25 13:54:42.214323968,2019-10-25 13:54:42.214307992,1497598,T,IEX,49.500000,500
2019-10-25 13:54:46.19783936,2019-10-25 13:54:46.19762691,1500527,T,IEX,49.520000,100
2019-10-25 13:54:47.704417024,2019-10-25 13:54:47.704397498,1502451,T,IEX,49.520000,500
2019-10-25 13:54:51.744541952,2019-10-25 13:54:51.744522408,1505627,T,IEX,49.470000,2700
2019-10-25 13:55:04.82370048,2019-10-25 13:55:04.82352351,1515365,T,IEX,49.500000,100
2019-10-25 13:55:04.82459904,2019-10-25 13:55:04.82442441,1515366,T,IEX,49.520000,100
2019-10-25 13:55:10.944421120,2019-10-25 13:55:10.944400068,1521360,T,IEX,49.595000,100
2019-10-25 13:55:11.355645952,2019-10-25 13:55:11.355623159,1521642,T,IEX,49.605000,700
2019-10-25 13:55:26.50941952,2019-10-25 13:55:26.50923529,1532390,T,IEX,49.600000,500
2019-10-25 13:55:33.801331968,2019-10-25 13:55:33.801310994,1536395,T,IEX,49.555000,500
2019-10-25 13:56:10.836824064,2019-10-25 13:56:10.836806466,1566310,T,IEX,49.600000,100
2019-10-25 13:56:24.975525888,2019-10-25 13:56:24.975504516,1574593,T,IEX,49.545000,500
2019-10-25 13:56:59.400611072,2019-10-25 13:56:59.400595363,1600937,T,IEX,49.490000,10
2019-10-25 13:57:14.453056000,2019-10-25 13:57:14.453037938,1612091,T,IEX,49.450000,100
2019-10-25 13:57:18.12826112,2019-10-25 13:57:18.12808266,1614355,T,IEX,49.440000,100
2019-10-25 13:57:22.628975104,2019-10-25 13:57:22.628954676,1616264,T,IEX,49.510000,100
2019-10-25 13:57:22.635414016,2019-10-25 13:57:22.635392742,1616266,T,IEX,49.530000,100
2019-10-25 13:59:48.30609920,2019-10-25 13:59:48.30593846,1723141,T,IEX,49.500000,1
2019-10-25 14:00:11.901089024,2019-10-25 14:00:11.901067802,1737550,T,IEX,49.555000,78
2019-10-25 14:00:46.215017984,2019-10-25 14:00:46.214999496,1775327,T,IEX,49.400000,100
2019-10-25 14:00:49.775373056,2019-10-25 14:00:49.775355436,1778310,T,IEX,49.425000,100
2019-10-25 14:00:49.779131904,2019-10-25 14:00:49.779114326,1778317,T,IEX,49.425000,2200
2019-10-25 14:01:00.202624000,2019-10-25 14:01:00.202602314,1785793,T,IEX,49.380000,900
2019-10-25 14:01:23.502481920,2019-10-25 14:01:23.502462468,1812848,T,IEX,49.430000,75
2019-10-25 14:01:23.502643968,2019-10-25 14:01:23.502626884,1812850,T,IEX,49.430000,25
2019-10-25 14:01:23.502899968,2019-10-25 14:01:23.502879489,1812851,T,IEX,49.430000,100
2019-10-25 14:01:42.476156928,2019-10-25 14:01:42.476138302,1828941,T,IEX,49.420000,100
2019-10-25 14:01:42.496814080,2019-10-25 14:01:42.496796139,1829023,T,IEX,49.400000,100
2019-10-25 14:01:52.884495872,2019-10-25 14:01:52.884475708,1837832,T,IEX,49.370000,100
2019-10-25 14:02:27.411128064,2019-10-25 14:02:27.411106802,1864092,T,IEX,49.560000,100
2019-10-25 14:02:29.65046016,2019-10-25 14:02:29.65027541,1865467,T,IEX,49.560000,1
2019-10-25 14:02:47.970772992,2019-10-25 14:02:47.970751538,1879049,T,IEX,49.585000,500
2019-10-25 14:02:49.917597952,2019-10-25 14:02:49.917579069,1880215,T,IEX,49.560000,100
2019-10-25 14:02:50.131463936,2019-10-25 14:02:50.131443093,1880337,T,IEX,49.560000,100
2019-10-25 14:02:50.321047040,2019-10-25 14:02:50.321027926,1880404,T,IEX,49.560000,100
2019-10-25 14:02:52.610158080,2019-10-25 14:02:52.610139066,1882543,T,IEX,49.535000,100
2019-10-25 14:02:55.410492928,2019-10-25 14:02:55.410470744,1884252,T,IEX,49.545000,100
2019-10-25 14:02:55.413938944,2019-10-25 14:02:55.413919587,1884253,T,IEX,49.545000,200
2019-10-25 14:03:11.267299072,2019-10-25 14:03:11.267280846,1899708,T,IEX,49.535000,500
2019-10-25 14:03:22.18053120,2019-10-25 14:03:22.18031973,1909153,T,IEX,49.530000,1600
2019-10-25 14:03:26.733542912,2019-10-25 14:03:26.733524254,1912297,T,IEX,49.535000,26394
2019-10-25 14:03:26.734620928,2019-10-25 14:03:26.734601822,1912298,T,IEX,49.535000,700
2019-10-25 14:04:14.809733120,2019-10-25 14:04:14.809712473,1949497,T,IEX,49.530000,100
2019-10-25 14:04:25.365498112,2019-10-25 14:04:25.365480847,1959868,T,IEX,49.480000,100
2019-10-25 14:04:55.528069120,2019-10-25 14:04:55.528050343,1986537,T,IEX,49.485000,1
2019-10-25 14:05:14.114639872,2019-10-25 14:05:14.114623234,2004687,T,IEX,49.575000,200
2019-10-25 14:05:20.229262080,2019-10-25 14:05:20.229242672,2011088,T,IEX,49.575000,100
2019-10-25 14:05:48.868060928,2019-10-25 14:05:48.868042257,2030113,T,IEX,49.600000,98
2019-10-25 14:06:08.882425088,2019-10-25 14:06:08.882403389,2046697,T,IEX,49.650000,100
2019-10-25 14:07:02.447585024,2019-10-25 14:07:02.447563360,2091347,T,IEX,49.495000,25
2019-10-25 14:07:35.340645120,2019-10-25 14:07:35.340627449,2118216,T,IEX,49.580000,100
2019-10-25 14:07:45.938849024,2019-10-25 14:07:45.938829219,2125717,T,IEX,49.620000,100
2019-10-25 14:08:50.557555968,2019-10-25 14:08:50.557537001,2177944,T,IEX,49.710000,75
2019-10-25 14:08:50.557632000,2019-10-25 14:08:50.557614431,2177946,T,IEX,49.710000,25
2019-10-25 14:10:08.886836992,2019-10-25 14:10:08.886818536,2253893,T,IEX,49.670000,100
2019-10-25 14:10:25.189976064,2019-10-25 14:10:25.189956023,2269614,T,IEX,49.680000,100
2019-10-25 14:10:41.989922048,2019-10-25 14:10:41.989902074,2284490,T,IEX,49.700000,48
2019-10-25 14:10:44.39331072,2019-10-25 14:10:44.39309886,2285727,T,IEX,49.740000,100
2019-10-25 14:10:44.44773888,2019-10-25 14:10:44.44751714,2285728,T,IEX,49.740000,100
2019-10-25 14:10:44.49523968,2019-10-25 14:10:44.49506154,2285757,T,IEX,49.740000,100
2019-10-25 14:10:44.49531904,2019-10-25 14:10:44.49515714,2285758,T,IEX,49.740000,100
2019-10-25 14:10:44.51933952,2019-10-25 14:10:44.51914498,2285761,T,IEX,49.740000,52
2019-10-25 14:10:50.286713088,2019-10-25 14:10:50.286694852,2291564,T,IEX,49.730000,100
2019-10-25 14:11:01.786178048,2019-10-25 14:11:01.786157757,2299214,T,IEX,49.760000,100
2019-10-25 14:11:02.366895104,2019-10-25 14:11:02.366875626,2299532,T,IEX,49.775000,300
2019-10-25 14:11:22.500785920,2019-10-25 14:11:22.500765498,2314418,T,IEX,49.770000,100
2019-10-25 14:11:22.500854016,2019-10-25 14:11:22.500837543,2314419,T,IEX,49.760000,100
2019-10-25 14:11:22.501120000,2019-10-25 14:11:22.501103521,2314422,T,IEX,49.760000,100
2019-10-25 14:13:30.978478080,2019-10-25 14:13:30.978450928,2418858,T,IEX,49.870000,100
2019-10-25 14:14:08.563848960,2019-10-25 14:14:08.563828984,2446692,T,IEX,49.920000,100
2019-10-25 14:14:09.160516096,2019-10-25 14:14:09.160499429,2447074,T,IEX,49.920000,100
2019-10-25 14:14:20.461015040,2019-10-25 14:14:20.460994993,2459913,T,IEX,49.910000,100
2019-10-25 14:14:20.631942912,2019-10-25 14:14:20.631923965,2459995,T,IEX,49.900000,5
2019-10-25 14:14:31.317367040,2019-10-25 14:14:31.317346657,2468010,T,IEX,49.910000,100
2019-10-25 14:14:40.466416896,2019-10-25 14:14:40.466401096,2474693,T,IEX,49.925000,100
2019-10-25 14:14:40.468548096,2019-10-25 14:14:40.468527245,2474694,T,IEX,49.925000,100
2019-10-25 14:14:40.470388992,2019-10-25 14:14:40.470369368,2474696,T,IEX,49.925000,100
2019-10-25 14:14:40.472314880,2019-10-25 14:14:40.472293132,2474697,T,IEX,49.925000,100
2019-10-25 14:14:48.899037952,2019-10-25 14:14:48.899019840,2481148,T,IEX,49.940000,100
2019-10-25 14:14:54.72419072,2019-10-25 14:14:54.72402647,2483872,T,IEX,49.970000,100
2019-10-25 14:14:54.72432896,2019-10-25 14:14:54.72415803,2483873,T,IEX,49.970000,100
2019-10-25 14:14:55.670503936,2019-10-25 14:14:55.670482804,2485215,T,IEX,50.000000,127
2019-10-25 14:15:00.191204096,2019-10-25 14:15:00.191185957,2487642,T,IEX,50.000000,27
2019-10-25 14:15:00.191666944,2019-10-25 14:15:00.191648931,2487644,T,IEX,50.000000,100
2019-10-25 14:15:00.191734016,2019-10-25 14:15:00.191712378,2487646,T,IEX,50.000000,100
2019-10-25 14:15:00.191896064,2019-10-25 14:15:00.191876885,2487648,T,IEX,50.000000,100
2019-10-25 14:15:00.191955968,2019-10-25 14:15:00.191936348,2487650,T,IEX,50.000000,100
2019-10-25 14:15:00.191996928,2019-10-25 14:15:00.191979291,2487652,T,IEX,50.000000,100
2019-10-25 14:15:00.192728064,2019-10-25 14:15:00.192709628,2487655,T,IEX,50.000000,146
2019-10-25 14:15:00.193489920,2019-10-25 14:15:00.193471478,2487658,T,IEX,50.010000,100
2019-10-25 14:15:00.193572096,2019-10-25 14:15:00.193554145,2487659,T,IEX,50.010000,100
2019-10-25 14:15:46.484302080,2019-10-25 14:15:46.484280152,2520662,T,IEX,50.050000,100
2019-10-25 14:15:51.11858944,2019-10-25 14:15:51.11841395,2523187,T,IEX,50.050000,75
2019-10-25 14:15:51.11982080,2019-10-25 14:15:51.11965825,2523189,T,IEX,50.050000,25
2019-10-25 14:15:58.735183872,2019-10-25 14:15:58.735166136,2528833,T,IEX,50.070000,100
2019-10-25 14:16:00.939478016,2019-10-25 14:16:00.939456008,2530502,T,IEX,50.040000,69
2019-10-25 14:16:02.560828928,2019-10-25 14:16:02.560811060,2531798,T,IEX,50.060000,100
2019-10-25 14:17:06.416717056,2019-10-25 14:17:06.416695342,2571281,T,IEX,50.090000,100
2019-10-25 14:17:22.38066944,2019-10-25 14:17:22.38048878,2583116,T,IEX,50.150000,5
2019-10-25 14:17:49.806423040,2019-10-25 14:17:49.806407445,2602471,T,IEX,50.120000,100
2019-10-25 14:17:49.806974976,2019-10-25 14:17:49.806956242,2602473,T,IEX,50.120000,100
2019-10-25 14:17:58.231014912,2019-10-25 14:17:58.230997581,2607196,T,IEX,50.110000,29
2019-10-25 14:17:58.231123968,2019-10-25 14:17:58.231106627,2607198,T,IEX,50.110000,71
2019-10-25 14:17:58.231247872,2019-10-25 14:17:58.231231069,2607199,T,IEX,50.110000,100
2019-10-25 14:17:58.231417088,2019-10-25 14:17:58.231399129,2607200,T,IEX,50.110000,100
2019-10-25 14:17:58.231454976,2019-10-25 14:17:58.231437477,2607201,T,IEX,50.110000,100
2019-10-25 14:17:58.231785984,2019-10-25 14:17:58.231766483,2607203,T,IEX,50.100000,100
2019-10-25 14:17:58.231854080,2019-10-25 14:17:58.231834267,2607204,T,IEX,50.100000,100
2019-10-25 14:17:58.232286976,2019-10-25 14:17:58.232267560,2607211,T,IEX,50.100000,100
2019-10-25 14:17:58.238671872,2019-10-25 14:17:58.238650408,2607226,T,IEX,50.090000,75
2019-10-25 14:17:58.238923008,2019-10-25 14:17:58.238906079,2607228,T,IEX,50.095000,100
2019-10-25 14:18:03.676456960,2019-10-25 14:18:03.676437181,2610780,T,IEX,50.090000,500
2019-10-25 14:18:06.58332928,2019-10-25 14:18:06.58316095,2612494,T,IEX,50.130000,100
2019-10-25 14:18:06.60434944,2019-10-25 14:18:06.60414441,2612500,T,IEX,50.135000,100
2019-10-25 14:18:06.61404928,2019-10-25 14:18:06.61389501,2612502,T,IEX,50.135000,1
2019-10-25 14:18:17.820379904,2019-10-25 14:18:17.820358221,2620530,T,IEX,50.125000,500
2019-10-25 14:18:19.866624000,2019-10-25 14:18:19.866603206,2622140,T,IEX,50.125000,100
2019-10-25 14:18:19.878042880,2019-10-25 14:18:19.878026550,2622155,T,IEX,50.120000,200
2019-10-25 14:18:19.886062080,2019-10-25 14:18:19.886045123,2622158,T,IEX,50.100000,100
2019-10-25 14:18:32.244748032,2019-10-25 14:18:32.244729470,2629739,T,IEX,50.085000,500
2019-10-25 14:18:33.941688064,2019-10-25 14:18:33.941670306,2630786,T,IEX,50.050000,100
2019-10-25 14:18:34.180750080,2019-10-25 14:18:34.180729978,2631172,T,IEX,50.060000,300
2019-10-25 14:18:46.668741888,2019-10-25 14:18:46.668724236,2641041,T,IEX,50.045000,500
2019-10-25 14:18:53.924461056,2019-10-25 14:18:53.924442829,2645761,T,IEX,50.015000,1400
2019-10-25 14:18:58.639731968,2019-10-25 14:18:58.639712444,2648541,T,IEX,50.000000,100
2019-10-25 14:19:01.745476096,2019-10-25 14:19:01.745453836,2650514,T,IEX,50.015000,2500
2019-10-25 14:19:01.751567104,2019-10-25 14:19:01.751546649,2650515,T,IEX,50.015000,1200
2019-10-25 14:19:40.864844032,2019-10-25 14:19:40.864825205,2676446,T,IEX,49.975000,1
2019-10-25 14:20:14.599812096,2019-10-25 14:20:14.599794098,2701211,T,IEX,49.840000,100
2019-10-25 14:20:26.452237056,2019-10-25 14:20:26.452216696,2709226,T,IEX,49.860000,100
2019-10-25 14:20:26.452252928,2019-10-25 14:20:26.452236237,2709227,T,IEX,49.860000,100
2019-10-25 14:20:26.453052928,2019-10-25 14:20:26.453032725,2709229,T,IEX,49.860000,37
2019-10-25 14:20:26.453208064,2019-10-25 14:20:26.453190799,2709232,T,IEX,49.860000,63
2019-10-25 14:20:26.454713088,2019-10-25 14:20:26.454696942,2709235,T,IEX,49.880000,100
2019-10-25 14:21:07.16794880,2019-10-25 14:21:07.16776635,2737845,T,IEX,50.015000,108
2019-10-25 14:21:41.958927104,2019-10-25 14:21:41.958908406,2767229,T,IEX,50.050000,92
2019-10-25 14:22:35.970606080,2019-10-25 14:22:35.970586063,2802942,T,IEX,50.060000,100
2019-10-25 14:22:46.328123904,2019-10-25 14:22:46.328102900,2809861,T,IEX,50.100000,100
2019-10-25 14:23:07.748496896,2019-10-25 14:23:07.748480182,2825618,T,IEX,50.130000,500
2019-10-25 14:23:14.356609024,2019-10-25 14:23:14.356588182,2829120,T,IEX,50.110000,100
2019-10-25 14:23:14.551226112,2019-10-25 14:23:14.551206226,2829183,T,IEX,50.105000,100
2019-10-25 14:23:14.552900096,2019-10-25 14:23:14.552879621,2829187,T,IEX,50.105000,100
2019-10-25 14:23:33.351254016,2019-10-25 14:23:33.351232752,2841329,T,IEX,50.120000,100
2019-10-25 14:23:37.430662912,2019-10-25 14:23:37.430642117,2843688,T,IEX,50.130000,100
2019-10-25 14:23:37.858190080,2019-10-25 14:23:37.858168742,2843935,T,IEX,50.130000,100
2019-10-25 14:23:52.954434048,2019-10-25 14:23:52.954414197,2852970,T,IEX,50.130000,100
2019-10-25 14:25:05.571649024,2019-10-25 14:25:05.571632083,2908169,T,IEX,50.100000,800
2019-10-25 14:25:14.426675968,2019-10-25 14:25:14.426654221,2914635,T,IEX,50.100000,500
2019-10-25 14:25:48.232071936,2019-10-25 14:25:48.232050767,2938270,T,IEX,50.100000,100
2019-10-25 14:25:57.232349952,2019-10-25 14:25:57.232329543,2944540,T,IEX,50.090000,100
2019-10-25 14:26:02.124200960,2019-10-25 14:26:02.124185274,2948522,T,IEX,50.085000,500
2019-10-25 14:26:22.514215936,2019-10-25 14:26:22.514196802,2962961,T,IEX,49.995000,1100
2019-10-25 14:26:49.473844992,2019-10-25 14:26:49.473827212,2982106,T,IEX,49.990000,100
2019-10-25 14:27:02.517220096,2019-10-25 14:27:02.517201503,2993724,T,IEX,49.940000,100
2019-10-25 14:27:38.573370880,2019-10-25 14:27:38.573351419,3022155,T,IEX,49.980000,100
2019-10-25 14:27:39.337308928,2019-10-25 14:27:39.337294154,3022598,T,IEX,50.010000,100
2019-10-25 14:27:39.567433984,2019-10-25 14:27:39.567412464,3022803,T,IEX,50.000000,1900
2019-10-25 14:27:48.7272960,2019-10-25 14:27:48.7251118,3028572,T,IEX,50.110000,100
2019-10-25 14:27:48.7288064,2019-10-25 14:27:48.7270811,3028573,T,IEX,50.110000,59
2019-10-25 14:27:51.200416000,2019-10-25 14:27:51.200400111,3031259,T,IEX,50.110000,500
2019-10-25 14:27:53.897566976,2019-10-25 14:27:53.897551061,3032986,T,IEX,50.060000,100
2019-10-25 14:28:10.570487040,2019-10-25 14:28:10.570471124,3043623,T,IEX,50.030000,100
2019-10-25 14:28:25.252075008,2019-10-25 14:28:25.252057363,3053735,T,IEX,50.030000,100
2019-10-25 14:28:44.598700032,2019-10-25 14:28:44.598684082,3067434,T,IEX,49.965000,500
2019-10-25 14:29:12.404868096,2019-10-25 14:29:12.404846232,3083723,T,IEX,49.940000,100
2019-10-25 14:29:12.408957952,2019-10-25 14:29:12.408938742,3083725,T,IEX,49.930000,100
2019-10-25 14:29:40.979132928,2019-10-25 14:29:40.979117429,3099107,T,IEX,49.830000,100
2019-10-25 14:30:01.113433088,2019-10-25 14:30:01.113415115,3113100,T,IEX,49.855000,600
2019-10-25 14:30:01.114427904,2019-10-25 14:30:01.114410791,3113105,T,IEX,49.880000,100
2019-10-25 14:30:14.537996032,2019-10-25 14:30:14.537974461,3126672,T,IEX,49.915000,100
2019-10-25 14:30:16.530055936,2019-10-25 14:30:16.530034483,3128364,T,IEX,49.900000,100
2019-10-25 14:30:16.530255104,2019-10-25 14:30:16.530238849,3128366,T,IEX,49.890000,100
2019-10-25 14:30:16.539852032,2019-10-25 14:30:16.539830062,3128374,T,IEX,49.890000,100
2019-10-25 14:30:18.108635904,2019-10-25 14:30:18.108615236,3129584,T,IEX,49.860000,100
2019-10-25 14:30:36.55697920,2019-10-25 14:30:36.55680623,3141625,T,IEX,49.855000,100
2019-10-25 14:31:14.993601024,2019-10-25 14:31:14.993580298,3172811,T,IEX,49.900000,100
2019-10-25 14:31:26.456065024,2019-10-25 14:31:26.456047489,3182191,T,IEX,49.900000,100
2019-10-25 14:31:43.436878080,2019-10-25 14:31:43.436857246,3193092,T,IEX,49.820000,85
2019-10-25 14:31:43.436982016,2019-10-25 14:31:43.436965130,3193094,T,IEX,49.820000,11
2019-10-25 14:31:43.437038080,2019-10-25 14:31:43.437021123,3193095,T,IEX,49.820000,4
2019-10-25 14:32:22.108079104,2019-10-25 14:32:22.108055855,3221914,T,IEX,49.725000,700
2019-10-25 14:32:40.839399936,2019-10-25 14:32:40.839383152,3236643,T,IEX,49.710000,7
2019-10-25 14:32:41.261754112,2019-10-25 14:32:41.261734343,3236902,T,IEX,49.720000,100
2019-10-25 14:33:46.235173120,2019-10-25 14:33:46.235152069,3283044,T,IEX,49.840000,100
2019-10-25 14:33:46.238605056,2019-10-25 14:33:46.238585348,3283045,T,IEX,49.840000,200
2019-10-25 14:33:54.396168960,2019-10-25 14:33:54.396148527,3288286,T,IEX,49.770000,100
2019-10-25 14:34:47.540237056,2019-10-25 14:34:47.540219841,3326833,T,IEX,49.840000,24
2019-10-25 14:34:47.540312064,2019-10-25 14:34:47.540294587,3326838,T,IEX,49.840000,61
2019-10-25 14:34:47.540549120,2019-10-25 14:34:47.540529916,3326847,T,IEX,49.840000,15
2019-10-25 14:35:57.888445952,2019-10-25 14:35:57.888424303,3384001,T,IEX,49.850000,68
2019-10-25 14:36:36.132291072,2019-10-25 14:36:36.132273355,3409854,T,IEX,49.900000,1
2019-10-25 14:36:36.214028032,2019-10-25 14:36:36.214006755,3409898,T,IEX,49.900000,99
2019-10-25 14:36:57.573942016,2019-10-25 14:36:57.573920810,3420771,T,IEX,49.900000,100
2019-10-25 14:40:35.735092992,2019-10-25 14:40:35.735072186,3572095,T,IEX,49.840000,100
2019-10-25 14:41:31.913284096,2019-10-25 14:41:31.913263004,3611166,T,IEX,49.810000,100
2019-10-25 14:42:18.174912000,2019-10-25 14:42:18.174892621,3647636,T,IEX,49.720000,100
2019-10-25 14:42:34.214481920,2019-10-25 14:42:34.214459927,3656366,T,IEX,49.720000,100
2019-10-25 14:42:35.445472000,2019-10-25 14:42:35.445439273,3657162,T,IEX,49.750000,288
2019-10-25 14:42:40.215150080,2019-10-25 14:42:40.215129649,3660007,T,IEX,49.770000,100
2019-10-25 14:42:40.215164928,2019-10-25 14:42:40.215148464,3660008,T,IEX,49.770000,100
2019-10-25 14:42:41.406953984,2019-10-25 14:42:41.406933128,3660615,T,IEX,49.780000,100
2019-10-25 14:42:41.408830976,2019-10-25 14:42:41.408809239,3660616,T,IEX,49.780000,100
2019-10-25 14:42:41.410678016,2019-10-25 14:42:41.410658991,3660618,T,IEX,49.780000,100
2019-10-25 14:44:38.968900096,2019-10-25 14:44:38.968878790,3723355,T,IEX,49.860000,15
2019-10-25 14:44:44.77415936,2019-10-25 14:44:44.77397884,3726488,T,IEX,49.855000,800
2019-10-25 14:44:59.421188096,2019-10-25 14:44:59.421165310,3734163,T,IEX,49.790000,100
2019-10-25 14:44:59.430050048,2019-10-25 14:44:59.430031857,3734167,T,IEX,49.790000,800
2019-10-25 14:45:00.591308032,2019-10-25 14:45:00.591288889,3734650,T,IEX,49.790000,500
2019-10-25 14:45:23.482008064,2019-10-25 14:45:23.481989413,3750358,T,IEX,49.880000,100
2019-10-25 14:45:23.483002880,2019-10-25 14:45:23.482983316,3750359,T,IEX,49.850000,100
2019-10-25 14:45:23.483016960,2019-10-25 14:45:23.482999581,3750360,T,IEX,49.850000,100
2019-10-25 14:45:32.516268032,2019-10-25 14:45:32.516248034,3754506,T,IEX,49.800000,600
2019-10-25 14:45:32.517466880,2019-10-25 14:45:32.517446973,3754507,T,IEX,49.800000,2600
2019-10-25 14:46:37.1897984,2019-10-25 14:46:37.1879373,3800138,T,IEX,49.815000,500
2019-10-25 14:46:47.372073984,2019-10-25 14:46:47.372055116,3806448,T,IEX,49.800000,1
2019-10-25 14:46:52.254958080,2019-10-25 14:46:52.254935927,3808769,T,IEX,49.780000,100
2019-10-25 14:47:06.488867072,2019-10-25 14:47:06.488847196,3816297,T,IEX,49.760000,100
2019-10-25 14:47:14.340795904,2019-10-25 14:47:14.340775268,3822580,T,IEX,49.740000,100
2019-10-25 14:47:41.309455104,2019-10-25 14:47:41.309432753,3839912,T,IEX,49.760000,100
2019-10-25 14:48:51.548249088,2019-10-25 14:48:51.548231108,3886941,T,IEX,49.830000,24
2019-10-25 14:48:51.548306944,2019-10-25 14:48:51.548287802,3886944,T,IEX,49.830000,76
2019-10-25 14:49:17.287898112,2019-10-25 14:49:17.287876428,3928327,T,IEX,49.880000,500
2019-10-25 14:49:32.669361920,2019-10-25 14:49:32.669344777,3944895,T,IEX,49.900000,500
2019-10-25 14:49:39.937071104,2019-10-25 14:49:39.937053467,3954381,T,IEX,49.850000,100
2019-10-25 14:49:43.174238976,2019-10-25 14:49:43.174221678,3957899,T,IEX,49.805000,2500
2019-10-25 14:49:47.736368896,2019-10-25 14:49:47.736349205,3962696,T,IEX,49.835000,500
2019-10-25 14:50:03.961399040,2019-10-25 14:50:03.961380823,3979916,T,IEX,49.800000,1000
2019-10-25 14:50:03.962614016,2019-10-25 14:50:03.962593133,3979917,T,IEX,49.800000,4025
2019-10-25 14:50:33.63090944,2019-10-25 14:50:33.63071066,4006641,T,IEX,49.920000,500
2019-10-25 14:50:41.456282880,2019-10-25 14:50:41.456267526,4014463,T,IEX,49.845000,2075
2019-10-25 14:50:43.459228928,2019-10-25 14:50:43.459211873,4016876,T,IEX,49.850000,1925
2019-10-25 14:50:46.96478976,2019-10-25 14:50:46.96455548,4019087,T,IEX,49.845000,500
2019-10-25 14:51:28.377443072,2019-10-25 14:51:28.377423082,4046740,T,IEX,49.885000,500
2019-10-25 14:51:28.378434048,2019-10-25 14:51:28.378414132,4046742,T,IEX,49.870000,8
2019-10-25 14:51:28.379426048,2019-10-25 14:51:28.379405574,4046743,T,IEX,49.870000,92
2019-10-25 14:51:29.274739968,2019-10-25 14:51:29.274720503,4047241,T,IEX,49.850000,900
2019-10-25 14:51:29.284873984,2019-10-25 14:51:29.284855716,4047246,T,IEX,49.850000,800
2019-10-25 14:51:29.286106112,2019-10-25 14:51:29.286085091,4047248,T,IEX,49.850000,1400
2019-10-25 14:51:29.298423040,2019-10-25 14:51:29.298404268,4047254,T,IEX,49.850000,1500
2019-10-25 14:51:38.163571968,2019-10-25 14:51:38.163553004,4052720,T,IEX,49.850000,800
2019-10-25 14:51:52.281139968,2019-10-25 14:51:52.281120800,4059428,T,IEX,49.880000,500
2019-10-25 14:51:54.575751936,2019-10-25 14:51:54.575733415,4060464,T,IEX,49.875000,900
2019-10-25 14:51:59.747761920,2019-10-25 14:51:59.747744049,4063295,T,IEX,49.855000,600
2019-10-25 14:52:56.873313024,2019-10-25 14:52:56.873292533,4097440,T,IEX,49.920000,109
2019-10-25 14:53:51.707663872,2019-10-25 14:53:51.707646304,4129122,T,IEX,49.960000,100
2019-10-25 14:53:55.474692096,2019-10-25 14:53:55.474676547,4131289,T,IEX,49.985000,100
2019-10-25 14:53:55.475833088,2019-10-25 14:53:55.475814032,4131290,T,IEX,49.985000,1
2019-10-25 14:54:00.625345024,2019-10-25 14:54:00.625323474,4134316,T,IEX,49.990000,2
2019-10-25 14:54:01.803335936,2019-10-25 14:54:01.803315448,4134754,T,IEX,49.990000,98
2019-10-25 14:54:01.804430080,2019-10-25 14:54:01.804410261,4134755,T,IEX,49.990000,100
2019-10-25 14:54:01.805037056,2019-10-25 14:54:01.805019519,4134756,T,IEX,49.990000,100
2019-10-25 14:54:01.805388032,2019-10-25 14:54:01.805371999,4134757,T,IEX,49.990000,100
2019-10-25 14:54:01.806183936,2019-10-25 14:54:01.806165307,4134758,T,IEX,49.990000,100
2019-10-25 14:54:01.806464000,2019-10-25 14:54:01.806448907,4134759,T,IEX,49.990000,2
2019-10-25 14:54:06.802386944,2019-10-25 14:54:06.802368808,4139122,T,IEX,49.985000,98
2019-10-25 14:54:06.802398976,2019-10-25 14:54:06.802382019,4139123,T,IEX,49.985000,2
2019-10-25 14:55:45.41356032,2019-10-25 14:55:45.41335642,4209193,T,IEX,50.040000,100
2019-10-25 14:55:45.323732992,2019-10-25 14:55:45.323712128,4209302,T,IEX,50.040000,100
2019-10-25 14:55:45.323744000,2019-10-25 14:55:45.323727469,4209303,T,IEX,50.040000,100
2019-10-25 14:56:37.304668928,2019-10-25 14:56:37.304653685,4240760,T,IEX,50.080000,100
2019-10-25 14:57:43.529490944,2019-10-25 14:57:43.529470418,4279399,T,IEX,50.095000,500
2019-10-25 14:57:45.703196928,2019-10-25 14:57:45.703174988,4280420,T,IEX,50.075000,13
2019-10-25 14:57:45.703216896,2019-10-25 14:57:45.703201978,4280421,T,IEX,50.050000,100
2019-10-25 14:58:15.444179968,2019-10-25 14:58:15.444164184,4297256,T,IEX,50.080000,500
2019-10-25 14:58:39.860335104,2019-10-25 14:58:39.860313199,4309287,T,IEX,50.040000,100
2019-10-25 14:58:42.124556032,2019-10-25 14:58:42.124537226,4310580,T,IEX,50.035000,500
2019-10-25 14:59:15.565336064,2019-10-25 14:59:15.565314519,4331254,T,IEX,50.010000,5
2019-10-25 14:59:19.227229952,2019-10-25 14:59:19.227213452,4333709,T,IEX,49.975000,500
2019-10-25 14:59:22.360082944,2019-10-25 14:59:22.360063743,4335320,T,IEX,49.970000,14
2019-10-25 14:59:24.942778880,2019-10-25 14:59:24.942759585,4336627,T,IEX,49.925000,3558
2019-10-25 14:59:30.814387968,2019-10-25 14:59:30.814372163,4339836,T,IEX,49.940000,7
2019-10-25 14:59:31.140281088,2019-10-25 14:59:31.140260066,4339970,T,IEX,49.970000,100
2019-10-25 14:59:47.722169088,2019-10-25 14:59:47.721998370,4351609,T,IEX,49.985000,500
2019-10-25 15:00:10.756023040,2019-10-25 15:00:10.756004779,4371430,T,IEX,50.060000,100
2019-10-25 15:00:18.85854976,2019-10-25 15:00:18.85837721,4377075,T,IEX,50.065000,500
2019-10-25 15:00:20.30684928,2019-10-25 15:00:20.30665417,4378255,T,IEX,50.020000,100
2019-10-25 15:00:27.842755072,2019-10-25 15:00:27.842733076,4383175,T,IEX,49.950000,5775
2019-10-25 15:00:29.845808896,2019-10-25 15:00:29.845787779,4384161,T,IEX,49.940000,500
2019-10-25 15:00:32.432879104,2019-10-25 15:00:32.432861502,4385705,T,IEX,50.070000,500
2019-10-25 15:00:48.786035968,2019-10-25 15:00:48.786016258,4395220,T,IEX,50.005000,500
2019-10-25 15:01:12.830990080,2019-10-25 15:01:12.830970560,4410668,T,IEX,49.940000,700
2019-10-25 15:01:12.832264960,2019-10-25 15:01:12.832245607,4410669,T,IEX,49.940000,3091
2019-10-25 15:01:43.344317952,2019-10-25 15:01:43.344296901,4434438,T,IEX,49.980000,500
2019-10-25 15:01:51.920887040,2019-10-25 15:01:51.920867213,4440354,T,IEX,49.920000,37
2019-10-25 15:01:52.504346880,2019-10-25 15:01:52.504326824,4440909,T,IEX,49.915000,634
2019-10-25 15:01:54.507756032,2019-10-25 15:01:54.507734798,4442116,T,IEX,49.920000,500
2019-10-25 15:01:54.922605056,2019-10-25 15:01:54.922585878,4442284,T,IEX,49.920000,500
2019-10-25 15:02:01.950469888,2019-10-25 15:02:01.950450682,4447440,T,IEX,49.955000,100
2019-10-25 15:02:11.573676032,2019-10-25 15:02:11.573658753,4454983,T,IEX,49.980000,100
2019-10-25 15:02:19.236915968,2019-10-25 15:02:19.236896407,4459845,T,IEX,49.965000,100
2019-10-25 15:02:22.297794048,2019-10-25 15:02:22.297773372,4461527,T,IEX,49.940000,500
2019-10-25 15:02:25.926543872,2019-10-25 15:02:25.926523638,4463281,T,IEX,49.895000,1322
2019-10-25 15:04:43.688526080,2019-10-25 15:04:43.688504968,4554604,T,IEX,50.020000,5
2019-10-25 15:04:45.230927872,2019-10-25 15:04:45.230908831,4555519,T,IEX,50.010000,100
2019-10-25 15:04:45.327193088,2019-10-25 15:04:45.327173644,4555567,T,IEX,49.995000,160
2019-10-25 15:04:45.977082112,2019-10-25 15:04:45.977063930,4556013,T,IEX,50.000000,1
2019-10-25 15:05:01.44506112,2019-10-25 15:05:01.44489495,4564219,T,IEX,50.000000,100
2019-10-25 15:05:40.714066944,2019-10-25 15:05:40.714046306,4592038,T,IEX,50.000000,100
2019-10-25 15:05:40.714134016,2019-10-25 15:05:40.714116710,4592039,T,IEX,50.000000,140
2019-10-25 15:06:52.14588928,2019-10-25 15:06:52.14569842,4632686,T,IEX,50.095000,1
2019-10-25 15:06:52.14606080,2019-10-25 15:06:52.14588786,4632687,T,IEX,50.090000,74
2019-10-25 15:06:52.14693888,2019-10-25 15:06:52.14676401,4632689,T,IEX,50.090000,37
2019-10-25 15:06:52.14817024,2019-10-25 15:06:52.14799607,4632691,T,IEX,50.090000,50
2019-10-25 15:06:52.14886912,2019-10-25 15:06:52.14868748,4632692,T,IEX,50.090000,12
2019-10-25 15:06:52.14930944,2019-10-25 15:06:52.14913131,4632693,T,IEX,50.090000,27
2019-10-25 15:09:52.637786112,2019-10-25 15:09:52.637766197,4765085,T,IEX,50.145000,400
2019-10-25 15:09:52.945571072,2019-10-25 15:09:52.945550755,4765345,T,IEX,50.145000,300
2019-10-25 15:09:52.954038016,2019-10-25 15:09:52.954021355,4765351,T,IEX,50.145000,100
2019-10-25 15:09:53.235939072,2019-10-25 15:09:53.235919816,4765574,T,IEX,50.145000,100
2019-10-25 15:10:04.461520896,2019-10-25 15:10:04.461505192,4773007,T,IEX,50.150000,88
2019-10-25 15:10:04.462914048,2019-10-25 15:10:04.462893154,4773009,T,IEX,50.150000,26
2019-10-25 15:10:04.463063040,2019-10-25 15:10:04.463046004,4773011,T,IEX,50.150000,12
2019-10-25 15:10:04.463077120,2019-10-25 15:10:04.463059938,4773012,T,IEX,50.150000,74
2019-10-25 15:10:04.613805056,2019-10-25 15:10:04.613784553,4773120,T,IEX,50.150000,100
2019-10-25 15:12:10.605868032,2019-10-25 15:12:10.605848980,4853582,T,IEX,50.250000,150
2019-10-25 15:12:14.298787072,2019-10-25 15:12:14.298769492,4855546,T,IEX,50.250000,100
2019-10-25 15:12:14.305675008,2019-10-25 15:12:14.305653598,4855554,T,IEX,50.250000,100
2019-10-25 15:12:14.305690112,2019-10-25 15:12:14.305673449,4855555,T,IEX,50.250000,100
2019-10-25 15:12:14.689797120,2019-10-25 15:12:14.689778676,4855792,T,IEX,50.250000,100
2019-10-25 15:12:14.697821952,2019-10-25 15:12:14.697805334,4855795,T,IEX,50.250000,100
2019-10-25 15:12:37.728094976,2019-10-25 15:12:37.728074656,4867349,T,IEX,50.280000,91
2019-10-25 15:12:37.728178944,2019-10-25 15:12:37.728161681,4867351,T,IEX,50.280000,9
2019-10-25 15:12:44.338647040,2019-10-25 15:12:44.338626727,4871688,T,IEX,50.260000,100
2019-10-25 15:12:53.499599872,2019-10-25 15:12:53.499576942,4876631,T,IEX,50.240000,100
2019-10-25 15:13:15.134998016,2019-10-25 15:13:15.134979548,4888274,T,IEX,50.230000,100
2019-10-25 15:14:11.351191040,2019-10-25 15:14:11.351171222,4925908,T,IEX,50.150000,200
2019-10-25 15:16:23.795620096,2019-10-25 15:16:23.795598469,5041875,T,IEX,50.255000,500
2019-10-25 15:16:30.685480960,2019-10-25 15:16:30.685461428,5046207,T,IEX,50.260000,100
2019-10-25 15:16:30.880845056,2019-10-25 15:16:30.880825084,5046440,T,IEX,50.250000,1
2019-10-25 15:16:30.969017088,2019-10-25 15:16:30.968997003,5046496,T,IEX,50.240000,36
2019-10-25 15:16:30.969108992,2019-10-25 15:16:30.969091450,5046498,T,IEX,50.240000,36
2019-10-25 15:16:30.969225984,2019-10-25 15:16:30.969210029,5046499,T,IEX,50.240000,28
2019-10-25 15:16:33.399088896,2019-10-25 15:16:33.399071601,5047879,T,IEX,50.240000,500
2019-10-25 15:16:36.698155008,2019-10-25 15:16:36.698137535,5050230,T,IEX,50.230000,100
2019-10-25 15:16:40.109348096,2019-10-25 15:16:40.109330608,5051909,T,IEX,50.205000,500
2019-10-25 15:16:43.515866880,2019-10-25 15:16:43.515846318,5054645,T,IEX,50.175000,500
2019-10-25 15:16:47.189819904,2019-10-25 15:16:47.189801737,5060192,T,IEX,50.120000,14
2019-10-25 15:16:48.37411072,2019-10-25 15:16:48.37395838,5061022,T,IEX,50.160000,6400
2019-10-25 15:16:50.705601024,2019-10-25 15:16:50.705580560,5063675,T,IEX,50.210000,500
2019-10-25 15:16:55.93893888,2019-10-25 15:16:55.93877099,5066671,T,IEX,50.195000,7900
2019-10-25 15:16:57.96844032,2019-10-25 15:16:57.96823189,5068287,T,IEX,50.210000,1900
2019-10-25 15:17:01.430461952,2019-10-25 15:17:01.430439739,5072255,T,IEX,50.215000,500
2019-10-25 15:17:05.406394880,2019-10-25 15:17:05.406377005,5075656,T,IEX,50.165000,1600
2019-10-25 15:17:53.995182080,2019-10-25 15:17:53.995164414,5106639,T,IEX,50.170000,500
2019-10-25 15:18:12.619650048,2019-10-25 15:18:12.619633132,5121845,T,IEX,50.200000,500
2019-10-25 15:18:19.858685952,2019-10-25 15:18:19.858665207,5126538,T,IEX,50.180000,100
2019-10-25 15:18:21.720491008,2019-10-25 15:18:21.720473736,5128041,T,IEX,50.150000,100
2019-10-25 15:18:24.389104128,2019-10-25 15:18:24.389084160,5130310,T,IEX,50.135000,500
2019-10-25 15:18:26.933149952,2019-10-25 15:18:26.933130232,5131708,T,IEX,50.115000,600
2019-10-25 15:18:47.697432064,2019-10-25 15:18:47.697414406,5144310,T,IEX,50.215000,100
2019-10-25 15:19:38.852293120,2019-10-25 15:19:38.852272618,5178466,T,IEX,50.310000,6
2019-10-25 15:20:39.370176000,2019-10-25 15:20:39.370156149,5230687,T,IEX,50.350000,200
2019-10-25 15:20:39.949854976,2019-10-25 15:20:39.949834910,5230876,T,IEX,50.340000,200
2019-10-25 15:20:56.407684096,2019-10-25 15:20:56.407667552,5241246,T,IEX,50.290000,500
2019-10-25 15:20:59.309285888,2019-10-25 15:20:59.309266467,5242768,T,IEX,50.270000,6
2019-10-25 15:21:46.55067904,2019-10-25 15:21:46.55043233,5275851,T,IEX,50.250000,29
2019-10-25 15:21:53.990404096,2019-10-25 15:21:53.990383988,5279787,T,IEX,50.240000,12
2019-10-25 15:22:03.130950912,2019-10-25 15:22:03.130934452,5285379,T,IEX,50.240000,88
2019-10-25 15:24:00.839674112,2019-10-25 15:24:00.839658180,5381511,T,IEX,50.440000,100
2019-10-25 15:24:06.13703936,2019-10-25 15:24:06.13685477,5384926,T,IEX,50.430000,100
2019-10-25 15:24:14.436768000,2019-10-25 15:24:14.436749651,5390116,T,IEX,50.400000,37
2019-10-25 15:24:14.436869888,2019-10-25 15:24:14.436853591,5390118,T,IEX,50.400000,74
2019-10-25 15:24:14.437000960,2019-10-25 15:24:14.436983899,5390120,T,IEX,50.400000,75
2019-10-25 15:24:15.388903936,2019-10-25 15:24:15.388883420,5390481,T,IEX,50.370000,14
2019-10-25 15:24:43.450488064,2019-10-25 15:24:43.450468551,5410137,T,IEX,50.340000,1
2019-10-25 15:24:51.212374016,2019-10-25 15:24:51.212351381,5414155,T,IEX,50.340000,100
2019-10-25 15:24:51.226802944,2019-10-25 15:24:51.226782052,5414166,T,IEX,50.330000,5
2019-10-25 15:25:15.310824960,2019-10-25 15:25:15.310804990,5430898,T,IEX,50.290000,100
2019-10-25 15:25:29.676218880,2019-10-25 15:25:29.676200588,5442711,T,IEX,50.260000,100
2019-10-25 15:25:39.9299968,2019-10-25 15:25:39.9278850,5449808,T,IEX,50.260000,100
2019-10-25 15:25:48.10865920,2019-10-25 15:25:48.10847173,5458252,T,IEX,50.315000,100
2019-10-25 15:25:48.121293056,2019-10-25 15:25:48.121275960,5458673,T,IEX,50.270000,100
2019-10-25 15:25:48.145640960,2019-10-25 15:25:48.145624023,5458762,T,IEX,50.270000,100
2019-10-25 15:29:13.983895040,2019-10-25 15:29:13.983871507,5625135,T,IEX,50.470000,1
2019-10-25 15:30:16.671179008,2019-10-25 15:30:16.671158949,5668079,T,IEX,50.430000,100
2019-10-25 15:31:26.852116992,2019-10-25 15:31:26.852096418,5723670,T,IEX,50.420000,66
2019-10-25 15:31:33.451292928,2019-10-25 15:31:33.451274095,5728293,T,IEX,50.400000,100
2019-10-25 15:32:52.800197888,2019-10-25 15:32:52.800176015,5786372,T,IEX,50.360000,12
2019-10-25 15:34:05.195312128,2019-10-25 15:34:05.195294397,5838840,T,IEX,50.320000,1
2019-10-25 15:34:30.459036928,2019-10-25 15:34:30.459017293,5854557,T,IEX,50.365000,100
2019-10-25 15:37:09.501029888,2019-10-25 15:37:09.501009156,5945425,T,IEX,50.330000,100
2019-10-25 15:37:12.154273024,2019-10-25 15:37:12.154253688,5947113,T,IEX,50.280000,100
2019-10-25 15:37:24.154533888,2019-10-25 15:37:24.154518471,5954256,T,IEX,50.280000,100
2019-10-25 15:38:29.142124032,2019-10-25 15:38:29.142105158,5987172,T,IEX,50.260000,100
2019-10-25 15:38:29.142200064,2019-10-25 15:38:29.142183271,5987174,T,IEX,50.260000,100
2019-10-25 15:38:29.142373888,2019-10-25 15:38:29.142359644,5987175,T,IEX,50.260000,100
2019-10-25 15:39:08.842686976,2019-10-25 15:39:08.842665978,6007450,T,IEX,50.180000,20
2019-10-25 15:40:30.634237952,2019-10-25 15:40:30.634220283,6052706,T,IEX,50.210000,100
2019-10-25 15:40:31.161369088,2019-10-25 15:40:31.161351085,6053048,T,IEX,50.200000,1200
2019-10-25 15:40:31.249861888,2019-10-25 15:40:31.249841740,6053082,T,IEX,50.200000,800
2019-10-25 15:40:31.262789888,2019-10-25 15:40:31.262770739,6053085,T,IEX,50.200000,4400
2019-10-25 15:40:38.307577088,2019-10-25 15:40:38.307555370,6056522,T,IEX,50.150000,700
2019-10-25 15:40:52.699004928,2019-10-25 15:40:52.698984934,6062290,T,IEX,50.130000,100
2019-10-25 15:40:52.700233984,2019-10-25 15:40:52.700218227,6062294,T,IEX,50.120000,100
2019-10-25 15:41:08.172338944,2019-10-25 15:41:08.172318079,6078720,T,IEX,50.070000,800
2019-10-25 15:41:27.819307008,2019-10-25 15:41:27.819284855,6090538,T,IEX,50.055000,1000
2019-10-25 15:41:27.820548096,2019-10-25 15:41:27.820527989,6090539,T,IEX,50.055000,4100
2019-10-25 15:42:04.340538880,2019-10-25 15:42:04.340519025,6111336,T,IEX,50.080000,100
2019-10-25 15:42:04.352428032,2019-10-25 15:42:04.352407536,6111338,T,IEX,50.060000,15
2019-10-25 15:42:13.687806976,2019-10-25 15:42:13.687789447,6116271,T,IEX,49.990000,15
2019-10-25 15:42:16.60968960,2019-10-25 15:42:16.60950517,6117608,T,IEX,50.000000,700
2019-10-25 15:42:16.62294016,2019-10-25 15:42:16.62274704,6117611,T,IEX,50.000000,3146
2019-10-25 15:42:57.575021056,2019-10-25 15:42:57.574999439,6138409,T,IEX,50.000000,4700
2019-10-25 15:42:57.576032000,2019-10-25 15:42:57.576010955,6138410,T,IEX,50.000000,600
2019-10-25 15:42:57.578334976,2019-10-25 15:42:57.578315087,6138411,T,IEX,50.000000,654
2019-10-25 15:43:00.967987968,2019-10-25 15:43:00.967966879,6139950,T,IEX,50.005000,100
2019-10-25 15:43:36.949528064,2019-10-25 15:43:36.949507172,6160454,T,IEX,49.970000,500
2019-10-25 15:44:25.298951936,2019-10-25 15:44:25.298933038,6192008,T,IEX,49.915000,700
2019-10-25 15:44:25.332542976,2019-10-25 15:44:25.332521523,6192029,T,IEX,49.920000,100
2019-10-25 15:44:25.957998080,2019-10-25 15:44:25.957975902,6192351,T,IEX,49.935000,1200
2019-10-25 15:44:37.342554112,2019-10-25 15:44:37.342536100,6200283,T,IEX,49.940000,500
2019-10-25 15:45:16.226245120,2019-10-25 15:45:16.226220410,6227049,T,IEX,49.995000,1000
2019-10-25 15:45:16.227493120,2019-10-25 15:45:16.227473374,6227050,T,IEX,49.995000,2300
2019-10-25 15:45:30.331887104,2019-10-25 15:45:30.331869477,6235866,T,IEX,49.940000,600
2019-10-25 15:45:43.584493056,2019-10-25 15:45:43.584473034,6241940,T,IEX,49.985000,22
2019-10-25 15:47:04.886006016,2019-10-25 15:47:04.885984304,6287456,T,IEX,50.070000,37
2019-10-25 15:47:04.886192128,2019-10-25 15:47:04.886175331,6287459,T,IEX,50.070000,63
2019-10-25 15:49:01.127517952,2019-10-25 15:49:01.127500005,6355509,T,IEX,50.365000,100
2019-10-25 15:49:08.973250048,2019-10-25 15:49:08.973231311,6361572,T,IEX,50.350000,100
2019-10-25 15:49:51.668876032,2019-10-25 15:49:51.668856771,6383655,T,IEX,50.320000,400
2019-10-25 15:49:51.683907072,2019-10-25 15:49:51.683886716,6383663,T,IEX,50.300000,54
2019-10-25 15:50:55.406332928,2019-10-25 15:50:55.406311774,6415689,T,IEX,50.310000,100
2019-10-25 15:53:47.161902080,2019-10-25 15:53:47.161883578,6508965,T,IEX,50.390000,18
2019-10-25 15:57:12.835866112,2019-10-25 15:57:12.835847115,6616586,T,IEX,50.425000,8
2019-10-25 15:57:57.272901120,2019-10-25 15:57:57.272882667,6638298,T,IEX,50.435000,30
2019-10-25 15:57:57.272919040,2019-10-25 15:57:57.272901717,6638299,T,IEX,50.430000,70
2019-10-25 15:58:21.537544960,2019-10-25 15:58:21.537525961,6652133,T,IEX,50.345000,51
2019-10-25 15:59:09.757689088,2019-10-25 15:59:09.757670922,6680113,T,IEX,50.340000,100
2019-10-25 15:59:09.765509120,2019-10-25 15:59:09.765487803,6680139,T,IEX,50.350000,49
2019-10-25 15:59:26.864707072,2019-10-25 15:59:26.864689948,6690874,T,IEX,50.280000,100
2019-10-25 16:02:06.812944896,2019-10-25 16:02:06.812923354,6803062,T,IEX,50.425000,100
2019-10-25 16:02:17.152695040,2019-10-25 16:02:17.152673878,6808783,T,IEX,50.425000,47
2019-10-25 16:02:17.152709888,2019-10-25 16:02:17.152693711,6808784,T,IEX,50.425000,53
2019-10-25 16:07:14.439686912,2019-10-25 16:07:14.439666529,6974858,T,IEX,50.330000,86
2019-10-25 16:08:46.424974080,2019-10-25 16:08:46.424955886,7043444,T,IEX,50.310000,100
2019-10-25 16:09:36.521511936,2019-10-25 16:09:36.521491176,7066613,T,IEX,50.280000,214
2019-10-25 16:09:38.463828992,2019-10-25 16:09:38.463808906,7067679,T,IEX,50.270000,100
2019-10-25 16:10:54.165888000,2019-10-25 16:10:54.165866343,7104543,T,IEX,50.230000,1
2019-10-25 16:11:11.30886912,2019-10-25 16:11:11.30866811,7111266,T,IEX,50.230000,99
2019-10-25 16:11:45.875119104,2019-10-25 16:11:45.875099159,7123774,T,IEX,50.220000,99
2019-10-25 16:15:36.796218880,2019-10-25 16:15:36.796199858,7217124,T,IEX,50.180000,100
2019-10-25 16:15:36.803746048,2019-10-25 16:15:36.803726919,7217127,T,IEX,50.180000,100
2019-10-25 16:15:36.804696064,2019-10-25 16:15:36.804679691,7217129,T,IEX,50.180000,100
2019-10-25 16:15:36.805641984,2019-10-25 16:15:36.805623820,7217130,T,IEX,50.180000,100
2019-10-25 16:18:43.259037952,2019-10-25 16:18:43.259016096,7302310,T,IEX,50.250000,100
2019-10-25 16:18:43.259108096,2019-10-25 16:18:43.259091774,7302312,T,IEX,50.250000,100
2019-10-25 16:19:44.529968128,2019-10-25 16:19:44.529950631,7324434,T,IEX,50.300000,100
2019-10-25 16:20:36.202092032,2019-10-25 16:20:36.202070995,7343350,T,IEX,50.290000,7
2019-10-25 16:20:36.464028928,2019-10-25 16:20:36.464011609,7343560,T,IEX,50.290000,24
2019-10-25 16:20:36.465108992,2019-10-25 16:20:36.465090414,7343563,T,IEX,50.290000,100
2019-10-25 16:20:36.465358080,2019-10-25 16:20:36.465341808,7343565,T,IEX,50.290000,37
2019-10-25 16:20:36.465426944,2019-10-25 16:20:36.465410549,7343566,T,IEX,50.290000,32
2019-10-25 16:20:43.625081088,2019-10-25 16:20:43.625060078,7346412,T,IEX,50.250000,8
2019-10-25 16:20:43.625334016,2019-10-25 16:20:43.625318946,7346414,T,IEX,50.250000,92
2019-10-25 16:22:53.266336000,2019-10-25 16:22:53.266321251,7401412,T,IEX,50.280000,100
2019-10-25 16:22:53.267206912,2019-10-25 16:22:53.267189191,7401414,T,IEX,50.270000,100
2019-10-25 16:22:53.276089088,2019-10-25 16:22:53.276067837,7401419,T,IEX,50.270000,100
2019-10-25 16:23:13.632956928,2019-10-25 16:23:13.632937433,7411154,T,IEX,50.260000,100
2019-10-25 16:24:50.895945984,2019-10-25 16:24:50.895925787,7455521,T,IEX,50.200000,100
2019-10-25 16:25:16.146204928,2019-10-25 16:25:16.146183854,7467146,T,IEX,50.160000,126
2019-10-25 16:25:48.336434944,2019-10-25 16:25:48.336413650,7481296,T,IEX,50.170000,100
2019-10-25 16:26:00.766681088,2019-10-25 16:26:00.766662403,7485680,T,IEX,50.180000,100
2019-10-25 16:28:46.979516928,2019-10-25 16:28:46.979496392,7549106,T,IEX,50.190000,100
2019-10-25 16:30:31.721383936,2019-10-25 16:30:31.721361800,7603028,T,IEX,50.240000,100
2019-10-25 16:33:30.224567040,2019-10-25 16:33:30.224543008,7672917,T,IEX,50.170000,100
2019-10-25 16:33:38.850119936,2019-10-25 16:33:38.850097497,7675794,T,IEX,50.160000,100
2019-10-25 16:35:20.78113024,2019-10-25 16:35:20.78093476,7716817,T,IEX,50.180000,100
2019-10-25 16:36:03.261005056,2019-10-25 16:36:03.260984209,7733019,T,IEX,50.200000,100
2019-10-25 16:37:24.567777024,2019-10-25 16:37:24.567755443,7766996,T,IEX,50.220000,100
2019-10-25 16:37:24.567945984,2019-10-25 16:37:24.567927441,7767004,T,IEX,50.220000,82
2019-10-25 16:37:24.567996928,2019-10-25 16:37:24.567979242,7767006,T,IEX,50.220000,18
2019-10-25 16:40:05.357537024,2019-10-25 16:40:05.357517397,7831897,T,IEX,50.130000,100
2019-10-25 16:46:57.394308096,2019-10-25 16:46:57.394290275,7999729,T,IEX,50.135000,33
2019-10-25 16:46:57.803796992,2019-10-25 16:46:57.803775205,8000185,T,IEX,50.135000,100
2019-10-25 16:49:45.853730048,2019-10-25 16:49:45.853701926,8063362,T,IEX,50.180000,10
2019-10-25 16:50:38.41947904,2019-10-25 16:50:38.41926913,8087713,T,IEX,50.170000,100
2019-10-25 16:54:15.589263872,2019-10-25 16:54:15.589243650,8167693,T,IEX,50.210000,1
2019-10-25 16:54:38.139321088,2019-10-25 16:54:38.139300694,8175696,T,IEX,50.230000,100
2019-10-25 16:59:24.178685952,2019-10-25 16:59:24.178669971,8295225,T,IEX,50.230000,14
2019-10-25 17:01:37.951883008,2019-10-25 17:01:37.951863905,8347186,T,IEX,50.240000,37
2019-10-25 17:01:37.951954944,2019-10-25 17:01:37.951938369,8347188,T,IEX,50.240000,37
2019-10-25 17:03:02.668365056,2019-10-25 17:03:02.668344333,8382538,T,IEX,50.220000,100
2019-10-25 17:05:24.559379968,2019-10-25 17:05:24.559360367,8431164,T,IEX,50.240000,100
2019-10-25 17:06:57.982852096,2019-10-25 17:06:57.982833456,8465415,T,IEX,50.200000,70
2019-10-25 17:06:58.161428992,2019-10-25 17:06:58.161408793,8465523,T,IEX,50.210000,6
2019-10-25 17:07:34.889778944,2019-10-25 17:07:34.889759375,8479792,T,IEX,50.170000,100
2019-10-25 17:07:34.890107904,2019-10-25 17:07:34.890089884,8479794,T,IEX,50.170000,100
2019-10-25 17:07:38.396685056,2019-10-25 17:07:38.396666088,8481635,T,IEX,50.160000,15
2019-10-25 17:07:51.678576128,2019-10-25 17:07:51.678556183,8487021,T,IEX,50.130000,74
2019-10-25 17:07:51.679904000,2019-10-25 17:07:51.679883904,8487022,T,IEX,50.130000,26
2019-10-25 17:08:45.262126080,2019-10-25 17:08:45.262106300,8510515,T,IEX,50.160000,1
2019-10-25 17:10:40.936822016,2019-10-25 17:10:40.936804231,8550368,T,IEX,50.130000,13
2019-10-25 17:10:40.936839936,2019-10-25 17:10:40.936824407,8550369,T,IEX,50.130000,100
2019-10-25 17:11:34.584707072,2019-10-25 17:11:34.584689126,8568386,T,IEX,50.150000,1
2019-10-25 17:13:48.504356096,2019-10-25 17:13:48.504334479,8619955,T,IEX,50.175000,100
2019-10-25 17:13:51.195193088,2019-10-25 17:13:51.195174802,8620956,T,IEX,50.170000,500
2019-10-25 17:14:56.902192128,2019-10-25 17:14:56.902172062,8645638,T,IEX,50.180000,100
2019-10-25 17:15:32.656365056,2019-10-25 17:15:32.656344036,8659385,T,IEX,50.160000,100
2019-10-25 17:15:32.657721088,2019-10-25 17:15:32.657699854,8659387,T,IEX,50.150000,100
2019-10-25 17:15:32.658543104,2019-10-25 17:15:32.658525953,8659389,T,IEX,50.150000,100
2019-10-25 17:19:20.786629888,2019-10-25 17:19:20.786609078,8750043,T,IEX,50.200000,100
2019-10-25 17:20:06.494774016,2019-10-25 17:20:06.494753442,8764384,T,IEX,50.200000,1
2019-10-25 17:25:15.655984128,2019-10-25 17:25:15.655962180,8868384,T,IEX,50.260000,100
2019-10-25 17:27:42.910049024,2019-10-25 17:27:42.910031592,8926109,T,IEX,50.330000,100
2019-10-25 17:29:59.879899904,2019-10-25 17:29:59.879879217,8975838,T,IEX,50.370000,100
2019-10-25 17:29:59.879916032,2019-10-25 17:29:59.879898837,8975839,T,IEX,50.360000,100
2019-10-25 17:30:19.603436032,2019-10-25 17:30:19.603417773,8984011,T,IEX,50.320000,100
2019-10-25 17:30:19.604272896,2019-10-25 17:30:19.604253665,8984013,T,IEX,50.320000,100
2019-10-25 17:33:27.47328000,2019-10-25 17:33:27.47308044,9065711,T,IEX,50.340000,100
2019-10-25 17:35:55.224909056,2019-10-25 17:35:55.224889921,9127040,T,IEX,50.440000,6
2019-10-25 17:37:00.350129920,2019-10-25 17:37:00.350108380,9154733,T,IEX,50.470000,29
2019-10-25 17:41:02.958797056,2019-10-25 17:41:02.958776963,9249575,T,IEX,50.460000,100
2019-10-25 17:44:13.826635008,2019-10-25 17:44:13.826613543,9322200,T,IEX,50.520000,100
2019-10-25 17:45:18.16005888,2019-10-25 17:45:18.15983635,9345406,T,IEX,50.510000,100
2019-10-25 17:51:41.702477056,2019-10-25 17:51:41.702458362,9476581,T,IEX,50.410000,100
2019-10-25 17:52:31.696734976,2019-10-25 17:52:31.696713687,9496605,T,IEX,50.390000,50
2019-10-25 17:52:31.696802048,2019-10-25 17:52:31.696784738,9496607,T,IEX,50.390000,50
2019-10-25 17:53:23.476037120,2019-10-25 17:53:23.476013726,9513644,T,IEX,50.340000,100
2019-10-25 17:54:59.373783040,2019-10-25 17:54:59.373762848,9547293,T,IEX,50.320000,100
2019-10-25 17:55:32.452495104,2019-10-25 17:55:32.452479129,9559016,T,IEX,50.350000,100
2019-10-25 18:00:53.394949888,2019-10-25 18:00:53.394928559,9671922,T,IEX,50.340000,42
2019-10-25 18:02:08.687117056,2019-10-25 18:02:08.687098356,9695489,T,IEX,50.320000,37
2019-10-25 18:02:08.687174912,2019-10-25 18:02:08.687157427,9695491,T,IEX,50.320000,100
2019-10-25 18:02:08.687188992,2019-10-25 18:02:08.687171605,9695492,T,IEX,50.320000,63
2019-10-25 18:03:05.876578048,2019-10-25 18:03:05.876561274,9738941,T,IEX,50.290000,100
2019-10-25 18:05:12.627823104,2019-10-25 18:05:12.627801731,9833172,T,IEX,50.240000,100
2019-10-25 18:07:25.48034048,2019-10-25 18:07:25.48018387,9893235,T,IEX,50.170000,868
2019-10-25 18:11:51.476558080,2019-10-25 18:11:51.476536046,10016000,T,IEX,50.260000,100
2019-10-25 18:11:51.476660992,2019-10-25 18:11:51.476643539,10016002,T,IEX,50.260000,100
2019-10-25 18:14:05.7420928,2019-10-25 18:14:05.7401566,10066840,T,IEX,50.270000,100
2019-10-25 18:14:50.185472000,2019-10-25 18:14:50.185449475,10086153,T,IEX,50.290000,100
2019-10-25 18:17:48.296288000,2019-10-25 18:17:48.296267539,10155370,T,IEX,50.240000,24
2019-10-25 18:17:48.296369920,2019-10-25 18:17:48.296351490,10155379,T,IEX,50.240000,37
2019-10-25 18:17:48.296529920,2019-10-25 18:17:48.296510815,10155390,T,IEX,50.240000,24
2019-10-25 18:17:48.296579072,2019-10-25 18:17:48.296558764,10155394,T,IEX,50.240000,15
2019-10-25 18:18:00.264105984,2019-10-25 18:18:00.264087946,10159877,T,IEX,50.255000,100
2019-10-25 18:18:29.350528000,2019-10-25 18:18:29.350507843,10170689,T,IEX,50.265000,100
2019-10-25 18:19:34.982735104,2019-10-25 18:19:34.982707933,10193214,T,IEX,50.240000,75
2019-10-25 18:19:34.982833920,2019-10-25 18:19:34.982817432,10193216,T,IEX,50.240000,25
2019-10-25 18:25:08.403990016,2019-10-25 18:25:08.403970060,10311022,T,IEX,50.280000,100
2019-10-25 18:25:33.146423040,2019-10-25 18:25:33.146403939,10318703,T,IEX,50.240000,100
2019-10-25 18:26:12.60116992,2019-10-25 18:26:12.60095701,10330824,T,IEX,50.230000,100
2019-10-25 18:27:17.865955072,2019-10-25 18:27:17.865933355,10353335,T,IEX,50.220000,100
2019-10-25 18:27:18.252628992,2019-10-25 18:27:18.252607459,10353430,T,IEX,50.220000,100
2019-10-25 18:27:47.592205056,2019-10-25 18:27:47.592187636,10363957,T,IEX,50.230000,100
2019-10-25 18:30:57.537449984,2019-10-25 18:30:57.537432541,10447743,T,IEX,50.260000,100
2019-10-25 18:31:08.90891008,2019-10-25 18:31:08.90874267,10453076,T,IEX,50.250000,100
2019-10-25 18:31:08.98575104,2019-10-25 18:31:08.98553532,10453100,T,IEX,50.240000,1
2019-10-25 18:32:59.72262912,2019-10-25 18:32:59.72243985,10492782,T,IEX,50.255000,100
2019-10-25 18:33:12.308157952,2019-10-25 18:33:12.308140604,10497039,T,IEX,50.260000,100
2019-10-25 18:33:21.160955904,2019-10-25 18:33:21.160938940,10500185,T,IEX,50.240000,100
2019-10-25 18:33:43.512399104,2019-10-25 18:33:43.512377945,10515125,T,IEX,50.210000,37
2019-10-25 18:33:43.512497920,2019-10-25 18:33:43.512476451,10515129,T,IEX,50.210000,5
2019-10-25 18:33:43.512513024,2019-10-25 18:33:43.512495952,10515130,T,IEX,50.210000,33
2019-10-25 18:33:43.666349056,2019-10-25 18:33:43.666328423,10515222,T,IEX,50.210000,30
2019-10-25 18:35:33.666065920,2019-10-25 18:35:33.666050180,10566199,T,IEX,50.220000,100
2019-10-25 18:35:44.468382976,2019-10-25 18:35:44.468367485,10573540,T,IEX,50.220000,100
2019-10-25 18:38:12.984795904,2019-10-25 18:38:12.984776538,10634904,T,IEX,50.290000,100
2019-10-25 18:40:19.17963008,2019-10-25 18:40:19.17942695,10676403,T,IEX,50.350000,100
2019-10-25 18:41:00.145787904,2019-10-25 18:41:00.145767194,10687975,T,IEX,50.355000,5
2019-10-25 18:41:00.145803008,2019-10-25 18:41:00.145786783,10687976,T,IEX,50.350000,95
2019-10-25 18:41:00.146458880,2019-10-25 18:41:00.146443361,10687978,T,IEX,50.350000,100
2019-10-25 18:41:00.165709056,2019-10-25 18:41:00.165692268,10687984,T,IEX,50.345000,5
2019-10-25 18:41:54.941591040,2019-10-25 18:41:54.941569664,10709412,T,IEX,50.350000,100
2019-10-25 18:44:37.778959872,2019-10-25 18:44:37.778939971,10768795,T,IEX,50.500000,400
2019-10-25 18:44:53.317050112,2019-10-25 18:44:53.317033380,10774540,T,IEX,50.470000,100
2019-10-25 18:44:55.402196992,2019-10-25 18:44:55.402179349,10775301,T,IEX,50.455000,1
2019-10-25 18:45:03.53127936,2019-10-25 18:45:03.53109925,10778130,T,IEX,50.455000,200
2019-10-25 18:45:32.299740928,2019-10-25 18:45:32.299719842,10787555,T,IEX,50.400000,100
2019-10-25 18:45:45.483838976,2019-10-25 18:45:45.483815573,10791171,T,IEX,50.375000,300
2019-10-25 18:47:25.807464960,2019-10-25 18:47:25.807447383,10826663,T,IEX,50.385000,1
2019-10-25 18:47:25.813502976,2019-10-25 18:47:25.813487180,10826665,T,IEX,50.380000,100
2019-10-25 18:47:29.170076928,2019-10-25 18:47:29.170055946,10827541,T,IEX,50.360000,100
2019-10-25 18:47:35.895070976,2019-10-25 18:47:35.895051898,10829923,T,IEX,50.390000,100
2019-10-25 18:48:45.491360000,2019-10-25 18:48:45.491337918,10856880,T,IEX,50.380000,100
2019-10-25 18:51:19.824677120,2019-10-25 18:51:19.824656231,10904837,T,IEX,50.430000,100
2019-10-25 18:52:25.229387008,2019-10-25 18:52:25.229369047,10925787,T,IEX,50.425000,4
2019-10-25 18:52:25.229405952,2019-10-25 18:52:25.229388542,10925788,T,IEX,50.425000,1
2019-10-25 18:53:48.572943872,2019-10-25 18:53:48.572921070,10952421,T,IEX,50.480000,100
2019-10-25 18:57:26.272146944,2019-10-25 18:57:26.272128466,11041789,T,IEX,50.550000,5
2019-10-25 18:57:27.158782976,2019-10-25 18:57:27.158764010,11041972,T,IEX,50.530000,8
2019-10-25 19:00:25.930179072,2019-10-25 19:00:25.930160286,11126375,T,IEX,50.495000,14
2019-10-25 19:00:25.930195968,2019-10-25 19:00:25.930179768,11126376,T,IEX,50.495000,1
2019-10-25 19:00:25.930214912,2019-10-25 19:00:25.930198065,11126377,T,IEX,50.490000,85
2019-10-25 19:00:25.930296064,2019-10-25 19:00:25.930280011,11126379,T,IEX,50.490000,100
2019-10-25 19:00:25.930383104,2019-10-25 19:00:25.930366515,11126381,T,IEX,50.490000,100
2019-10-25 19:00:26.510202880,2019-10-25 19:00:26.510181147,11126672,T,IEX,50.485000,15
2019-10-25 19:00:51.264752128,2019-10-25 19:00:51.264730596,11135915,T,IEX,50.470000,55
2019-10-25 19:00:51.635496960,2019-10-25 19:00:51.635476354,11136055,T,IEX,50.465000,45
2019-10-25 19:01:17.969161984,2019-10-25 19:01:17.969141502,11147632,T,IEX,50.480000,100
2019-10-25 19:02:59.447463936,2019-10-25 19:02:59.447442555,11183129,T,IEX,50.480000,15
2019-10-25 19:04:16.972177920,2019-10-25 19:04:16.972155867,11211025,T,IEX,50.440000,75
2019-10-25 19:04:16.972244992,2019-10-25 19:04:16.972229227,11211027,T,IEX,50.440000,25
2019-10-25 19:04:17.349789952,2019-10-25 19:04:17.349768198,11211146,T,IEX,50.420000,100
2019-10-25 19:05:43.10654976,2019-10-25 19:05:43.10633385,11242887,T,IEX,50.405000,100
2019-10-25 19:07:03.849380096,2019-10-25 19:07:03.849359369,11274314,T,IEX,50.430000,100
2019-10-25 19:09:47.339497984,2019-10-25 19:09:47.339478282,11332981,T,IEX,50.460000,67
2019-10-25 19:10:32.176679936,2019-10-25 19:10:32.176660491,11351556,T,IEX,50.530000,100
2019-10-25 19:11:06.403430912,2019-10-25 19:11:06.403412892,11367162,T,IEX,50.570000,49
2019-10-25 19:11:39.846454016,2019-10-25 19:11:39.846434111,11383740,T,IEX,50.590000,100
2019-10-25 19:12:10.557680896,2019-10-25 19:12:10.557659359,11394711,T,IEX,50.565000,51
2019-10-25 19:12:10.557696000,2019-10-25 19:12:10.557678389,11394712,T,IEX,50.565000,1
2019-10-25 19:12:10.557716992,2019-10-25 19:12:10.557694942,11394713,T,IEX,50.560000,14
2019-10-25 19:12:10.557801984,2019-10-25 19:12:10.557784023,11394715,T,IEX,50.560000,28
2019-10-25 19:12:10.557864960,2019-10-25 19:12:10.557847055,11394717,T,IEX,50.560000,28
2019-10-25 19:12:10.558146048,2019-10-25 19:12:10.558128457,11394719,T,IEX,50.560000,100
2019-10-25 19:12:10.559265024,2019-10-25 19:12:10.559245468,11394721,T,IEX,50.560000,30
2019-10-25 19:13:06.360037120,2019-10-25 19:13:06.360019182,11415019,T,IEX,50.580000,100
2019-10-25 19:13:16.365729024,2019-10-25 19:13:16.365708204,11417950,T,IEX,50.580000,100
2019-10-25 19:13:40.112048128,2019-10-25 19:13:40.112031352,11426287,T,IEX,50.610000,100
2019-10-25 19:14:42.955214080,2019-10-25 19:14:42.955191685,11448749,T,IEX,50.625000,1
2019-10-25 19:14:52.560314880,2019-10-25 19:14:52.560295644,11451344,T,IEX,50.630000,100
2019-10-25 19:15:34.163618048,2019-10-25 19:15:34.163602205,11465986,T,IEX,50.600000,100
2019-10-25 19:17:29.7290880,2019-10-25 19:17:29.7268419,11508247,T,IEX,50.580000,11
2019-10-25 19:17:42.365424128,2019-10-25 19:17:42.365402721,11515426,T,IEX,50.600000,100
2019-10-25 19:18:24.971490048,2019-10-25 19:18:24.971468915,11532750,T,IEX,50.610000,100
2019-10-25 19:18:52.767205888,2019-10-25 19:18:52.767187181,11541999,T,IEX,50.590000,100
2019-10-25 19:20:13.798095104,2019-10-25 19:20:13.798077862,11575658,T,IEX,50.605000,32
2019-10-25 19:20:13.798115072,2019-10-25 19:20:13.798098091,11575659,T,IEX,50.600000,68
2019-10-25 19:21:22.484709888,2019-10-25 19:21:22.484690643,11611890,T,IEX,50.635000,104
2019-10-25 19:22:17.699668992,2019-10-25 19:22:17.699648610,11636015,T,IEX,50.655000,150
2019-10-25 19:22:22.569472000,2019-10-25 19:22:22.569441823,11637917,T,IEX,50.650000,100
2019-10-25 19:25:40.303341056,2019-10-25 19:25:40.303320804,11715610,T,IEX,50.665000,100
2019-10-25 19:27:02.224566016,2019-10-25 19:27:02.224545386,11752951,T,IEX,50.705000,103
2019-10-25 19:28:50.466225920,2019-10-25 19:28:50.466210176,11794417,T,IEX,50.750000,103
2019-10-25 19:29:07.422784000,2019-10-25 19:29:07.422763638,11801526,T,IEX,50.730000,100
2019-10-25 19:29:27.113920,2019-10-25 19:29:27.95042,11812309,T,IEX,50.710000,27
2019-10-25 19:30:53.136467968,2019-10-25 19:30:53.136447516,11866307,T,IEX,50.700000,100
2019-10-25 19:30:53.166211072,2019-10-25 19:30:53.166192421,11867039,T,IEX,50.715000,100
2019-10-25 19:31:42.727337984,2019-10-25 19:31:42.727315003,11895661,T,IEX,50.685000,100
2019-10-25 19:32:00.213367040,2019-10-25 19:32:00.213348123,11905650,T,IEX,50.665000,100
2019-10-25 19:32:00.767702016,2019-10-25 19:32:00.767681142,11906115,T,IEX,50.665000,100
2019-10-25 19:32:54.534968064,2019-10-25 19:32:54.534945529,11931629,T,IEX,50.655000,103
2019-10-25 19:33:20.691857920,2019-10-25 19:33:20.691837740,11943807,T,IEX,50.640000,100
2019-10-25 19:33:30.623965952,2019-10-25 19:33:30.623948787,11949384,T,IEX,50.630000,100
2019-10-25 19:33:37.571436032,2019-10-25 19:33:37.571414993,11951658,T,IEX,50.640000,100
2019-10-25 19:33:53.989786112,2019-10-25 19:33:53.989765404,11958325,T,IEX,50.665000,10
2019-10-25 19:34:18.12124928,2019-10-25 19:34:18.12104889,11969254,T,IEX,50.660000,8
2019-10-25 19:34:18.13074944,2019-10-25 19:34:18.13055625,11969255,T,IEX,50.660000,92
2019-10-25 19:34:33.373020928,2019-10-25 19:34:33.373000475,11976220,T,IEX,50.675000,3
2019-10-25 19:35:19.616345088,2019-10-25 19:35:19.616327064,11995633,T,IEX,50.675000,8
2019-10-25 19:36:20.479780096,2019-10-25 19:36:20.479759572,12023675,T,IEX,50.675000,3
2019-10-25 19:36:23.726446080,2019-10-25 19:36:23.726425638,12025601,T,IEX,50.670000,100
2019-10-25 19:36:23.924662016,2019-10-25 19:36:23.924642371,12026007,T,IEX,50.670000,1
2019-10-25 19:36:48.966661120,2019-10-25 19:36:48.966641851,12038456,T,IEX,50.660000,100
2019-10-25 19:37:25.421948928,2019-10-25 19:37:25.421931340,12055802,T,IEX,50.650000,10
2019-10-25 19:37:59.367569920,2019-10-25 19:37:59.367551603,12070545,T,IEX,50.610000,100
2019-10-25 19:37:59.368395008,2019-10-25 19:37:59.368377727,12070548,T,IEX,50.610000,100
2019-10-25 19:37:59.368809984,2019-10-25 19:37:59.368791936,12070551,T,IEX,50.610000,100
2019-10-25 19:38:43.568722944,2019-10-25 19:38:43.568702499,12093423,T,IEX,50.585000,100
2019-10-25 19:38:48.358969088,2019-10-25 19:38:48.358950348,12095302,T,IEX,50.535000,100
2019-10-25 19:39:10.877380096,2019-10-25 19:39:10.877362110,12105955,T,IEX,50.540000,100
2019-10-25 19:39:42.198757120,2019-10-25 19:39:42.198738484,12118946,T,IEX,50.585000,100
2019-10-25 19:39:52.503709952,2019-10-25 19:39:52.503689607,12123702,T,IEX,50.560000,100
2019-10-25 19:40:11.10509056,2019-10-25 19:40:11.10492999,12134531,T,IEX,50.575000,100
2019-10-25 19:40:27.882653952,2019-10-25 19:40:27.882634785,12141878,T,IEX,50.570000,2
2019-10-25 19:40:37.759463936,2019-10-25 19:40:37.759442004,12146005,T,IEX,50.575000,60
2019-10-25 19:41:04.687979008,2019-10-25 19:41:04.687959199,12158820,T,IEX,50.595000,100
2019-10-25 19:41:04.688995072,2019-10-25 19:41:04.688975661,12158821,T,IEX,50.595000,100
2019-10-25 19:41:04.690074880,2019-10-25 19:41:04.690054638,12158822,T,IEX,50.595000,100
2019-10-25 19:41:16.864416000,2019-10-25 19:41:16.864397641,12166512,T,IEX,50.595000,22
2019-10-25 19:41:48.185455104,2019-10-25 19:41:48.185438246,12181543,T,IEX,50.580000,1
2019-10-25 19:42:05.907149056,2019-10-25 19:42:05.907128177,12191045,T,IEX,50.580000,3
2019-10-25 19:42:38.600066048,2019-10-25 19:42:38.600046943,12208013,T,IEX,50.580000,5
2019-10-25 19:42:44.80158976,2019-10-25 19:42:44.80137622,12210617,T,IEX,50.580000,9
2019-10-25 19:43:11.824304896,2019-10-25 19:43:11.824285484,12223613,T,IEX,50.590000,1
2019-10-25 19:43:48.744763904,2019-10-25 19:43:48.744741721,12240580,T,IEX,50.575000,100
2019-10-25 19:43:48.771301120,2019-10-25 19:43:48.771279828,12240596,T,IEX,50.570000,4
2019-10-25 19:43:52.718702080,2019-10-25 19:43:52.718679896,12242276,T,IEX,50.575000,100
2019-10-25 19:43:54.539361024,2019-10-25 19:43:54.539339034,12243394,T,IEX,50.575000,100
2019-10-25 19:43:54.564108032,2019-10-25 19:43:54.564085046,12243403,T,IEX,50.570000,4
2019-10-25 19:43:57.28562944,2019-10-25 19:43:57.28543126,12244702,T,IEX,50.570000,4
2019-10-25 19:44:02.994861056,2019-10-25 19:44:02.994842775,12247384,T,IEX,50.575000,1100
2019-10-25 19:44:02.995939072,2019-10-25 19:44:02.995918468,12247385,T,IEX,50.575000,100
2019-10-25 19:44:02.998265088,2019-10-25 19:44:02.998247630,12247387,T,IEX,50.575000,300
2019-10-25 19:44:02.999288064,2019-10-25 19:44:02.999267758,12247388,T,IEX,50.575000,200
2019-10-25 19:44:18.796801024,2019-10-25 19:44:18.796782530,12256197,T,IEX,50.585000,100
2019-10-25 19:44:20.505882112,2019-10-25 19:44:20.505860166,12257070,T,IEX,50.585000,100
2019-10-25 19:44:26.986688000,2019-10-25 19:44:26.986670013,12261429,T,IEX,50.595000,100
2019-10-25 19:44:27.676152064,2019-10-25 19:44:27.676134994,12262283,T,IEX,50.585000,100
2019-10-25 19:44:31.738188032,2019-10-25 19:44:31.738166661,12264579,T,IEX,50.550000,100
2019-10-25 19:44:35.36843008,2019-10-25 19:44:35.36822423,12266345,T,IEX,50.545000,100
2019-10-25 19:44:40.3176960,2019-10-25 19:44:40.3158394,12268522,T,IEX,50.545000,100
2019-10-25 19:45:00.737841920,2019-10-25 19:45:00.737824308,12281861,T,IEX,50.560000,100
2019-10-25 19:45:00.742611968,2019-10-25 19:45:00.742596125,12281875,T,IEX,50.555000,100
2019-10-25 19:45:18.906046976,2019-10-25 19:45:18.906026030,12293010,T,IEX,50.535000,3
2019-10-25 19:45:36.356378880,2019-10-25 19:45:36.356357318,12303478,T,IEX,50.530000,2
2019-10-25 19:45:42.94226944,2019-10-25 19:45:42.94206153,12306160,T,IEX,50.530000,3
2019-10-25 19:45:49.529028096,2019-10-25 19:45:49.529006700,12310071,T,IEX,50.535000,100
2019-10-25 19:45:49.529039104,2019-10-25 19:45:49.529021942,12310072,T,IEX,50.535000,100
2019-10-25 19:45:49.556320000,2019-10-25 19:45:49.556304634,12310085,T,IEX,50.530000,4
2019-10-25 19:45:56.907283968,2019-10-25 19:45:56.907261999,12314353,T,IEX,50.530000,8
2019-10-25 19:46:04.693381120,2019-10-25 19:46:04.693360062,12319152,T,IEX,50.530000,3
2019-10-25 19:46:06.460815104,2019-10-25 19:46:06.460796075,12320099,T,IEX,50.530000,4
2019-10-25 19:46:08.833912064,2019-10-25 19:46:08.833893965,12321634,T,IEX,50.535000,100
2019-10-25 19:46:08.841465088,2019-10-25 19:46:08.841447855,12321651,T,IEX,50.535000,100
2019-10-25 19:46:32.352197120,2019-10-25 19:46:32.352180411,12335163,T,IEX,50.535000,100
2019-10-25 19:46:49.968839936,2019-10-25 19:46:49.968821839,12344211,T,IEX,50.540000,100
2019-10-25 19:46:50.948889088,2019-10-25 19:46:50.948868574,12344791,T,IEX,50.540000,100
2019-10-25 19:47:07.676370944,2019-10-25 19:47:07.676342941,12353621,T,IEX,50.520000,300
2019-10-25 19:47:07.728855040,2019-10-25 19:47:07.728836639,12353922,T,IEX,50.520000,2
2019-10-25 19:47:32.935132928,2019-10-25 19:47:32.935115094,12367529,T,IEX,50.520000,27
2019-10-25 19:47:37.66693888,2019-10-25 19:47:37.66673588,12370014,T,IEX,50.520000,7
2019-10-25 19:47:38.808974080,2019-10-25 19:47:38.808951683,12371087,T,IEX,50.530000,100
2019-10-25 19:47:38.832765952,2019-10-25 19:47:38.832746072,12371100,T,IEX,50.520000,4
2019-10-25 19:47:54.415163904,2019-10-25 19:47:54.415141773,12379681,T,IEX,50.520000,3
2019-10-25 19:47:55.190100992,2019-10-25 19:47:55.190079699,12380044,T,IEX,50.525000,100
2019-10-25 19:47:55.190110976,2019-10-25 19:47:55.190093492,12380045,T,IEX,50.525000,100
2019-10-25 19:47:55.609245952,2019-10-25 19:47:55.609225178,12380193,T,IEX,50.520000,3
2019-10-25 19:48:03.102835968,2019-10-25 19:48:03.102817720,12384484,T,IEX,50.520000,56
2019-10-25 19:48:18.643648000,2019-10-25 19:48:18.643629409,12397113,T,IEX,50.490000,100
2019-10-25 19:48:37.893687040,2019-10-25 19:48:37.893665920,12412703,T,IEX,50.490000,5
2019-10-25 19:48:38.392151040,2019-10-25 19:48:38.392130200,12413128,T,IEX,50.505000,100
2019-10-25 19:48:49.635435008,2019-10-25 19:48:49.635417668,12420640,T,IEX,50.500000,100
2019-10-25 19:48:55.314296064,2019-10-25 19:48:55.314274242,12424108,T,IEX,50.495000,100
2019-10-25 19:48:55.314309120,2019-10-25 19:48:55.314293504,12424109,T,IEX,50.495000,100
2019-10-25 19:48:55.316708096,2019-10-25 19:48:55.316691435,12424111,T,IEX,50.495000,100
2019-10-25 19:48:55.318579968,2019-10-25 19:48:55.318564404,12424113,T,IEX,50.495000,100
2019-10-25 19:48:55.320332032,2019-10-25 19:48:55.320312195,12424116,T,IEX,50.495000,100
2019-10-25 19:48:55.322564096,2019-10-25 19:48:55.322547856,12424121,T,IEX,50.495000,100
2019-10-25 19:48:55.324527104,2019-10-25 19:48:55.324511046,12424123,T,IEX,50.495000,100
2019-10-25 19:48:55.326145024,2019-10-25 19:48:55.326125494,12424124,T,IEX,50.495000,100
2019-10-25 19:48:55.385312000,2019-10-25 19:48:55.385290436,12424153,T,IEX,50.495000,500
2019-10-25 19:48:56.690004992,2019-10-25 19:48:56.689983033,12424806,T,IEX,50.495000,500
2019-10-25 19:48:57.954131968,2019-10-25 19:48:57.954114928,12425683,T,IEX,50.495000,500
2019-10-25 19:48:59.172997888,2019-10-25 19:48:59.172978481,12426369,T,IEX,50.495000,500
2019-10-25 19:49:00.545438976,2019-10-25 19:49:00.545422803,12427228,T,IEX,50.495000,100
2019-10-25 19:49:14.570513920,2019-10-25 19:49:14.570492735,12436392,T,IEX,50.470000,100
2019-10-25 19:49:14.570525952,2019-10-25 19:49:14.570507891,12436393,T,IEX,50.470000,100
2019-10-25 19:49:29.999014912,2019-10-25 19:49:29.998993076,12444661,T,IEX,50.470000,100
2019-10-25 19:50:01.137707008,2019-10-25 19:50:01.137688224,12469417,T,IEX,50.475000,100
2019-10-25 19:50:01.190412032,2019-10-25 19:50:01.190383081,12469614,T,IEX,50.480000,100
2019-10-25 19:50:03.577948928,2019-10-25 19:50:03.577930877,12479276,T,IEX,50.485000,100
2019-10-25 19:50:15.448951040,2019-10-25 19:50:15.448930393,12492497,T,IEX,50.490000,100
2019-10-25 19:50:15.650438912,2019-10-25 19:50:15.650418437,12492719,T,IEX,50.485000,100
2019-10-25 19:50:28.712059904,2019-10-25 19:50:28.712038652,12503852,T,IEX,50.475000,100
2019-10-25 19:50:38.453289984,2019-10-25 19:50:38.453269739,12513510,T,IEX,50.470000,4
2019-10-25 19:50:38.453350912,2019-10-25 19:50:38.453334595,12513512,T,IEX,50.470000,4
2019-10-25 19:50:39.923589888,2019-10-25 19:50:39.923573384,12514503,T,IEX,50.460000,2
2019-10-25 19:50:41.572427008,2019-10-25 19:50:41.572408540,12515424,T,IEX,50.460000,5
2019-10-25 19:50:41.572444928,2019-10-25 19:50:41.572427415,12515425,T,IEX,50.460000,5
2019-10-25 19:50:48.311365120,2019-10-25 19:50:48.311349085,12520860,T,IEX,50.470000,92
2019-10-25 19:50:52.45402112,2019-10-25 19:50:52.45380045,12524464,T,IEX,50.480000,100
2019-10-25 19:51:17.820792064,2019-10-25 19:51:17.820773194,12544811,T,IEX,50.460000,2
2019-10-25 19:51:27.680851968,2019-10-25 19:51:27.680833630,12551714,T,IEX,50.460000,91
2019-10-25 19:51:27.680867072,2019-10-25 19:51:27.680850125,12551715,T,IEX,50.460000,4
2019-10-25 19:51:28.184186880,2019-10-25 19:51:28.184161060,12552915,T,IEX,50.450000,100
2019-10-25 19:51:39.505166080,2019-10-25 19:51:39.505149719,12564141,T,IEX,50.450000,100
2019-10-25 19:51:39.505265920,2019-10-25 19:51:39.505247230,12564143,T,IEX,50.450000,100
2019-10-25 19:51:39.523589888,2019-10-25 19:51:39.523572432,12564166,T,IEX,50.460000,100
2019-10-25 19:51:39.529224960,2019-10-25 19:51:39.529208464,12564174,T,IEX,50.460000,2
2019-10-25 19:51:40.240102912,2019-10-25 19:51:40.240084744,12564740,T,IEX,50.465000,108
2019-10-25 19:51:52.690656000,2019-10-25 19:51:52.690635521,12573953,T,IEX,50.465000,100
2019-10-25 19:51:52.691621888,2019-10-25 19:51:52.691604516,12573954,T,IEX,50.465000,29
2019-10-25 19:51:52.692636928,2019-10-25 19:51:52.692615221,12573955,T,IEX,50.465000,71
2019-10-25 19:51:52.693573888,2019-10-25 19:51:52.693555542,12573956,T,IEX,50.465000,29
2019-10-25 19:51:54.137932032,2019-10-25 19:51:54.137911889,12575000,T,IEX,50.465000,71
2019-10-25 19:52:02.900869120,2019-10-25 19:52:02.900850653,12583815,T,IEX,50.460000,11
2019-10-25 19:52:03.296668928,2019-10-25 19:52:03.296642659,12584395,T,IEX,50.465000,54
2019-10-25 19:52:03.298180096,2019-10-25 19:52:03.298163267,12584406,T,IEX,50.465000,46
2019-10-25 19:52:03.307865088,2019-10-25 19:52:03.307847019,12584421,T,IEX,50.465000,100
2019-10-25 19:52:11.733420032,2019-10-25 19:52:11.733404160,12591047,T,IEX,50.475000,47
2019-10-25 19:52:12.738372096,2019-10-25 19:52:12.738351217,12591707,T,IEX,50.475000,53
2019-10-25 19:52:14.345690880,2019-10-25 19:52:14.345672766,12592795,T,IEX,50.495000,17
2019-10-25 19:52:54.11015936,2019-10-25 19:52:54.10997851,12620998,T,IEX,50.515000,66
2019-10-25 19:52:55.916625920,2019-10-25 19:52:55.916606527,12622330,T,IEX,50.515000,2
2019-10-25 19:52:58.712261888,2019-10-25 19:52:58.712244399,12623882,T,IEX,50.515000,32
2019-10-25 19:52:58.712282112,2019-10-25 19:52:58.712264283,12623883,T,IEX,50.515000,92
2019-10-25 19:53:01.989699072,2019-10-25 19:53:01.989676602,12625872,T,IEX,50.510000,4
2019-10-25 19:53:27.762308096,2019-10-25 19:53:27.762286176,12645740,T,IEX,50.510000,3
2019-10-25 19:53:29.829632000,2019-10-25 19:53:29.829615978,12647740,T,IEX,50.500000,100
2019-10-25 19:54:12.467825920,2019-10-25 19:54:12.467805106,12685090,T,IEX,50.530000,18
2019-10-25 19:54:25.894509056,2019-10-25 19:54:25.894492113,12697124,T,IEX,50.520000,5
2019-10-25 19:54:25.894565888,2019-10-25 19:54:25.894547430,12697126,T,IEX,50.520000,82
2019-10-25 19:54:40.37553920,2019-10-25 19:54:40.37535494,12710817,T,IEX,50.500000,1
2019-10-25 19:55:07.207990016,2019-10-25 19:55:07.207970605,12745804,T,IEX,50.525000,100
2019-10-25 19:55:07.357754112,2019-10-25 19:55:07.357736221,12745899,T,IEX,50.535000,100
2019-10-25 19:55:09.315400960,2019-10-25 19:55:09.315380549,12748467,T,IEX,50.540000,7
2019-10-25 19:55:33.810725888,2019-10-25 19:55:33.810708300,12774482,T,IEX,50.520000,12
2019-10-25 19:55:49.471670016,2019-10-25 19:55:49.471654183,12788898,T,IEX,50.515000,100
2019-10-25 19:55:55.352915968,2019-10-25 19:55:55.352895770,12794079,T,IEX,50.520000,16
2019-10-25 19:56:29.794046976,2019-10-25 19:56:29.794029428,12830020,T,IEX,50.515000,100
2019-10-25 19:56:33.812417024,2019-10-25 19:56:33.812399640,12834564,T,IEX,50.515000,100
2019-10-25 19:56:42.853918976,2019-10-25 19:56:42.853898728,12842659,T,IEX,50.515000,100
2019-10-25 19:57:08.729405952,2019-10-25 19:57:08.729389247,12868395,T,IEX,50.550000,11
2019-10-25 19:57:11.678364928,2019-10-25 19:57:11.678342456,12871254,T,IEX,50.530000,1
2019-10-25 19:57:22.588850944,2019-10-25 19:57:22.588827696,12885364,T,IEX,50.520000,100
2019-10-25 19:57:25.654811904,2019-10-25 19:57:25.654792260,12889024,T,IEX,50.510000,100
2019-10-25 19:57:33.5391872,2019-10-25 19:57:33.5371617,12896008,T,IEX,50.510000,100
2019-10-25 19:57:36.257804032,2019-10-25 19:57:36.257786259,12898949,T,IEX,50.510000,1
2019-10-25 19:57:39.248140032,2019-10-25 19:57:39.248118440,12901730,T,IEX,50.510000,100
2019-10-25 19:57:43.662742016,2019-10-25 19:57:43.662721416,12908134,T,IEX,50.530000,11
2019-10-25 19:57:43.789411072,2019-10-25 19:57:43.789389384,12908240,T,IEX,50.530000,8
2019-10-25 19:58:13.820567040,2019-10-25 19:58:13.820545876,12944296,T,IEX,50.550000,58
2019-10-25 19:58:13.820642048,2019-10-25 19:58:13.820625470,12944298,T,IEX,50.550000,42
2019-10-25 19:58:21.268592128,2019-10-25 19:58:21.268567939,12953606,T,IEX,50.560000,8
2019-10-25 19:58:25.340824064,2019-10-25 19:58:25.340804721,12958144,T,IEX,50.560000,9
2019-10-25 19:58:25.799218944,2019-10-25 19:58:25.799198866,12958686,T,IEX,50.550000,3
2019-10-25 19:58:29.25701120,2019-10-25 19:58:29.25682602,12962363,T,IEX,50.560000,11
2019-10-25 19:58:30.513724928,2019-10-25 19:58:30.513705014,12964190,T,IEX,50.550000,100
2019-10-25 19:58:30.513972992,2019-10-25 19:58:30.513956282,12964192,T,IEX,50.550000,7
2019-10-25 19:58:30.513993984,2019-10-25 19:58:30.513976397,12964193,T,IEX,50.550000,2
2019-10-25 19:58:30.514006016,2019-10-25 19:58:30.513989486,12964194,T,IEX,50.550000,91
2019-10-25 19:58:30.514057984,2019-10-25 19:58:30.514041251,12964195,T,IEX,50.550000,6
2019-10-25 19:58:38.594897920,2019-10-25 19:58:38.594875256,12974182,T,IEX,50.545000,100
2019-10-25 19:59:02.802381056,2019-10-25 19:59:02.802358554,13004791,T,IEX,50.580000,190
2019-10-25 19:59:02.831292928,2019-10-25 19:59:02.831271615,13004827,T,IEX,50.575000,10
2019-10-25 19:59:06.100092928,2019-10-25 19:59:06.100074096,13009769,T,IEX,50.575000,100
2019-10-25 19:59:06.113940992,2019-10-25 19:59:06.113921538,13009798,T,IEX,50.575000,100
2019-10-25 19:59:06.131358976,2019-10-25 19:59:06.131339048,13009824,T,IEX,50.575000,100
2019-10-25 19:59:06.601328896,2019-10-25 19:59:06.601311057,13010484,T,IEX,50.575000,100
2019-10-25 19:59:06.879928064,2019-10-25 19:59:06.879909653,13010904,T,IEX,50.575000,11
2019-10-25 19:59:07.817649920,2019-10-25 19:59:07.817631861,13012606,T,IEX,50.575000,100
2019-10-25 19:59:07.817761024,2019-10-25 19:59:07.817741789,13012607,T,IEX,50.575000,100
2019-10-25 19:59:08.113835008,2019-10-25 19:59:08.113816871,13013060,T,IEX,50.555000,100
2019-10-25 19:59:08.113861120,2019-10-25 19:59:08.113843433,13013061,T,IEX,50.555000,100
2019-10-25 19:59:08.359052032,2019-10-25 19:59:08.359033952,13013506,T,IEX,50.540000,100
2019-10-25 19:59:08.385167872,2019-10-25 19:59:08.385149843,13013576,T,IEX,50.530000,57
2019-10-25 19:59:12.285011968,2019-10-25 19:59:12.284989411,13020237,T,IEX,50.550000,10
2019-10-25 19:59:15.342096896,2019-10-25 19:59:15.342079262,13025108,T,IEX,50.540000,100
2019-10-25 19:59:22.543529984,2019-10-25 19:59:22.543512972,13036395,T,IEX,50.530000,20
2019-10-25 19:59:24.332296960,2019-10-25 19:59:24.332276972,13038309,T,IEX,50.510000,600
2019-10-25 19:59:31.613154048,2019-10-25 19:59:31.613134648,13056485,T,IEX,50.520000,100
2019-10-25 19:59:31.613166080,2019-10-25 19:59:31.613149242,13056486,T,IEX,50.520000,68
2019-10-25 19:59:52.894728960,2019-10-25 19:59:52.894707595,13178000,T,IEX,50.520000,26
2019-10-25 19:59:58.57092096,2019-10-25 19:59:58.57075734,13216880,T,IEX,50.500000,87
