2019-10-28 13:30:05.830622976,2019-10-28 13:30:05.830598007,128145,T,IEX,245.530000,2
2019-10-28 13:30:58.212119040,2019-10-28 13:30:58.212096562,192406,T,IEX,245.410000,100
2019-10-28 13:31:14.180215040,2019-10-28 13:31:14.180192167,215852,T,IEX,245.330000,100
2019-10-28 13:31:46.387600896,2019-10-28 13:31:46.387579954,253452,T,IEX,245.205000,100
2019-10-28 13:32:47.621268992,2019-10-28 13:32:47.621251854,322630,T,IEX,245.340000,100
2019-10-28 13:32:49.574925056,2019-10-28 13:32:49.574908934,324447,T,IEX,245.290000,100
2019-10-28 13:33:46.699718912,2019-10-28 13:33:46.699701302,388857,T,IEX,245.420000,100
2019-10-28 13:33:50.309943040,2019-10-28 13:33:50.309925047,392683,T,IEX,245.390000,100
2019-10-28 13:36:53.915017984,2019-10-28 13:36:53.915000881,590014,T,IEX,246.175000,5
2019-10-28 13:39:40.323176960,2019-10-28 13:39:40.323159436,735134,T,IEX,247.000000,100
2019-10-28 13:40:35.921747968,2019-10-28 13:40:35.921730512,784212,T,IEX,246.950000,2
2019-10-28 13:41:02.99085056,2019-10-28 13:41:02.99069415,808295,T,IEX,247.025000,100
2019-10-28 13:41:11.783482112,2019-10-28 13:41:11.783462166,816965,T,IEX,246.910000,3
2019-10-28 13:41:17.98720000,2019-10-28 13:41:17.98698113,822725,T,IEX,246.930000,100
2019-10-28 13:41:17.416334080,2019-10-28 13:41:17.416318305,822930,T,IEX,246.930000,100
2019-10-28 13:41:19.46856960,2019-10-28 13:41:19.46839325,824268,T,IEX,246.960000,200
2019-10-28 13:41:19.48036096,2019-10-28 13:41:19.48016819,824285,T,IEX,247.000000,100
2019-10-28 13:41:19.111277056,2019-10-28 13:41:19.111261193,824358,T,IEX,246.950000,100
2019-10-28 13:41:19.122707968,2019-10-28 13:41:19.122692133,824378,T,IEX,246.950000,100
2019-10-28 13:41:19.148197888,2019-10-28 13:41:19.148180349,824416,T,IEX,246.950000,100
2019-10-28 13:41:19.593221120,2019-10-28 13:41:19.593203519,824790,T,IEX,246.930000,100
2019-10-28 13:41:19.808669952,2019-10-28 13:41:19.808649519,824963,T,IEX,246.930000,100
2019-10-28 13:41:32.98663936,2019-10-28 13:41:32.98648301,834949,T,IEX,246.925000,100
2019-10-28 13:41:38.218016000,2019-10-28 13:41:38.217999224,839717,T,IEX,246.945000,100
2019-10-28 13:42:04.666676992,2019-10-28 13:42:04.666661254,859350,T,IEX,246.910000,100
2019-10-28 13:42:41.974011904,2019-10-28 13:42:41.973993916,895633,T,IEX,246.825000,100
2019-10-28 13:42:43.624163072,2019-10-28 13:42:43.624146997,897756,T,IEX,246.855000,100
2019-10-28 13:42:50.883864064,2019-10-28 13:42:50.883845710,904798,T,IEX,246.850000,100
2019-10-28 13:42:51.120271872,2019-10-28 13:42:51.120253365,904950,T,IEX,246.825000,100
2019-10-28 13:42:55.667074048,2019-10-28 13:42:55.667057360,910125,T,IEX,246.950000,3
2019-10-28 13:42:56.604350976,2019-10-28 13:42:56.604331455,910867,T,IEX,246.910000,100
2019-10-28 13:44:39.356668928,2019-10-28 13:44:39.356651664,1006265,T,IEX,246.250000,2
2019-10-28 13:45:20.363834880,2019-10-28 13:45:20.363815275,1050174,T,IEX,246.525000,100
2019-10-28 13:45:28.456525056,2019-10-28 13:45:28.456510260,1058067,T,IEX,246.460000,100
2019-10-28 13:46:20.734042112,2019-10-28 13:46:20.734024446,1099268,T,IEX,246.685000,100
2019-10-28 13:46:20.734935040,2019-10-28 13:46:20.734919632,1099283,T,IEX,246.700000,100
2019-10-28 13:46:20.742077952,2019-10-28 13:46:20.742058873,1099313,T,IEX,246.680000,100
2019-10-28 13:46:20.743621888,2019-10-28 13:46:20.743602361,1099317,T,IEX,246.680000,100
2019-10-28 13:46:20.748043008,2019-10-28 13:46:20.748024894,1099327,T,IEX,246.680000,100
2019-10-28 13:47:08.373956096,2019-10-28 13:47:08.373938740,1141232,T,IEX,246.900000,100
2019-10-28 13:47:08.583409920,2019-10-28 13:47:08.583389393,1141362,T,IEX,246.840000,300
2019-10-28 13:47:38.524795904,2019-10-28 13:47:38.524775137,1172849,T,IEX,247.025000,100
2019-10-28 13:47:39.157171968,2019-10-28 13:47:39.157151972,1173211,T,IEX,247.025000,200
2019-10-28 13:47:40.599970048,2019-10-28 13:47:40.599948434,1174620,T,IEX,246.990000,100
2019-10-28 13:47:40.599987968,2019-10-28 13:47:40.599969548,1174622,T,IEX,246.950000,100
2019-10-28 13:47:40.600004096,2019-10-28 13:47:40.599987010,1174623,T,IEX,246.950000,400
2019-10-28 13:47:40.611046912,2019-10-28 13:47:40.611029884,1174645,T,IEX,246.945000,300
2019-10-28 13:48:33.590300928,2019-10-28 13:48:33.590284807,1228084,T,IEX,246.915000,100
2019-10-28 13:48:33.590700032,2019-10-28 13:48:33.590681456,1228088,T,IEX,246.900000,100
2019-10-28 13:49:55.382213120,2019-10-28 13:49:55.382193340,1294322,T,IEX,246.860000,100
2019-10-28 13:49:55.510009088,2019-10-28 13:49:55.509988381,1294555,T,IEX,246.890000,200
2019-10-28 13:51:08.63929088,2019-10-28 13:51:08.63911529,1363254,T,IEX,246.575000,10
2019-10-28 13:51:27.124771072,2019-10-28 13:51:27.124750374,1379118,T,IEX,246.590000,1
2019-10-28 13:51:27.124788992,2019-10-28 13:51:27.124770408,1379119,T,IEX,246.640000,99
2019-10-28 13:51:27.124929024,2019-10-28 13:51:27.124912459,1379121,T,IEX,246.640000,1
2019-10-28 13:51:29.270029056,2019-10-28 13:51:29.270011531,1380228,T,IEX,246.560000,100
2019-10-28 13:51:29.270048000,2019-10-28 13:51:29.270031475,1380229,T,IEX,246.540000,100
2019-10-28 13:51:29.270064896,2019-10-28 13:51:29.270048498,1380230,T,IEX,246.540000,100
2019-10-28 13:51:29.274384896,2019-10-28 13:51:29.274368084,1380237,T,IEX,246.595000,100
2019-10-28 13:52:28.716722944,2019-10-28 13:52:28.716700094,1435522,T,IEX,246.640000,62
2019-10-28 13:52:28.716756992,2019-10-28 13:52:28.716740457,1435524,T,IEX,246.640000,137
2019-10-28 13:52:28.716936960,2019-10-28 13:52:28.716920706,1435526,T,IEX,246.640000,1
2019-10-28 13:52:28.717099008,2019-10-28 13:52:28.717081694,1435527,T,IEX,246.640000,100
2019-10-28 13:52:28.717134080,2019-10-28 13:52:28.717116887,1435528,T,IEX,246.640000,100
2019-10-28 13:52:28.717957888,2019-10-28 13:52:28.717938707,1435530,T,IEX,246.590000,100
2019-10-28 13:52:57.800289024,2019-10-28 13:52:57.800273468,1461556,T,IEX,246.735000,300
2019-10-28 13:53:34.804929024,2019-10-28 13:53:34.804911188,1492859,T,IEX,246.890000,100
2019-10-28 13:53:37.952359936,2019-10-28 13:53:37.952337640,1497073,T,IEX,246.880000,200
2019-10-28 13:53:50.916997120,2019-10-28 13:53:50.916975718,1506907,T,IEX,246.945000,400
2019-10-28 13:54:03.49241088,2019-10-28 13:54:03.49218378,1518989,T,IEX,246.955000,100
2019-10-28 13:54:03.535407104,2019-10-28 13:54:03.535388937,1519375,T,IEX,246.955000,100
2019-10-28 13:54:09.434337024,2019-10-28 13:54:09.434315996,1525592,T,IEX,246.870000,12
2019-10-28 13:54:57.575278080,2019-10-28 13:54:57.575258275,1563690,T,IEX,246.950000,100
2019-10-28 13:54:57.585051904,2019-10-28 13:54:57.585034698,1563770,T,IEX,246.980000,300
2019-10-28 13:55:00.959068928,2019-10-28 13:55:00.959050580,1567540,T,IEX,247.000000,200
2019-10-28 13:55:00.963703040,2019-10-28 13:55:00.963545433,1567542,T,IEX,247.000000,200
2019-10-28 13:55:03.3354880,2019-10-28 13:55:03.3336084,1569506,T,IEX,247.005000,131
2019-10-28 13:55:05.583965952,2019-10-28 13:55:05.583948478,1572225,T,IEX,247.035000,169
2019-10-28 13:55:05.583997952,2019-10-28 13:55:05.583981565,1572227,T,IEX,247.035000,1
2019-10-28 13:55:07.583090944,2019-10-28 13:55:07.583073520,1573971,T,IEX,246.910000,100
2019-10-28 13:55:07.593099008,2019-10-28 13:55:07.593077195,1573978,T,IEX,246.985000,200
2019-10-28 13:55:20.197107968,2019-10-28 13:55:20.197090756,1585452,T,IEX,246.990000,200
2019-10-28 13:55:20.197392896,2019-10-28 13:55:20.197375547,1585455,T,IEX,246.990000,200
2019-10-28 13:55:20.296056064,2019-10-28 13:55:20.296040265,1585671,T,IEX,247.000000,1
2019-10-28 13:55:38.488417024,2019-10-28 13:55:38.488401475,1599367,T,IEX,247.060000,1
2019-10-28 13:55:38.512967936,2019-10-28 13:55:38.512949122,1599383,T,IEX,247.040000,1
2019-10-28 13:55:39.569123072,2019-10-28 13:55:39.569103727,1600131,T,IEX,247.045000,100
2019-10-28 13:55:48.518757120,2019-10-28 13:55:48.518733927,1606463,T,IEX,246.995000,200
2019-10-28 13:55:48.520679936,2019-10-28 13:55:48.520660224,1606464,T,IEX,246.990000,100
2019-10-28 13:55:49.980123904,2019-10-28 13:55:49.980101785,1607281,T,IEX,247.035000,1
2019-10-28 13:56:00.266910976,2019-10-28 13:56:00.266890141,1615280,T,IEX,247.025000,300
2019-10-28 13:56:00.273650944,2019-10-28 13:56:00.273630165,1615285,T,IEX,247.050000,100
2019-10-28 13:56:00.273662976,2019-10-28 13:56:00.273646749,1615286,T,IEX,247.090000,100
2019-10-28 13:56:00.275773952,2019-10-28 13:56:00.275755955,1615290,T,IEX,247.025000,1
2019-10-28 13:56:00.277928960,2019-10-28 13:56:00.277911188,1615293,T,IEX,247.030000,100
2019-10-28 13:56:00.280668928,2019-10-28 13:56:00.280651697,1615295,T,IEX,247.030000,200
2019-10-28 13:56:00.285037056,2019-10-28 13:56:00.285016238,1615297,T,IEX,247.030000,100
2019-10-28 13:56:33.707187968,2019-10-28 13:56:33.707168885,1642437,T,IEX,247.015000,3
2019-10-28 13:56:34.302021888,2019-10-28 13:56:34.302003655,1643253,T,IEX,247.060000,100
2019-10-28 13:56:34.302153984,2019-10-28 13:56:34.302137093,1643256,T,IEX,247.060000,2
2019-10-28 13:56:48.621267968,2019-10-28 13:56:48.621248034,1652671,T,IEX,247.100000,25
2019-10-28 13:56:48.625991936,2019-10-28 13:56:48.625970219,1652690,T,IEX,247.260000,100
2019-10-28 13:56:48.628318976,2019-10-28 13:56:48.628297572,1652693,T,IEX,247.260000,53
2019-10-28 13:56:48.628402944,2019-10-28 13:56:48.628385369,1652694,T,IEX,247.260000,47
2019-10-28 13:56:48.628417024,2019-10-28 13:56:48.628400821,1652695,T,IEX,247.260000,100
2019-10-28 13:56:48.628431872,2019-10-28 13:56:48.628415218,1652696,T,IEX,247.260000,1
2019-10-28 13:57:11.864705024,2019-10-28 13:57:11.864684736,1672756,T,IEX,247.330000,2
2019-10-28 13:57:23.107414016,2019-10-28 13:57:23.107394123,1682389,T,IEX,247.310000,1
2019-10-28 13:57:25.298686976,2019-10-28 13:57:25.298666926,1683749,T,IEX,247.270000,100
2019-10-28 13:57:58.326181120,2019-10-28 13:57:58.326161576,1708910,T,IEX,247.060000,13
2019-10-28 13:58:09.906702080,2019-10-28 13:58:09.906683452,1720083,T,IEX,246.880000,100
2019-10-28 13:58:10.816861952,2019-10-28 13:58:10.816838602,1721161,T,IEX,246.780000,100
2019-10-28 13:58:17.33099008,2019-10-28 13:58:17.33078937,1727315,T,IEX,246.700000,100
2019-10-28 13:58:18.78114048,2019-10-28 13:58:18.78097304,1728548,T,IEX,246.710000,200
2019-10-28 13:58:21.175737088,2019-10-28 13:58:21.175720458,1731734,T,IEX,246.710000,2
2019-10-28 13:58:46.708356096,2019-10-28 13:58:46.708334754,1755045,T,IEX,246.775000,1
2019-10-28 13:58:46.738363904,2019-10-28 13:58:46.738341724,1755055,T,IEX,246.810000,2
2019-10-28 13:58:49.440648960,2019-10-28 13:58:49.440630105,1756390,T,IEX,246.780000,200
2019-10-28 13:58:52.566768128,2019-10-28 13:58:52.566749976,1758733,T,IEX,246.740000,100
2019-10-28 13:58:52.567096064,2019-10-28 13:58:52.567076977,1758735,T,IEX,246.710000,100
2019-10-28 13:58:52.569430016,2019-10-28 13:58:52.569415494,1758742,T,IEX,246.720000,1
2019-10-28 13:58:57.206377984,2019-10-28 13:58:57.206358941,1761569,T,IEX,246.795000,2
2019-10-28 13:59:00.11238912,2019-10-28 13:59:00.11217967,1762834,T,IEX,246.765000,200
2019-10-28 13:59:00.12740096,2019-10-28 13:59:00.12723204,1762838,T,IEX,246.740000,2
2019-10-28 13:59:00.135489024,2019-10-28 13:59:00.135472837,1762954,T,IEX,246.740000,2
2019-10-28 13:59:00.717469952,2019-10-28 13:59:00.717448092,1763665,T,IEX,246.740000,200
2019-10-28 13:59:14.802202880,2019-10-28 13:59:14.802187854,1774766,T,IEX,246.780000,1
2019-10-28 13:59:15.819891968,2019-10-28 13:59:15.819870869,1776145,T,IEX,246.815000,1
2019-10-28 13:59:15.865385984,2019-10-28 13:59:15.865364936,1776162,T,IEX,246.815000,1
2019-10-28 13:59:17.14375936,2019-10-28 13:59:17.14356992,1776847,T,IEX,246.715000,1
2019-10-28 13:59:21.448045056,2019-10-28 13:59:21.448026026,1780348,T,IEX,246.820000,100
2019-10-28 13:59:21.448898048,2019-10-28 13:59:21.448880285,1780350,T,IEX,246.820000,100
2019-10-28 13:59:23.447826944,2019-10-28 13:59:23.447810651,1781837,T,IEX,246.765000,1
2019-10-28 13:59:58.937954048,2019-10-28 13:59:58.937936229,1807827,T,IEX,246.925000,12
2019-10-28 13:59:58.937971968,2019-10-28 13:59:58.937955943,1807828,T,IEX,246.930000,1
2019-10-28 14:00:03.837117952,2019-10-28 14:00:03.837101633,1813210,T,IEX,247.060000,1
2019-10-28 14:00:11.293102080,2019-10-28 14:00:11.293084966,1820066,T,IEX,247.180000,1
2019-10-28 14:00:26.602074880,2019-10-28 14:00:26.602056314,1836047,T,IEX,247.095000,1
2019-10-28 14:00:28.26447104,2019-10-28 14:00:28.26426993,1837302,T,IEX,247.095000,1
2019-10-28 14:00:48.608139008,2019-10-28 14:00:48.608119490,1855850,T,IEX,247.125000,1
2019-10-28 14:00:49.456392960,2019-10-28 14:00:49.456377877,1856486,T,IEX,247.120000,1
2019-10-28 14:00:51.357409024,2019-10-28 14:00:51.357387081,1857659,T,IEX,247.220000,1
2019-10-28 14:01:34.162860032,2019-10-28 14:01:34.162840013,1896236,T,IEX,247.430000,1
2019-10-28 14:01:36.536719104,2019-10-28 14:01:36.536700204,1897915,T,IEX,247.430000,1
2019-10-28 14:01:40.369606912,2019-10-28 14:01:40.369589473,1900058,T,IEX,247.460000,100
2019-10-28 14:01:40.969797120,2019-10-28 14:01:40.969777606,1900847,T,IEX,247.420000,1
2019-10-28 14:01:40.996177920,2019-10-28 14:01:40.996160721,1900868,T,IEX,247.415000,1
2019-10-28 14:01:53.6713088,2019-10-28 14:01:53.6692264,1908036,T,IEX,247.420000,100
2019-10-28 14:01:56.77853952,2019-10-28 14:01:56.77835013,1909831,T,IEX,247.450000,100
2019-10-28 14:01:56.77867008,2019-10-28 14:01:56.77850281,1909832,T,IEX,247.470000,2
2019-10-28 14:02:04.322055936,2019-10-28 14:02:04.322036704,1917907,T,IEX,247.480000,100
2019-10-28 14:02:06.896225024,2019-10-28 14:02:06.896206839,1919630,T,IEX,247.480000,100
2019-10-28 14:02:09.160062976,2019-10-28 14:02:09.160042491,1921082,T,IEX,247.445000,1
2019-10-28 14:02:09.417754880,2019-10-28 14:02:09.417737320,1921269,T,IEX,247.470000,1
2019-10-28 14:02:13.56905984,2019-10-28 14:02:13.56887410,1924363,T,IEX,247.485000,100
2019-10-28 14:02:14.352444928,2019-10-28 14:02:14.352423795,1925419,T,IEX,247.485000,1
2019-10-28 14:02:19.432101120,2019-10-28 14:02:19.432083036,1929629,T,IEX,247.485000,1
2019-10-28 14:04:10.734194944,2019-10-28 14:04:10.734177478,2013591,T,IEX,247.480000,100
2019-10-28 14:04:10.737740032,2019-10-28 14:04:10.737714980,2013733,T,IEX,247.480000,100
2019-10-28 14:04:27.28988928,2019-10-28 14:04:27.28968240,2027219,T,IEX,247.540000,18
2019-10-28 14:04:27.29006080,2019-10-28 14:04:27.28988623,2027220,T,IEX,247.540000,14
2019-10-28 14:04:27.73792000,2019-10-28 14:04:27.73773703,2027238,T,IEX,247.550000,100
2019-10-28 14:05:13.133934080,2019-10-28 14:05:13.133912426,2061789,T,IEX,247.660000,100
2019-10-28 14:05:53.614859008,2019-10-28 14:05:53.614840610,2092897,T,IEX,247.740000,200
2019-10-28 14:06:19.262033920,2019-10-28 14:06:19.262016949,2115307,T,IEX,247.735000,100
2019-10-28 14:06:21.973721088,2019-10-28 14:06:21.973701748,2118248,T,IEX,247.790000,100
2019-10-28 14:06:42.129009920,2019-10-28 14:06:42.128992917,2136332,T,IEX,247.840000,100
2019-10-28 14:06:52.185699072,2019-10-28 14:06:52.185677738,2146103,T,IEX,247.810000,100
2019-10-28 14:07:44.822532096,2019-10-28 14:07:44.822513157,2187066,T,IEX,247.820000,100
2019-10-28 14:07:44.822617088,2019-10-28 14:07:44.822598313,2187067,T,IEX,247.820000,100
2019-10-28 14:08:10.29880064,2019-10-28 14:08:10.29861358,2202767,T,IEX,248.080000,100
2019-10-28 14:08:10.29897984,2019-10-28 14:08:10.29881405,2202768,T,IEX,248.100000,100
2019-10-28 14:08:34.805690880,2019-10-28 14:08:34.805673952,2221475,T,IEX,248.010000,100
2019-10-28 14:08:59.228677888,2019-10-28 14:08:59.228661006,2238605,T,IEX,248.045000,100
2019-10-28 14:08:59.485481984,2019-10-28 14:08:59.485461317,2238731,T,IEX,248.045000,100
2019-10-28 14:09:00.178810112,2019-10-28 14:09:00.178790133,2239145,T,IEX,248.110000,75
2019-10-28 14:09:00.324493056,2019-10-28 14:09:00.324476596,2239421,T,IEX,248.120000,25
2019-10-28 14:09:42.8009984,2019-10-28 14:09:42.7987825,2267599,T,IEX,248.110000,100
2019-10-28 14:09:43.162608896,2019-10-28 14:09:43.162588369,2268078,T,IEX,248.110000,100
2019-10-28 14:09:43.471105024,2019-10-28 14:09:43.471088835,2268208,T,IEX,248.110000,100
2019-10-28 14:09:45.184515072,2019-10-28 14:09:45.184495708,2270016,T,IEX,248.115000,100
2019-10-28 14:09:56.172971008,2019-10-28 14:09:56.172953286,2276800,T,IEX,248.175000,100
2019-10-28 14:09:58.162684928,2019-10-28 14:09:58.162664992,2277653,T,IEX,248.180000,100
2019-10-28 14:09:58.369110016,2019-10-28 14:09:58.369092361,2277778,T,IEX,248.180000,100
2019-10-28 14:09:58.371536896,2019-10-28 14:09:58.371517543,2277780,T,IEX,248.180000,100
2019-10-28 14:10:13.169600000,2019-10-28 14:10:13.169583284,2288766,T,IEX,248.185000,100
2019-10-28 14:10:15.828944896,2019-10-28 14:10:15.828926116,2291774,T,IEX,248.230000,100
2019-10-28 14:10:15.829352960,2019-10-28 14:10:15.829335605,2291777,T,IEX,248.230000,95
2019-10-28 14:10:18.354525952,2019-10-28 14:10:18.354505386,2294176,T,IEX,248.195000,100
2019-10-28 14:10:45.566733056,2019-10-28 14:10:45.566712149,2311892,T,IEX,248.105000,100
2019-10-28 14:10:45.571947008,2019-10-28 14:10:45.571929201,2311895,T,IEX,248.105000,100
2019-10-28 14:10:58.162928128,2019-10-28 14:10:58.162908793,2320202,T,IEX,248.100000,100
2019-10-28 14:10:58.685216000,2019-10-28 14:10:58.685196036,2320568,T,IEX,248.100000,200
2019-10-28 14:11:16.589462016,2019-10-28 14:11:16.589441229,2336488,T,IEX,247.990000,100
2019-10-28 14:11:28.162598912,2019-10-28 14:11:28.162579527,2345059,T,IEX,247.935000,100
2019-10-28 14:12:02.795653888,2019-10-28 14:12:02.795638533,2367937,T,IEX,248.000000,100
2019-10-28 14:12:23.973903104,2019-10-28 14:12:23.973884555,2384264,T,IEX,247.980000,100
2019-10-28 14:12:24.516529920,2019-10-28 14:12:24.516513173,2384536,T,IEX,247.990000,100
2019-10-28 14:12:25.61477120,2019-10-28 14:12:25.61457223,2384770,T,IEX,247.990000,100
2019-10-28 14:12:35.556545024,2019-10-28 14:12:35.556526268,2391253,T,IEX,247.985000,148
2019-10-28 14:12:46.230362112,2019-10-28 14:12:46.230342675,2400194,T,IEX,248.020000,100
2019-10-28 14:12:46.230464000,2019-10-28 14:12:46.230447978,2400195,T,IEX,248.010000,200
2019-10-28 14:12:46.230809088,2019-10-28 14:12:46.230791107,2400197,T,IEX,248.010000,200
2019-10-28 14:12:46.834020096,2019-10-28 14:12:46.833998007,2400694,T,IEX,248.010000,100
2019-10-28 14:12:47.158184960,2019-10-28 14:12:47.158164409,2401043,T,IEX,248.030000,100
2019-10-28 14:12:47.273999104,2019-10-28 14:12:47.273980852,2401934,T,IEX,248.025000,100
2019-10-28 14:12:48.53272064,2019-10-28 14:12:48.53255392,2402937,T,IEX,248.030000,100
2019-10-28 14:12:58.162661120,2019-10-28 14:12:58.162641793,2409663,T,IEX,248.050000,100
2019-10-28 14:12:58.162684928,2019-10-28 14:12:58.162668271,2409664,T,IEX,248.050000,100
2019-10-28 14:13:27.51322880,2019-10-28 14:13:27.51303531,2428387,T,IEX,248.210000,100
2019-10-28 14:13:27.52282112,2019-10-28 14:13:27.52263801,2428388,T,IEX,248.210000,100
2019-10-28 14:13:27.58387968,2019-10-28 14:13:27.58367689,2428389,T,IEX,248.210000,100
2019-10-28 14:13:27.62932992,2019-10-28 14:13:27.62911572,2428391,T,IEX,248.210000,100
2019-10-28 14:13:43.162422016,2019-10-28 14:13:43.162402369,2438689,T,IEX,248.335000,100
2019-10-28 14:13:57.726394112,2019-10-28 14:13:57.726373989,2447492,T,IEX,248.340000,50
2019-10-28 14:14:09.448311040,2019-10-28 14:14:09.448289537,2454242,T,IEX,248.260000,48
2019-10-28 14:14:09.448957952,2019-10-28 14:14:09.448939311,2454244,T,IEX,248.260000,52
2019-10-28 14:14:17.85358080,2019-10-28 14:14:17.85338491,2458450,T,IEX,248.235000,2
2019-10-28 14:14:17.85374976,2019-10-28 14:14:17.85358417,2458451,T,IEX,248.235000,1
2019-10-28 14:14:55.586764032,2019-10-28 14:14:55.586742097,2483929,T,IEX,248.170000,100
2019-10-28 14:16:06.92097024,2019-10-28 14:16:06.92078594,2538002,T,IEX,248.080000,100
2019-10-28 14:16:06.92208896,2019-10-28 14:16:06.92186188,2538008,T,IEX,248.120000,75
2019-10-28 14:16:06.97125120,2019-10-28 14:16:06.97107954,2538155,T,IEX,248.120000,58
2019-10-28 14:16:06.100205056,2019-10-28 14:16:06.100187435,2538245,T,IEX,248.120000,25
2019-10-28 14:16:06.100220928,2019-10-28 14:16:06.100202887,2538246,T,IEX,248.120000,42
2019-10-28 14:16:06.102526976,2019-10-28 14:16:06.102505700,2538321,T,IEX,248.120000,200
2019-10-28 14:16:33.851186944,2019-10-28 14:16:33.851162860,2560886,T,IEX,248.135000,300
2019-10-28 14:16:52.340611072,2019-10-28 14:16:52.340594040,2572523,T,IEX,248.180000,100
2019-10-28 14:16:52.399704064,2019-10-28 14:16:52.399684440,2572559,T,IEX,248.155000,100
2019-10-28 14:16:58.523159040,2019-10-28 14:16:58.523141617,2575394,T,IEX,248.210000,100
2019-10-28 14:16:58.524665088,2019-10-28 14:16:58.524645163,2575395,T,IEX,248.210000,100
2019-10-28 14:17:12.735028992,2019-10-28 14:17:12.735009475,2587880,T,IEX,248.145000,1
2019-10-28 14:17:12.735045888,2019-10-28 14:17:12.735029385,2587881,T,IEX,248.145000,1
2019-10-28 14:18:07.392866048,2019-10-28 14:18:07.392847166,2622727,T,IEX,248.075000,100
2019-10-28 14:18:07.392882944,2019-10-28 14:18:07.392867496,2622728,T,IEX,248.075000,300
2019-10-28 14:18:16.821790976,2019-10-28 14:18:16.821770024,2628544,T,IEX,248.035000,3
2019-10-28 14:18:37.426003968,2019-10-28 14:18:37.425983142,2643728,T,IEX,248.040000,100
2019-10-28 14:19:05.822685952,2019-10-28 14:19:05.822668569,2662329,T,IEX,248.080000,100
2019-10-28 14:19:36.922056960,2019-10-28 14:19:36.922040139,2687202,T,IEX,248.110000,100
2019-10-28 14:19:53.951485952,2019-10-28 14:19:53.951465290,2697795,T,IEX,248.120000,100
2019-10-28 14:20:50.575724032,2019-10-28 14:20:50.575700802,2733873,T,IEX,248.160000,100
2019-10-28 14:21:08.723340032,2019-10-28 14:21:08.723323616,2744826,T,IEX,248.010000,1
2019-10-28 14:21:15.530799104,2019-10-28 14:21:15.530777040,2749690,T,IEX,247.920000,137
2019-10-28 14:23:51.652220928,2019-10-28 14:23:51.652204658,2854151,T,IEX,247.615000,100
2019-10-28 14:24:54.5270016,2019-10-28 14:24:54.5254228,2894025,T,IEX,247.575000,1000
2019-10-28 14:25:04.635145984,2019-10-28 14:25:04.635128442,2900764,T,IEX,247.550000,100
2019-10-28 14:25:41.873688064,2019-10-28 14:25:41.873668405,2923123,T,IEX,247.610000,100
2019-10-28 14:25:58.713103872,2019-10-28 14:25:58.713084308,2932431,T,IEX,247.680000,75
2019-10-28 14:26:04.760670976,2019-10-28 14:26:04.760651246,2936788,T,IEX,247.685000,189
2019-10-28 14:27:19.365285888,2019-10-28 14:27:19.365266047,2978734,T,IEX,247.270000,50
2019-10-28 14:27:47.294543872,2019-10-28 14:27:47.294526836,2993155,T,IEX,247.340000,75
2019-10-28 14:27:47.294685952,2019-10-28 14:27:47.294668643,2993157,T,IEX,247.340000,75
2019-10-28 14:27:47.295205888,2019-10-28 14:27:47.295190336,2993159,T,IEX,247.340000,50
2019-10-28 14:31:01.197336064,2019-10-28 14:31:01.197316551,3120664,T,IEX,247.630000,49
2019-10-28 14:31:05.67044096,2019-10-28 14:31:05.67023815,3123834,T,IEX,247.650000,43
2019-10-28 14:31:13.325818880,2019-10-28 14:31:13.325801405,3130921,T,IEX,247.660000,100
2019-10-28 14:31:43.158345984,2019-10-28 14:31:43.158330409,3151550,T,IEX,247.675000,100
2019-10-28 14:31:43.162962944,2019-10-28 14:31:43.162942093,3151553,T,IEX,247.710000,100
2019-10-28 14:31:44.726585088,2019-10-28 14:31:44.726564734,3152627,T,IEX,247.705000,105
2019-10-28 14:32:41.952521984,2019-10-28 14:32:41.952501434,3190716,T,IEX,247.885000,100
2019-10-28 14:32:58.844599040,2019-10-28 14:32:58.844580162,3202389,T,IEX,247.860000,100
2019-10-28 14:33:06.459471872,2019-10-28 14:33:06.459447438,3209138,T,IEX,247.860000,200
2019-10-28 14:33:07.510950912,2019-10-28 14:33:07.510931985,3210219,T,IEX,247.860000,200
2019-10-28 14:33:25.957210112,2019-10-28 14:33:25.957187417,3226008,T,IEX,247.890000,200
2019-10-28 14:33:33.388879104,2019-10-28 14:33:33.388861433,3230478,T,IEX,247.895000,100
2019-10-28 14:33:34.497571072,2019-10-28 14:33:34.497553546,3231416,T,IEX,247.895000,100
2019-10-28 14:33:37.177524992,2019-10-28 14:33:37.177505006,3233436,T,IEX,247.880000,1
2019-10-28 14:33:37.177537024,2019-10-28 14:33:37.177518269,3233437,T,IEX,247.880000,19
2019-10-28 14:33:37.177593088,2019-10-28 14:33:37.177575438,3233438,T,IEX,247.880000,80
2019-10-28 14:33:53.383931904,2019-10-28 14:33:53.383913176,3244515,T,IEX,247.830000,25
2019-10-28 14:33:53.384060928,2019-10-28 14:33:53.384043920,3244519,T,IEX,247.830000,25
2019-10-28 14:33:53.384262912,2019-10-28 14:33:53.384245187,3244525,T,IEX,247.830000,50
2019-10-28 14:33:53.384359936,2019-10-28 14:33:53.384339516,3244528,T,IEX,247.830000,100
2019-10-28 14:33:53.384477952,2019-10-28 14:33:53.384459883,3244533,T,IEX,247.820000,100
2019-10-28 14:33:53.384598016,2019-10-28 14:33:53.384577819,3244538,T,IEX,247.830000,100
2019-10-28 14:33:53.589904896,2019-10-28 14:33:53.589888716,3244938,T,IEX,247.870000,100
2019-10-28 14:34:03.170955008,2019-10-28 14:34:03.170933329,3251091,T,IEX,247.820000,100
2019-10-28 14:35:12.163866112,2019-10-28 14:35:12.163846684,3295565,T,IEX,247.560000,10
2019-10-28 14:35:15.899141120,2019-10-28 14:35:15.899123738,3297438,T,IEX,247.555000,100
2019-10-28 14:35:22.354640896,2019-10-28 14:35:22.354621063,3301106,T,IEX,247.550000,100
2019-10-28 14:37:16.643392000,2019-10-28 14:37:16.643371544,3371121,T,IEX,247.340000,100
2019-10-28 14:38:25.73158912,2019-10-28 14:38:25.73142205,3414522,T,IEX,247.470000,2
2019-10-28 14:39:31.728992000,2019-10-28 14:39:31.728971516,3477137,T,IEX,247.340000,19
2019-10-28 14:40:27.650608128,2019-10-28 14:40:27.650588392,3519750,T,IEX,247.340000,13
2019-10-28 14:40:27.651386112,2019-10-28 14:40:27.651369078,3519755,T,IEX,247.400000,100
2019-10-28 14:41:23.261041920,2019-10-28 14:41:23.261024250,3557002,T,IEX,247.370000,100
2019-10-28 14:42:09.502585088,2019-10-28 14:42:09.502568319,3590196,T,IEX,247.365000,100
2019-10-28 14:42:37.750984960,2019-10-28 14:42:37.750968495,3607929,T,IEX,247.375000,100
2019-10-28 14:42:46.947341056,2019-10-28 14:42:46.947321199,3613787,T,IEX,247.445000,2
2019-10-28 14:44:30.112008960,2019-10-28 14:44:30.111991831,3674851,T,IEX,247.455000,100
2019-10-28 14:45:06.946889984,2019-10-28 14:45:06.946868680,3696377,T,IEX,247.505000,200
2019-10-28 14:46:32.783429888,2019-10-28 14:46:32.783414484,3748894,T,IEX,247.505000,100
2019-10-28 14:48:19.416562944,2019-10-28 14:48:19.416546316,3805958,T,IEX,247.190000,100
2019-10-28 14:48:20.317766912,2019-10-28 14:48:20.317749554,3806299,T,IEX,247.230000,56
2019-10-28 14:48:20.317882112,2019-10-28 14:48:20.317864860,3806301,T,IEX,247.230000,44
2019-10-28 14:49:53.567395072,2019-10-28 14:49:53.567379182,3856807,T,IEX,247.245000,200
2019-10-28 14:49:53.575686912,2019-10-28 14:49:53.575670421,3856831,T,IEX,247.245000,200
2019-10-28 14:50:50.855888896,2019-10-28 14:50:50.855867374,3897604,T,IEX,247.185000,100
2019-10-28 14:52:10.779802112,2019-10-28 14:52:10.779784631,3942482,T,IEX,246.990000,100
2019-10-28 14:52:10.792220928,2019-10-28 14:52:10.792206133,3942491,T,IEX,246.970000,100
2019-10-28 14:52:10.793185024,2019-10-28 14:52:10.793168181,3942492,T,IEX,246.970000,1000
2019-10-28 14:52:13.440052992,2019-10-28 14:52:13.440031759,3944210,T,IEX,246.930000,100
2019-10-28 14:53:06.244857088,2019-10-28 14:53:06.244835232,3977184,T,IEX,246.900000,100
2019-10-28 14:53:06.265731072,2019-10-28 14:53:06.265710595,3977188,T,IEX,246.880000,100
2019-10-28 14:53:38.754966016,2019-10-28 14:53:38.754948081,3999237,T,IEX,246.820000,100
2019-10-28 14:53:53.571087872,2019-10-28 14:53:53.571066882,4006517,T,IEX,246.765000,100
2019-10-28 14:54:51.94892032,2019-10-28 14:54:51.94870597,4043849,T,IEX,246.705000,100
2019-10-28 14:55:03.75241984,2019-10-28 14:55:03.75222606,4050200,T,IEX,246.680000,100
2019-10-28 14:55:51.202265088,2019-10-28 14:55:51.202246623,4083269,T,IEX,246.660000,8
2019-10-28 14:55:51.202348032,2019-10-28 14:55:51.202330860,4083271,T,IEX,246.660000,74
2019-10-28 14:55:51.202386944,2019-10-28 14:55:51.202370566,4083272,T,IEX,246.660000,18
2019-10-28 14:55:57.792995072,2019-10-28 14:55:57.792971549,4087496,T,IEX,246.695000,100
2019-10-28 14:56:49.61893120,2019-10-28 14:56:49.61875510,4117256,T,IEX,246.640000,100
2019-10-28 14:57:11.683591936,2019-10-28 14:57:11.683569994,4129679,T,IEX,246.700000,75
2019-10-28 14:57:23.339056896,2019-10-28 14:57:23.339038300,4135848,T,IEX,246.705000,100
2019-10-28 14:57:24.20408064,2019-10-28 14:57:24.20389010,4136300,T,IEX,246.730000,100
2019-10-28 14:57:37.352954880,2019-10-28 14:57:37.352933928,4142907,T,IEX,246.685000,100
2019-10-28 14:58:14.145201920,2019-10-28 14:58:14.145183280,4159290,T,IEX,246.560000,100
2019-10-28 14:58:23.296830976,2019-10-28 14:58:23.296811567,4164497,T,IEX,246.560000,15
2019-10-28 14:58:51.253161984,2019-10-28 14:58:51.253142082,4178928,T,IEX,246.475000,100
2019-10-28 14:58:51.253175040,2019-10-28 14:58:51.253157364,4178929,T,IEX,246.475000,100
2019-10-28 14:59:28.10330880,2019-10-28 14:59:28.10315010,4196585,T,IEX,246.520000,5
2019-10-28 14:59:28.10343936,2019-10-28 14:59:28.10328862,4196586,T,IEX,246.550000,20
2019-10-28 14:59:51.24123904,2019-10-28 14:59:51.24105241,4207691,T,IEX,246.410000,100
2019-10-28 14:59:51.469626880,2019-10-28 14:59:51.469606439,4208158,T,IEX,246.410000,176
2019-10-28 15:00:12.845050880,2019-10-28 15:00:12.845031490,4226255,T,IEX,246.445000,23
2019-10-28 15:00:12.894384896,2019-10-28 15:00:12.894368768,4226426,T,IEX,246.495000,100
2019-10-28 15:01:00.85891072,2019-10-28 15:01:00.85872867,4258354,T,IEX,246.425000,100
2019-10-28 15:01:13.63312896,2019-10-28 15:01:13.63296836,4266879,T,IEX,246.355000,100
2019-10-28 15:01:36.790089984,2019-10-28 15:01:36.790070097,4284088,T,IEX,246.220000,100
2019-10-28 15:02:06.493213952,2019-10-28 15:02:06.493197272,4302936,T,IEX,246.240000,2
2019-10-28 15:02:06.494023936,2019-10-28 15:02:06.494005664,4302962,T,IEX,246.240000,100
2019-10-28 15:02:21.626699008,2019-10-28 15:02:21.626677406,4312209,T,IEX,246.210000,100
2019-10-28 15:02:22.97372928,2019-10-28 15:02:22.97352993,4313054,T,IEX,246.130000,100
2019-10-28 15:03:11.434739968,2019-10-28 15:03:11.434722318,4341049,T,IEX,246.190000,100
2019-10-28 15:03:45.824577024,2019-10-28 15:03:45.824559150,4359164,T,IEX,246.280000,100
2019-10-28 15:04:02.133421056,2019-10-28 15:04:02.133402166,4369566,T,IEX,246.160000,100
2019-10-28 15:04:17.559502080,2019-10-28 15:04:17.559483861,4377910,T,IEX,246.150000,12
2019-10-28 15:04:49.418714880,2019-10-28 15:04:49.418694694,4395542,T,IEX,246.160000,100
2019-10-28 15:05:12.395289088,2019-10-28 15:05:12.395272345,4410410,T,IEX,246.080000,100
2019-10-28 15:05:40.703495936,2019-10-28 15:05:40.703475773,4427897,T,IEX,246.110000,100
2019-10-28 15:05:42.107386112,2019-10-28 15:05:42.107365769,4428549,T,IEX,246.150000,11
2019-10-28 15:05:58.38415872,2019-10-28 15:05:58.38399224,4439640,T,IEX,246.070000,100
2019-10-28 15:06:52.778244096,2019-10-28 15:06:52.778223583,4479421,T,IEX,246.070000,100
2019-10-28 15:07:07.112709120,2019-10-28 15:07:07.112687481,4488697,T,IEX,246.065000,100
2019-10-28 15:07:15.99424000,2019-10-28 15:07:15.99406838,4494852,T,IEX,246.130000,100
2019-10-28 15:07:45.578646016,2019-10-28 15:07:45.578626718,4510941,T,IEX,246.200000,100
2019-10-28 15:07:47.212444928,2019-10-28 15:07:47.212426063,4511916,T,IEX,246.235000,155
2019-10-28 15:07:49.728019968,2019-10-28 15:07:49.728001823,4513265,T,IEX,246.235000,100
2019-10-28 15:08:19.348007936,2019-10-28 15:08:19.347984556,4529993,T,IEX,246.250000,30
2019-10-28 15:08:44.32830976,2019-10-28 15:08:44.32811701,4543815,T,IEX,246.265000,100
2019-10-28 15:08:44.32855040,2019-10-28 15:08:44.32838294,4543816,T,IEX,246.265000,100
2019-10-28 15:09:18.958475008,2019-10-28 15:09:18.958455191,4566350,T,IEX,246.220000,100
2019-10-28 15:09:18.958738944,2019-10-28 15:09:18.958714319,4566363,T,IEX,246.240000,100
2019-10-28 15:10:12.234534912,2019-10-28 15:10:12.234518164,4594617,T,IEX,246.190000,100
2019-10-28 15:10:30.886777088,2019-10-28 15:10:30.886755096,4605736,T,IEX,246.195000,100
2019-10-28 15:11:16.996755968,2019-10-28 15:11:16.996737505,4629223,T,IEX,246.260000,100
2019-10-28 15:11:30.503942912,2019-10-28 15:11:30.503922139,4639862,T,IEX,246.340000,100
2019-10-28 15:11:30.504931072,2019-10-28 15:11:30.504911595,4639899,T,IEX,246.360000,100
2019-10-28 15:12:17.328785920,2019-10-28 15:12:17.328764970,4663586,T,IEX,246.640000,200
2019-10-28 15:14:17.617513984,2019-10-28 15:14:17.617492437,4724304,T,IEX,246.455000,124
2019-10-28 15:14:50.197899008,2019-10-28 15:14:50.197879910,4739246,T,IEX,246.450000,100
2019-10-28 15:14:50.198545920,2019-10-28 15:14:50.198527518,4739269,T,IEX,246.440000,100
2019-10-28 15:15:00.92992000,2019-10-28 15:15:00.92974959,4744552,T,IEX,246.400000,100
2019-10-28 15:15:09.555812096,2019-10-28 15:15:09.555789993,4756420,T,IEX,246.410000,200
2019-10-28 15:15:25.518172928,2019-10-28 15:15:25.518153349,4768817,T,IEX,246.430000,100
2019-10-28 15:15:27.862393088,2019-10-28 15:15:27.862374535,4770377,T,IEX,246.430000,100
2019-10-28 15:15:27.864717056,2019-10-28 15:15:27.864700637,4770379,T,IEX,246.460000,113
2019-10-28 15:15:42.45401088,2019-10-28 15:15:42.45382886,4780297,T,IEX,246.445000,200
2019-10-28 15:15:42.152593920,2019-10-28 15:15:42.152574087,4780355,T,IEX,246.470000,100
2019-10-28 15:17:09.454299904,2019-10-28 15:17:09.454283566,4827835,T,IEX,246.650000,100
2019-10-28 15:17:25.197754880,2019-10-28 15:17:25.197733668,4836256,T,IEX,246.600000,1
2019-10-28 15:18:03.607431936,2019-10-28 15:18:03.607414147,4854325,T,IEX,246.660000,200
2019-10-28 15:18:21.999484928,2019-10-28 15:18:21.999470355,4865581,T,IEX,246.770000,100
2019-10-28 15:18:23.292401920,2019-10-28 15:18:23.292381385,4866470,T,IEX,246.815000,100
2019-10-28 15:19:01.728634112,2019-10-28 15:19:01.728614601,4884101,T,IEX,246.730000,75
2019-10-28 15:19:01.728751104,2019-10-28 15:19:01.728733268,4884103,T,IEX,246.730000,25
2019-10-28 15:19:45.670533888,2019-10-28 15:19:45.670515490,4906891,T,IEX,246.720000,24
2019-10-28 15:19:45.670723072,2019-10-28 15:19:45.670702784,4906893,T,IEX,246.720000,100
2019-10-28 15:19:45.670853888,2019-10-28 15:19:45.670837105,4906895,T,IEX,246.720000,75
2019-10-28 15:19:45.670893056,2019-10-28 15:19:45.670873140,4906896,T,IEX,246.720000,1
2019-10-28 15:19:45.671564032,2019-10-28 15:19:45.671547051,4906901,T,IEX,246.730000,75
2019-10-28 15:19:45.671761920,2019-10-28 15:19:45.671745282,4906903,T,IEX,246.730000,125
2019-10-28 15:22:20.101410048,2019-10-28 15:22:20.101388249,4979131,T,IEX,246.970000,100
2019-10-28 15:24:03.693227008,2019-10-28 15:24:03.693209672,5033800,T,IEX,247.140000,200
2019-10-28 15:25:23.494985984,2019-10-28 15:25:23.494968750,5073323,T,IEX,247.315000,2
2019-10-28 15:25:27.757327872,2019-10-28 15:25:27.757309312,5075733,T,IEX,247.350000,96
2019-10-28 15:25:28.556121088,2019-10-28 15:25:28.556104203,5076056,T,IEX,247.350000,100
2019-10-28 15:25:38.12331008,2019-10-28 15:25:38.12310457,5080737,T,IEX,247.360000,100
2019-10-28 15:25:49.104663040,2019-10-28 15:25:49.104643316,5085547,T,IEX,247.320000,100
2019-10-28 15:25:49.681748992,2019-10-28 15:25:49.681729547,5086365,T,IEX,247.270000,1
2019-10-28 15:26:15.144304896,2019-10-28 15:26:15.144288195,5098237,T,IEX,247.225000,13
2019-10-28 15:26:15.144325888,2019-10-28 15:26:15.144303588,5098239,T,IEX,247.225000,187
2019-10-28 15:27:11.330973952,2019-10-28 15:27:11.330953424,5124321,T,IEX,247.110000,200
2019-10-28 15:27:22.673651968,2019-10-28 15:27:22.673634523,5128388,T,IEX,247.120000,100
2019-10-28 15:27:25.824002048,2019-10-28 15:27:25.823980796,5129364,T,IEX,247.050000,4
2019-10-28 15:27:25.824013056,2019-10-28 15:27:25.823994359,5129365,T,IEX,247.050000,96
2019-10-28 15:27:25.825000960,2019-10-28 15:27:25.824981735,5129366,T,IEX,247.050000,4
2019-10-28 15:27:25.825010944,2019-10-28 15:27:25.824993595,5129367,T,IEX,247.050000,303
2019-10-28 15:27:25.825987072,2019-10-28 15:27:25.825967523,5129368,T,IEX,247.050000,697
2019-10-28 15:27:25.826002944,2019-10-28 15:27:25.825985683,5129369,T,IEX,247.050000,595
2019-10-28 15:27:40.419454976,2019-10-28 15:27:40.419435254,5134189,T,IEX,247.055000,200
2019-10-28 15:27:43.106648064,2019-10-28 15:27:43.106626925,5134907,T,IEX,247.100000,1
2019-10-28 15:27:43.459731968,2019-10-28 15:27:43.459714422,5134986,T,IEX,247.160000,100
2019-10-28 15:27:43.460698880,2019-10-28 15:27:43.460683466,5134987,T,IEX,247.160000,100
2019-10-28 15:27:43.470775040,2019-10-28 15:27:43.470757154,5135003,T,IEX,247.220000,100
2019-10-28 15:27:45.947831040,2019-10-28 15:27:45.947810736,5135961,T,IEX,247.220000,100
2019-10-28 15:27:52.101121024,2019-10-28 15:27:52.101103113,5138213,T,IEX,247.235000,100
2019-10-28 15:27:52.102344960,2019-10-28 15:27:52.102326045,5138214,T,IEX,247.270000,100
2019-10-28 15:27:52.114429952,2019-10-28 15:27:52.114410776,5138219,T,IEX,247.280000,100
2019-10-28 15:27:52.127159040,2019-10-28 15:27:52.127141874,5138223,T,IEX,247.280000,100
2019-10-28 15:27:53.800244992,2019-10-28 15:27:53.800225105,5138724,T,IEX,247.440000,80
2019-10-28 15:27:59.724616960,2019-10-28 15:27:59.724601210,5141011,T,IEX,247.350000,100
2019-10-28 15:28:05.514875904,2019-10-28 15:28:05.514858524,5143105,T,IEX,247.480000,100
2019-10-28 15:28:08.809061120,2019-10-28 15:28:08.809040330,5144453,T,IEX,247.390000,100
2019-10-28 15:28:09.709500928,2019-10-28 15:28:09.709484243,5144782,T,IEX,247.250000,100
2019-10-28 15:28:09.710457088,2019-10-28 15:28:09.710437950,5144783,T,IEX,247.250000,100
2019-10-28 15:28:09.716171008,2019-10-28 15:28:09.716144788,5144785,T,IEX,247.210000,100
2019-10-28 15:28:09.717104896,2019-10-28 15:28:09.717085100,5144786,T,IEX,247.210000,100
2019-10-28 15:28:25.667908096,2019-10-28 15:28:25.667887897,5150372,T,IEX,247.090000,1
2019-10-28 15:28:25.667932928,2019-10-28 15:28:25.667915280,5150373,T,IEX,247.090000,1899
2019-10-28 15:28:25.669315072,2019-10-28 15:28:25.669297744,5150374,T,IEX,247.090000,601
2019-10-28 15:28:45.906961920,2019-10-28 15:28:45.906941788,5161862,T,IEX,247.120000,400
2019-10-28 15:30:07.272869888,2019-10-28 15:30:07.272849383,5199768,T,IEX,247.390000,1
2019-10-28 15:30:46.141263104,2019-10-28 15:30:46.141247312,5223388,T,IEX,247.440000,100
2019-10-28 15:36:37.777351936,2019-10-28 15:36:37.777336271,5421571,T,IEX,248.000000,100
2019-10-28 15:36:41.881111040,2019-10-28 15:36:41.881089146,5423733,T,IEX,248.000000,1
2019-10-28 15:37:59.188278016,2019-10-28 15:37:59.188256612,5470947,T,IEX,247.890000,1
2019-10-28 15:37:59.193320960,2019-10-28 15:37:59.193303880,5470952,T,IEX,247.870000,1
2019-10-28 15:37:59.194120960,2019-10-28 15:37:59.194103387,5470953,T,IEX,247.870000,1
2019-10-28 15:40:33.293289984,2019-10-28 15:40:33.293274113,5560050,T,IEX,247.820000,100
2019-10-28 15:42:01.151997952,2019-10-28 15:42:01.151974564,5600880,T,IEX,247.920000,100
2019-10-28 15:44:07.764997888,2019-10-28 15:44:07.764978617,5666780,T,IEX,248.015000,8
2019-10-28 15:44:07.765021952,2019-10-28 15:44:07.765005391,5666781,T,IEX,248.015000,100
2019-10-28 15:45:57.253324032,2019-10-28 15:45:57.253303227,5738104,T,IEX,248.050000,100
2019-10-28 15:47:29.175098880,2019-10-28 15:47:29.175082789,5798836,T,IEX,247.970000,100
2019-10-28 15:48:53.443511040,2019-10-28 15:48:53.443495324,5839380,T,IEX,248.105000,300
2019-10-28 15:48:53.465830912,2019-10-28 15:48:53.465812316,5839401,T,IEX,248.105000,300
2019-10-28 15:49:14.466231040,2019-10-28 15:49:14.466212494,5850622,T,IEX,248.125000,100
2019-10-28 15:49:55.898514944,2019-10-28 15:49:55.898495168,5869845,T,IEX,248.090000,100
2019-10-28 15:50:03.210715904,2019-10-28 15:50:03.210695323,5874402,T,IEX,248.100000,300
2019-10-28 15:50:25.662801920,2019-10-28 15:50:25.662783233,5885433,T,IEX,248.160000,300
2019-10-28 15:50:26.382137088,2019-10-28 15:50:26.382117206,5885879,T,IEX,248.165000,110
2019-10-28 15:50:46.576295936,2019-10-28 15:50:46.576279946,5894265,T,IEX,248.145000,117
2019-10-28 15:51:02.552124928,2019-10-28 15:51:02.552106753,5902614,T,IEX,248.090000,100
2019-10-28 15:51:02.666573056,2019-10-28 15:51:02.666551985,5902682,T,IEX,248.115000,137
2019-10-28 15:51:02.676278016,2019-10-28 15:51:02.676258230,5902688,T,IEX,248.115000,238
2019-10-28 15:51:03.685385984,2019-10-28 15:51:03.685367134,5903142,T,IEX,248.130000,200
2019-10-28 15:51:03.694041088,2019-10-28 15:51:03.694018946,5903150,T,IEX,248.110000,200
2019-10-28 15:51:03.843496960,2019-10-28 15:51:03.843476461,5903432,T,IEX,248.180000,200
2019-10-28 15:51:03.896749056,2019-10-28 15:51:03.896727931,5903474,T,IEX,248.180000,100
2019-10-28 15:51:03.919664896,2019-10-28 15:51:03.919647747,5903489,T,IEX,248.190000,200
2019-10-28 15:51:05.49017088,2019-10-28 15:51:05.49000299,5904015,T,IEX,248.245000,100
2019-10-28 15:52:47.473366016,2019-10-28 15:52:47.473346070,5957459,T,IEX,248.090000,600
2019-10-28 15:52:47.473388032,2019-10-28 15:52:47.473370645,5957460,T,IEX,248.090000,100
2019-10-28 15:52:47.481875968,2019-10-28 15:52:47.481856179,5957462,T,IEX,248.090000,400
2019-10-28 15:54:22.423343104,2019-10-28 15:54:22.423322610,6016778,T,IEX,247.695000,300
2019-10-28 15:54:32.800312064,2019-10-28 15:54:32.800293304,6022044,T,IEX,247.645000,100
2019-10-28 15:54:37.332557056,2019-10-28 15:54:37.332537177,6024353,T,IEX,247.605000,100
2019-10-28 15:54:40.300077056,2019-10-28 15:54:40.300055968,6025950,T,IEX,247.570000,100
2019-10-28 15:55:27.661721088,2019-10-28 15:55:27.661700284,6051872,T,IEX,247.230000,2
2019-10-28 15:55:31.192898048,2019-10-28 15:55:31.192878436,6055032,T,IEX,247.230000,2
2019-10-28 15:55:33.450364928,2019-10-28 15:55:33.450348363,6055841,T,IEX,247.230000,9
2019-10-28 15:55:42.189768960,2019-10-28 15:55:42.189750779,6060818,T,IEX,247.230000,100
2019-10-28 15:55:56.91000064,2019-10-28 15:55:56.90980987,6068332,T,IEX,247.330000,100
2019-10-28 15:55:56.580233984,2019-10-28 15:55:56.580216921,6068845,T,IEX,247.330000,200
2019-10-28 15:55:56.596307968,2019-10-28 15:55:56.596287176,6068857,T,IEX,247.355000,200
2019-10-28 15:55:56.610114048,2019-10-28 15:55:56.610095086,6068864,T,IEX,247.340000,200
2019-10-28 15:56:08.519822080,2019-10-28 15:56:08.519799384,6075522,T,IEX,247.370000,100
2019-10-28 15:59:38.302604032,2019-10-28 15:59:38.302585347,6177827,T,IEX,247.335000,100
2019-10-28 16:00:51.839416064,2019-10-28 16:00:51.839394927,6217961,T,IEX,247.430000,2
2019-10-28 16:00:57.927246080,2019-10-28 16:00:57.927226226,6219911,T,IEX,247.430000,100
2019-10-28 16:00:57.928236032,2019-10-28 16:00:57.928219230,6219913,T,IEX,247.430000,300
2019-10-28 16:01:02.848545024,2019-10-28 16:01:02.848525266,6223185,T,IEX,247.430000,200
2019-10-28 16:01:49.929779968,2019-10-28 16:01:49.929760777,6249358,T,IEX,247.590000,100
2019-10-28 16:01:49.930777088,2019-10-28 16:01:49.930758566,6249361,T,IEX,247.590000,200
2019-10-28 16:01:49.930800128,2019-10-28 16:01:49.930783349,6249362,T,IEX,247.590000,100
2019-10-28 16:02:19.419432960,2019-10-28 16:02:19.419410247,6269390,T,IEX,247.570000,100
2019-10-28 16:02:19.424762880,2019-10-28 16:02:19.424744829,6269394,T,IEX,247.570000,200
2019-10-28 16:02:23.910563072,2019-10-28 16:02:23.910547494,6271733,T,IEX,247.510000,100
2019-10-28 16:02:23.910595072,2019-10-28 16:02:23.910576471,6271734,T,IEX,247.510000,100
2019-10-28 16:02:38.655697920,2019-10-28 16:02:38.655676808,6278012,T,IEX,247.490000,4
2019-10-28 16:02:39.109654016,2019-10-28 16:02:39.109632940,6278262,T,IEX,247.530000,100
2019-10-28 16:03:04.935702016,2019-10-28 16:03:04.935682632,6290748,T,IEX,247.565000,100
2019-10-28 16:03:04.940450048,2019-10-28 16:03:04.940431007,6290749,T,IEX,247.565000,200
2019-10-28 16:03:15.653195008,2019-10-28 16:03:15.653178228,6298618,T,IEX,247.595000,200
2019-10-28 16:03:24.853740032,2019-10-28 16:03:24.853718495,6303897,T,IEX,247.595000,100
2019-10-28 16:03:37.30350080,2019-10-28 16:03:37.30333826,6309520,T,IEX,247.530000,100
2019-10-28 16:03:37.30372096,2019-10-28 16:03:37.30354500,6309521,T,IEX,247.530000,100
2019-10-28 16:04:02.26767104,2019-10-28 16:04:02.26747524,6320641,T,IEX,247.480000,100
2019-10-28 16:04:02.31968000,2019-10-28 16:04:02.31946293,6320647,T,IEX,247.480000,200
2019-10-28 16:04:11.218222080,2019-10-28 16:04:11.218202655,6324812,T,IEX,247.565000,46
2019-10-28 16:04:11.218233088,2019-10-28 16:04:11.218215665,6324813,T,IEX,247.590000,17
2019-10-28 16:04:30.507793920,2019-10-28 16:04:30.507774333,6332993,T,IEX,247.565000,200
2019-10-28 16:04:36.894213888,2019-10-28 16:04:36.894196500,6335021,T,IEX,247.565000,100
2019-10-28 16:05:01.942085120,2019-10-28 16:05:01.942064033,6344833,T,IEX,247.575000,100
2019-10-28 16:05:01.947678976,2019-10-28 16:05:01.947657228,6344841,T,IEX,247.575000,100
2019-10-28 16:05:04.203841024,2019-10-28 16:05:04.203824207,6346080,T,IEX,247.575000,100
2019-10-28 16:08:51.320774912,2019-10-28 16:08:51.320758221,6450525,T,IEX,247.440000,9
2019-10-28 16:08:51.320794112,2019-10-28 16:08:51.320778380,6450526,T,IEX,247.450000,58
2019-10-28 16:08:52.777551104,2019-10-28 16:08:52.777530875,6450916,T,IEX,247.450000,18
2019-10-28 16:11:17.790116096,2019-10-28 16:11:17.790094583,6515382,T,IEX,247.340000,200
2019-10-28 16:11:20.844410880,2019-10-28 16:11:20.844388918,6516350,T,IEX,247.340000,200
2019-10-28 16:11:25.4551936,2019-10-28 16:11:25.4530583,6518589,T,IEX,247.315000,200
2019-10-28 16:11:31.82054912,2019-10-28 16:11:31.82037442,6520969,T,IEX,247.315000,200
2019-10-28 16:11:40.55342080,2019-10-28 16:11:40.55323086,6524348,T,IEX,247.325000,200
2019-10-28 16:11:44.681825024,2019-10-28 16:11:44.681803977,6526388,T,IEX,247.325000,200
2019-10-28 16:11:48.845049088,2019-10-28 16:11:48.845027283,6528600,T,IEX,247.320000,200
2019-10-28 16:11:52.984311040,2019-10-28 16:11:52.984290125,6529895,T,IEX,247.320000,200
2019-10-28 16:11:55.405445888,2019-10-28 16:11:55.405424880,6531101,T,IEX,247.320000,200
2019-10-28 16:12:14.886658048,2019-10-28 16:12:14.886641499,6540220,T,IEX,247.335000,200
2019-10-28 16:13:26.760354048,2019-10-28 16:13:26.760334324,6572137,T,IEX,247.130000,100
2019-10-28 16:13:30.653199104,2019-10-28 16:13:30.653178514,6573903,T,IEX,247.135000,1100
2019-10-28 16:13:45.75904000,2019-10-28 16:13:45.75884692,6580230,T,IEX,247.130000,100
2019-10-28 16:13:45.111331072,2019-10-28 16:13:45.111315994,6580554,T,IEX,247.175000,50
2019-10-28 16:14:01.367766016,2019-10-28 16:14:01.367744646,6588273,T,IEX,247.140000,200
2019-10-28 16:15:10.502809088,2019-10-28 16:15:10.502788943,6622827,T,IEX,247.150000,100
2019-10-28 16:15:55.512999936,2019-10-28 16:15:55.512981929,6640395,T,IEX,246.975000,100
2019-10-28 16:16:08.401875968,2019-10-28 16:16:08.401858455,6648285,T,IEX,246.945000,100
2019-10-28 16:16:10.697593088,2019-10-28 16:16:10.697577288,6650100,T,IEX,246.970000,500
2019-10-28 16:16:10.698691072,2019-10-28 16:16:10.698674399,6650102,T,IEX,246.970000,1600
2019-10-28 16:17:09.768368128,2019-10-28 16:17:09.768346986,6677054,T,IEX,246.885000,100
2019-10-28 16:17:41.768259072,2019-10-28 16:17:41.768236561,6690679,T,IEX,246.830000,100
2019-10-28 16:17:41.769239040,2019-10-28 16:17:41.769219339,6690680,T,IEX,246.830000,900
2019-10-28 16:17:43.390105088,2019-10-28 16:17:43.390086118,6691547,T,IEX,246.850000,2
2019-10-28 16:18:07.691675904,2019-10-28 16:18:07.691658412,6702462,T,IEX,246.840000,46
2019-10-28 16:18:07.691739904,2019-10-28 16:18:07.691721309,6702464,T,IEX,246.840000,46
2019-10-28 16:18:07.691876096,2019-10-28 16:18:07.691859858,6702466,T,IEX,246.840000,8
2019-10-28 16:18:15.755906048,2019-10-28 16:18:15.755883865,6706783,T,IEX,246.790000,1000
2019-10-28 16:18:15.756944896,2019-10-28 16:18:15.756925161,6706785,T,IEX,246.790000,700
2019-10-28 16:19:09.13651968,2019-10-28 16:19:09.13636913,6727786,T,IEX,246.825000,100
2019-10-28 16:20:15.605325056,2019-10-28 16:20:15.605305801,6761626,T,IEX,247.020000,1
2019-10-28 16:20:31.561658880,2019-10-28 16:20:31.561631998,6766880,T,IEX,246.980000,75
2019-10-28 16:20:31.561790976,2019-10-28 16:20:31.561767547,6766888,T,IEX,246.980000,25
2019-10-28 16:20:59.78138112,2019-10-28 16:20:59.78120562,6777744,T,IEX,246.990000,100
2019-10-28 16:21:22.254708992,2019-10-28 16:21:22.254684423,6786257,T,IEX,246.965000,100
2019-10-28 16:21:26.54280960,2019-10-28 16:21:26.54261961,6788696,T,IEX,246.965000,200
2019-10-28 16:21:26.778850048,2019-10-28 16:21:26.778830006,6788963,T,IEX,246.970000,200
2019-10-28 16:21:40.818095104,2019-10-28 16:21:40.818076985,6794613,T,IEX,246.850000,15
2019-10-28 16:21:48.779249920,2019-10-28 16:21:48.779229807,6797066,T,IEX,246.905000,500
2019-10-28 16:22:18.408189952,2019-10-28 16:22:18.408171730,6811388,T,IEX,246.720000,600
2019-10-28 16:22:50.501190912,2019-10-28 16:22:50.501173478,6824158,T,IEX,246.800000,30
2019-10-28 16:22:50.501252096,2019-10-28 16:22:50.501235983,6824160,T,IEX,246.800000,70
2019-10-28 16:23:00.75761920,2019-10-28 16:23:00.75744455,6828648,T,IEX,246.815000,100
2019-10-28 16:23:45.28108032,2019-10-28 16:23:45.28091379,6847441,T,IEX,246.850000,100
2019-10-28 16:24:22.625786112,2019-10-28 16:24:22.625766691,6864449,T,IEX,246.880000,200
2019-10-28 16:24:22.632574976,2019-10-28 16:24:22.632554962,6864451,T,IEX,246.870000,100
2019-10-28 16:24:22.634179072,2019-10-28 16:24:22.634158768,6864452,T,IEX,246.870000,300
2019-10-28 16:24:38.607465984,2019-10-28 16:24:38.607445386,6870608,T,IEX,246.990000,100
2019-10-28 16:24:38.607490048,2019-10-28 16:24:38.607473235,6870609,T,IEX,246.990000,500
2019-10-28 16:24:53.525360896,2019-10-28 16:24:53.525342742,6876822,T,IEX,247.000000,75
2019-10-28 16:24:53.526610944,2019-10-28 16:24:53.526590229,6876871,T,IEX,247.000000,25
2019-10-28 16:25:10.224758016,2019-10-28 16:25:10.224737194,6888260,T,IEX,247.050000,100
2019-10-28 16:25:24.430823936,2019-10-28 16:25:24.430803472,6895893,T,IEX,247.075000,1
2019-10-28 16:25:24.430840064,2019-10-28 16:25:24.430823314,6895894,T,IEX,247.090000,74
2019-10-28 16:25:25.225113088,2019-10-28 16:25:25.225092790,6896239,T,IEX,247.100000,26
2019-10-28 16:26:20.948338944,2019-10-28 16:26:20.948319569,6917252,T,IEX,247.100000,300
2019-10-28 16:26:32.602204928,2019-10-28 16:26:32.602188383,6922709,T,IEX,247.120000,100
2019-10-28 16:26:32.613765120,2019-10-28 16:26:32.613746150,6922711,T,IEX,247.190000,100
2019-10-28 16:26:32.620512000,2019-10-28 16:26:32.620493213,6922716,T,IEX,247.230000,100
2019-10-28 16:29:10.803122944,2019-10-28 16:29:10.803101401,6997122,T,IEX,247.550000,100
2019-10-28 16:30:44.609798912,2019-10-28 16:30:44.609779142,7058704,T,IEX,247.350000,3
2019-10-28 16:33:23.441367040,2019-10-28 16:33:23.441346137,7130679,T,IEX,247.150000,25
2019-10-28 16:33:58.626732032,2019-10-28 16:33:58.626711270,7144172,T,IEX,247.000000,50
2019-10-28 16:33:58.641152000,2019-10-28 16:33:58.641132437,7144177,T,IEX,246.990000,25
2019-10-28 16:38:14.155417088,2019-10-28 16:38:14.155400713,7254426,T,IEX,246.870000,100
2019-10-28 16:40:06.452655104,2019-10-28 16:40:06.452636027,7287943,T,IEX,246.945000,100
2019-10-28 16:40:06.458893056,2019-10-28 16:40:06.458876290,7287950,T,IEX,246.945000,200
2019-10-28 16:43:02.302735872,2019-10-28 16:43:02.302715143,7349069,T,IEX,246.950000,100
2019-10-28 16:45:08.714198016,2019-10-28 16:45:08.714177147,7389167,T,IEX,246.875000,100
2019-10-28 16:45:38.714900992,2019-10-28 16:45:38.714809254,7399421,T,IEX,246.885000,100
2019-10-28 16:45:38.716721920,2019-10-28 16:45:38.716703196,7399424,T,IEX,246.885000,100
2019-10-28 16:45:38.718298112,2019-10-28 16:45:38.718276645,7399425,T,IEX,246.885000,100
2019-10-28 16:45:38.719613952,2019-10-28 16:45:38.719597225,7399427,T,IEX,246.885000,100
2019-10-28 16:45:38.721481984,2019-10-28 16:45:38.721460785,7399428,T,IEX,246.885000,100
2019-10-28 16:45:38.722745088,2019-10-28 16:45:38.722725180,7399429,T,IEX,246.885000,100
2019-10-28 16:45:38.724577024,2019-10-28 16:45:38.724556564,7399430,T,IEX,246.885000,100
2019-10-28 16:45:38.725797120,2019-10-28 16:45:38.725778890,7399432,T,IEX,246.885000,100
2019-10-28 16:45:38.726976000,2019-10-28 16:45:38.726957348,7399434,T,IEX,246.885000,100
2019-10-28 16:45:38.728100096,2019-10-28 16:45:38.728082489,7399435,T,IEX,246.885000,100
2019-10-28 16:47:03.446665984,2019-10-28 16:47:03.446646101,7427891,T,IEX,246.980000,1
2019-10-28 16:47:26.253873920,2019-10-28 16:47:26.253856384,7434327,T,IEX,246.970000,30
2019-10-28 16:50:21.170071040,2019-10-28 16:50:21.170051275,7499566,T,IEX,246.740000,66
2019-10-28 16:52:33.247757056,2019-10-28 16:52:33.247739420,7546154,T,IEX,246.735000,200
2019-10-28 16:53:27.318630912,2019-10-28 16:53:27.318610533,7566217,T,IEX,246.550000,100
2019-10-28 16:54:11.282212096,2019-10-28 16:54:11.282192622,7584381,T,IEX,246.455000,100
2019-10-28 16:55:13.4563968,2019-10-28 16:55:13.4543005,7605866,T,IEX,246.400000,13
2019-10-28 16:55:13.5390080,2019-10-28 16:55:13.5369817,7605868,T,IEX,246.400000,75
2019-10-28 16:55:15.377584128,2019-10-28 16:55:15.377563822,7606563,T,IEX,246.400000,5
2019-10-28 16:56:02.36023040,2019-10-28 16:56:02.36001234,7622391,T,IEX,246.315000,100
2019-10-28 17:00:26.463456000,2019-10-28 17:00:26.463435538,7717457,T,IEX,246.405000,137
2019-10-28 17:00:35.171938048,2019-10-28 17:00:35.171920216,7720129,T,IEX,246.410000,463
2019-10-28 17:01:11.534700032,2019-10-28 17:01:11.534680507,7733973,T,IEX,246.580000,100
2019-10-28 17:01:11.610888960,2019-10-28 17:01:11.610869908,7733997,T,IEX,246.570000,100
2019-10-28 17:01:30.480700928,2019-10-28 17:01:30.480680251,7740619,T,IEX,246.605000,100
2019-10-28 17:01:30.979422976,2019-10-28 17:01:30.979407079,7740724,T,IEX,246.605000,100
2019-10-28 17:01:54.48035072,2019-10-28 17:01:54.48012443,7748651,T,IEX,246.740000,111
2019-10-28 17:02:07.429721088,2019-10-28 17:02:07.429696444,7752937,T,IEX,246.700000,200
2019-10-28 17:02:36.251361024,2019-10-28 17:02:36.251342980,7761976,T,IEX,246.790000,15
2019-10-28 17:03:47.135202048,2019-10-28 17:03:47.135182545,7788005,T,IEX,246.690000,3
2019-10-28 17:03:49.524491008,2019-10-28 17:03:49.524470941,7788765,T,IEX,246.700000,100
2019-10-28 17:05:09.680742912,2019-10-28 17:05:09.680724675,7815154,T,IEX,246.565000,100
2019-10-28 17:05:10.915627008,2019-10-28 17:05:10.915604802,7816329,T,IEX,246.540000,100
2019-10-28 17:07:57.82710016,2019-10-28 17:07:57.82689201,7874900,T,IEX,246.670000,50
2019-10-28 17:07:57.82968064,2019-10-28 17:07:57.82948735,7874902,T,IEX,246.670000,50
2019-10-28 17:07:57.83188992,2019-10-28 17:07:57.83172034,7874904,T,IEX,246.670000,75
2019-10-28 17:07:58.781097984,2019-10-28 17:07:58.781077328,7875336,T,IEX,246.660000,75
2019-10-28 17:07:59.363628032,2019-10-28 17:07:59.363611735,7875481,T,IEX,246.625000,100
2019-10-28 17:08:46.247213056,2019-10-28 17:08:46.247195546,7892205,T,IEX,246.530000,28
2019-10-28 17:09:12.523814912,2019-10-28 17:09:12.523794400,7899701,T,IEX,246.470000,2
2019-10-28 17:09:56.452958976,2019-10-28 17:09:56.452937657,7911074,T,IEX,246.505000,300
2019-10-28 17:10:46.243557888,2019-10-28 17:10:46.243540023,7933054,T,IEX,246.470000,100
2019-10-28 17:11:21.30985984,2019-10-28 17:11:21.30968643,7945462,T,IEX,246.525000,1100
2019-10-28 17:11:21.512573952,2019-10-28 17:11:21.512551783,7945559,T,IEX,246.525000,300
2019-10-28 17:11:33.531012096,2019-10-28 17:11:33.530994683,7950088,T,IEX,246.550000,1
2019-10-28 17:12:10.474871040,2019-10-28 17:12:10.474850356,7959743,T,IEX,246.565000,100
2019-10-28 17:12:26.728762112,2019-10-28 17:12:26.728742694,7964800,T,IEX,246.565000,104
2019-10-28 17:13:07.569929984,2019-10-28 17:13:07.569908409,7978341,T,IEX,246.505000,300
2019-10-28 17:13:13.850462976,2019-10-28 17:13:13.850447739,7981476,T,IEX,246.490000,100
2019-10-28 17:13:13.850491904,2019-10-28 17:13:13.850477020,7981477,T,IEX,246.490000,100
2019-10-28 17:14:45.557696000,2019-10-28 17:14:45.557679310,8014177,T,IEX,246.670000,100
2019-10-28 17:14:58.591140096,2019-10-28 17:14:58.591120786,8018882,T,IEX,246.640000,33
2019-10-28 17:14:58.591316992,2019-10-28 17:14:58.591299549,8018884,T,IEX,246.640000,67
2019-10-28 17:15:14.662647040,2019-10-28 17:15:14.662627331,8023799,T,IEX,246.635000,300
2019-10-28 17:15:17.623079936,2019-10-28 17:15:17.623059250,8024693,T,IEX,246.680000,75
2019-10-28 17:15:50.324462080,2019-10-28 17:15:50.324441521,8034369,T,IEX,246.650000,100
2019-10-28 17:16:16.700045056,2019-10-28 17:16:16.700023793,8042928,T,IEX,246.640000,100
2019-10-28 17:16:26.393062912,2019-10-28 17:16:26.393044378,8047321,T,IEX,246.665000,100
2019-10-28 17:17:05.405147904,2019-10-28 17:17:05.405127221,8060920,T,IEX,246.610000,100
2019-10-28 17:17:32.77049088,2019-10-28 17:17:32.77032654,8069905,T,IEX,246.670000,100
2019-10-28 17:18:00.432315904,2019-10-28 17:18:00.432296186,8077931,T,IEX,246.765000,100
2019-10-28 17:18:55.588689920,2019-10-28 17:18:55.588669972,8100275,T,IEX,246.850000,100
2019-10-28 17:19:08.627049984,2019-10-28 17:19:08.627032029,8107426,T,IEX,246.845000,100
2019-10-28 17:19:20.99883008,2019-10-28 17:19:20.99862295,8111037,T,IEX,246.845000,100
2019-10-28 17:19:28.39761920,2019-10-28 17:19:28.39742804,8114097,T,IEX,246.865000,100
2019-10-28 17:19:28.703334912,2019-10-28 17:19:28.703314083,8114492,T,IEX,246.870000,100
2019-10-28 17:19:30.854221056,2019-10-28 17:19:30.854204231,8115015,T,IEX,246.910000,100
2019-10-28 17:19:36.651552000,2019-10-28 17:19:36.651536441,8116737,T,IEX,246.870000,200
2019-10-28 17:19:56.93149952,2019-10-28 17:19:56.93130165,8123246,T,IEX,246.850000,100
2019-10-28 17:20:12.73957120,2019-10-28 17:20:12.73934276,8128488,T,IEX,246.870000,100
2019-10-28 17:20:12.75485952,2019-10-28 17:20:12.75465291,8128490,T,IEX,246.870000,100
2019-10-28 17:21:18.569307904,2019-10-28 17:21:18.569287663,8155507,T,IEX,246.880000,1
2019-10-28 17:22:49.623462912,2019-10-28 17:22:49.623443805,8183380,T,IEX,246.835000,100
2019-10-28 17:28:13.331446016,2019-10-28 17:28:13.331427237,8290249,T,IEX,246.910000,100
2019-10-28 17:28:56.398277120,2019-10-28 17:28:56.398257275,8306067,T,IEX,247.000000,100
2019-10-28 17:31:07.200055040,2019-10-28 17:31:07.200038818,8347136,T,IEX,246.980000,35
2019-10-28 17:31:59.451842048,2019-10-28 17:31:59.451820008,8361708,T,IEX,247.000000,9
2019-10-28 17:32:31.589031936,2019-10-28 17:32:31.589012164,8372291,T,IEX,246.980000,100
2019-10-28 17:32:31.589125888,2019-10-28 17:32:31.589109660,8372293,T,IEX,246.980000,200
2019-10-28 17:33:08.246748928,2019-10-28 17:33:08.246731280,8386063,T,IEX,246.960000,100
2019-10-28 17:33:31.140162048,2019-10-28 17:33:31.140141132,8392518,T,IEX,246.960000,10
2019-10-28 17:33:31.140333056,2019-10-28 17:33:31.140316951,8392520,T,IEX,246.960000,7
2019-10-28 17:33:31.140400128,2019-10-28 17:33:31.140382293,8392521,T,IEX,246.960000,93
2019-10-28 17:33:31.140412928,2019-10-28 17:33:31.140395441,8392522,T,IEX,246.960000,7
2019-10-28 17:33:31.140457984,2019-10-28 17:33:31.140440442,8392523,T,IEX,246.960000,83
2019-10-28 17:34:08.239227904,2019-10-28 17:34:08.239207881,8403807,T,IEX,247.010000,100
2019-10-28 17:34:25.40668928,2019-10-28 17:34:25.40647589,8409245,T,IEX,247.000000,100
2019-10-28 17:34:25.42897920,2019-10-28 17:34:25.42878296,8409246,T,IEX,247.000000,100
2019-10-28 17:36:32.788001024,2019-10-28 17:36:32.787980105,8455837,T,IEX,247.020000,50
2019-10-28 17:36:32.788749056,2019-10-28 17:36:32.788729058,8455851,T,IEX,247.025000,32
2019-10-28 17:36:32.788945920,2019-10-28 17:36:32.788922520,8455859,T,IEX,247.025000,12
2019-10-28 17:36:32.789110016,2019-10-28 17:36:32.789091660,8455865,T,IEX,247.025000,6
2019-10-28 17:39:35.673532928,2019-10-28 17:39:35.673512744,8514805,T,IEX,247.020000,25
2019-10-28 17:40:00.487111936,2019-10-28 17:40:00.487090303,8523713,T,IEX,247.075000,100
2019-10-28 17:42:05.188920064,2019-10-28 17:42:05.188900652,8560097,T,IEX,247.020000,100
2019-10-28 17:42:37.165016064,2019-10-28 17:42:37.164999057,8569883,T,IEX,246.990000,100
2019-10-28 17:42:37.165036032,2019-10-28 17:42:37.165019588,8569884,T,IEX,246.990000,100
2019-10-28 17:42:37.165153024,2019-10-28 17:42:37.165136588,8569887,T,IEX,246.990000,100
2019-10-28 17:42:53.812705024,2019-10-28 17:42:53.812684644,8574024,T,IEX,246.920000,1100
2019-10-28 17:43:17.296163072,2019-10-28 17:43:17.296142857,8580840,T,IEX,246.980000,100
2019-10-28 17:43:27.768260096,2019-10-28 17:43:27.768243634,8583791,T,IEX,246.995000,5
2019-10-28 17:44:22.40850944,2019-10-28 17:44:22.40828573,8601702,T,IEX,246.990000,100
2019-10-28 17:45:15.920583936,2019-10-28 17:45:15.920565477,8619890,T,IEX,247.040000,50
2019-10-28 17:46:48.164867072,2019-10-28 17:46:48.164845298,8648314,T,IEX,247.020000,2
2019-10-28 17:49:54.270350080,2019-10-28 17:49:54.270328407,8715317,T,IEX,247.335000,100
2019-10-28 17:49:54.270362112,2019-10-28 17:49:54.270343281,8715318,T,IEX,247.335000,100
2019-10-28 17:50:07.375666944,2019-10-28 17:50:07.375645263,8719194,T,IEX,247.360000,100
2019-10-28 17:51:02.844375040,2019-10-28 17:51:02.844353925,8736339,T,IEX,247.350000,100
2019-10-28 17:51:02.844390912,2019-10-28 17:51:02.844373895,8736340,T,IEX,247.350000,100
2019-10-28 17:51:02.859750912,2019-10-28 17:51:02.859731729,8736379,T,IEX,247.350000,300
2019-10-28 17:51:02.868809984,2019-10-28 17:51:02.868789072,8736381,T,IEX,247.350000,200
2019-10-28 17:51:38.769544960,2019-10-28 17:51:38.769525316,8748141,T,IEX,247.390000,2
2019-10-28 17:53:47.622204928,2019-10-28 17:53:47.622186651,8790566,T,IEX,247.375000,100
2019-10-28 17:55:00.654113024,2019-10-28 17:55:00.654092333,8815995,T,IEX,247.380000,633
2019-10-28 17:56:29.788431872,2019-10-28 17:56:29.788412592,8842907,T,IEX,247.520000,100
2019-10-28 17:57:48.550832128,2019-10-28 17:57:48.550812169,8865649,T,IEX,247.430000,100
2019-10-28 17:58:13.71005952,2019-10-28 17:58:13.70981346,8874506,T,IEX,247.350000,100
2019-10-28 17:58:13.73979904,2019-10-28 17:58:13.73961096,8874673,T,IEX,247.350000,100
2019-10-28 17:58:15.723076096,2019-10-28 17:58:15.723059481,8888832,T,IEX,247.270000,100
2019-10-28 17:58:56.825806080,2019-10-28 17:58:56.825786016,8921779,T,IEX,247.190000,100
2019-10-28 17:58:56.826726912,2019-10-28 17:58:56.826711407,8921780,T,IEX,247.190000,493
2019-10-28 18:00:19.530191872,2019-10-28 18:00:19.530174184,8966104,T,IEX,247.135000,100
2019-10-28 18:01:14.828537088,2019-10-28 18:01:14.828517548,8991859,T,IEX,247.280000,3
2019-10-28 18:01:21.501618944,2019-10-28 18:01:21.501597853,8995188,T,IEX,247.250000,100
2019-10-28 18:02:46.791092992,2019-10-28 18:02:46.791072347,9033543,T,IEX,247.345000,1
2019-10-28 18:03:47.267660032,2019-10-28 18:03:47.267643060,9058555,T,IEX,247.230000,109
2019-10-28 18:04:00.875938048,2019-10-28 18:04:00.875919771,9064295,T,IEX,247.250000,100
2019-10-28 18:04:41.578371072,2019-10-28 18:04:41.578353113,9083224,T,IEX,247.325000,100
2019-10-28 18:05:57.656460032,2019-10-28 18:05:57.656440324,9115258,T,IEX,247.370000,100
2019-10-28 18:07:59.150173952,2019-10-28 18:07:59.150153322,9158920,T,IEX,247.290000,100
2019-10-28 18:08:55.948809984,2019-10-28 18:08:55.948788276,9179977,T,IEX,247.290000,100
2019-10-28 18:09:58.519051008,2019-10-28 18:09:58.519032659,9205682,T,IEX,247.280000,100
2019-10-28 18:11:44.564269056,2019-10-28 18:11:44.564248416,9240156,T,IEX,247.460000,100
2019-10-28 18:12:45.153233920,2019-10-28 18:12:45.153215571,9261682,T,IEX,247.355000,100
2019-10-28 18:13:09.823942912,2019-10-28 18:13:09.823921105,9269555,T,IEX,247.350000,1
2019-10-28 18:13:09.823956992,2019-10-28 18:13:09.823940743,9269556,T,IEX,247.360000,99
2019-10-28 18:13:27.402732032,2019-10-28 18:13:27.402711095,9275450,T,IEX,247.360000,1
2019-10-28 18:13:42.93189888,2019-10-28 18:13:42.93172098,9281281,T,IEX,247.375000,100
2019-10-28 18:14:29.569124096,2019-10-28 18:14:29.569105689,9295138,T,IEX,247.360000,35
2019-10-28 18:14:33.796195072,2019-10-28 18:14:33.796177274,9296479,T,IEX,247.360000,65
2019-10-28 18:21:00.74799104,2019-10-28 18:21:00.74781959,9429147,T,IEX,247.190000,3
2019-10-28 18:21:17.961906944,2019-10-28 18:21:17.961886368,9434177,T,IEX,247.225000,97
2019-10-28 18:24:31.860667904,2019-10-28 18:24:31.860651232,9494809,T,IEX,247.370000,3
2019-10-28 18:24:31.860687872,2019-10-28 18:24:31.860671052,9494810,T,IEX,247.370000,2
2019-10-28 18:26:02.82426880,2019-10-28 18:26:02.82409784,9526897,T,IEX,247.370000,100
2019-10-28 18:28:53.314322944,2019-10-28 18:28:53.314303744,9585599,T,IEX,247.340000,100
2019-10-28 18:31:16.807987968,2019-10-28 18:31:16.807968469,9646979,T,IEX,247.340000,100
2019-10-28 18:31:17.251358976,2019-10-28 18:31:17.251338690,9647113,T,IEX,247.335000,100
2019-10-28 18:31:17.262859008,2019-10-28 18:31:17.262839808,9647118,T,IEX,247.335000,122
2019-10-28 18:31:28.998498048,2019-10-28 18:31:28.998482509,9651134,T,IEX,247.330000,5
2019-10-28 18:36:49.332310016,2019-10-28 18:36:49.332291418,9749470,T,IEX,247.400000,6
2019-10-28 18:37:04.341586944,2019-10-28 18:37:04.341568521,9754527,T,IEX,247.430000,100
2019-10-28 18:37:20.136630016,2019-10-28 18:37:20.136614543,9760345,T,IEX,247.420000,100
2019-10-28 18:37:20.136651008,2019-10-28 18:37:20.136634289,9760346,T,IEX,247.420000,100
2019-10-28 18:37:27.397030912,2019-10-28 18:37:27.397010632,9762492,T,IEX,247.435000,1400
2019-10-28 18:37:27.419304960,2019-10-28 18:37:27.419285371,9762502,T,IEX,247.415000,700
2019-10-28 18:37:27.436118016,2019-10-28 18:37:27.436097453,9762505,T,IEX,247.390000,700
2019-10-28 18:37:27.445348096,2019-10-28 18:37:27.445327336,9762507,T,IEX,247.360000,100
2019-10-28 18:37:45.106729984,2019-10-28 18:37:45.106712066,9768628,T,IEX,247.360000,200
2019-10-28 18:38:09.362362880,2019-10-28 18:38:09.362342185,9776727,T,IEX,247.290000,7
2019-10-28 18:38:09.362377984,2019-10-28 18:38:09.362362220,9776728,T,IEX,247.290000,100
2019-10-28 18:38:09.364822016,2019-10-28 18:38:09.364802040,9776729,T,IEX,247.290000,100
2019-10-28 18:38:26.533560064,2019-10-28 18:38:26.533544496,9782102,T,IEX,247.300000,300
2019-10-28 18:38:26.541696000,2019-10-28 18:38:26.541675409,9782106,T,IEX,247.300000,100
2019-10-28 18:39:21.576140032,2019-10-28 18:39:21.576121265,9802470,T,IEX,247.320000,93
2019-10-28 18:39:29.193009920,2019-10-28 18:39:29.192991799,9804775,T,IEX,247.350000,1400
2019-10-28 18:39:51.290351104,2019-10-28 18:39:51.290330863,9812946,T,IEX,247.330000,1400
2019-10-28 18:39:51.301025024,2019-10-28 18:39:51.301007688,9812957,T,IEX,247.300000,100
2019-10-28 18:39:51.301032960,2019-10-28 18:39:51.301016437,9812958,T,IEX,247.300000,300
2019-10-28 18:40:03.484046080,2019-10-28 18:40:03.484024215,9817312,T,IEX,247.310000,100
2019-10-28 18:41:24.741413120,2019-10-28 18:41:24.741391843,9841723,T,IEX,247.310000,3
2019-10-28 18:42:26.920470016,2019-10-28 18:42:26.920452005,9860144,T,IEX,247.330000,100
2019-10-28 18:45:58.748745984,2019-10-28 18:45:58.748728437,9933554,T,IEX,247.540000,100
2019-10-28 18:48:29.822930944,2019-10-28 18:48:29.822914060,9990520,T,IEX,247.380000,75
2019-10-28 18:48:29.823055872,2019-10-28 18:48:29.823038387,9990522,T,IEX,247.380000,25
2019-10-28 18:50:43.74959872,2019-10-28 18:50:43.74941593,10031045,T,IEX,247.350000,75
2019-10-28 18:50:43.75102976,2019-10-28 18:50:43.75086721,10031047,T,IEX,247.350000,25
2019-10-28 18:50:46.148960000,2019-10-28 18:50:46.148941456,10031995,T,IEX,247.340000,79
2019-10-28 18:50:55.758983936,2019-10-28 18:50:55.758963997,10035121,T,IEX,247.365000,3
2019-10-28 18:50:55.759001088,2019-10-28 18:50:55.758984747,10035122,T,IEX,247.365000,2
2019-10-28 18:50:55.759008000,2019-10-28 18:50:55.758992377,10035123,T,IEX,247.365000,3
2019-10-28 18:50:55.759028992,2019-10-28 18:50:55.759010226,10035124,T,IEX,247.365000,1
2019-10-28 18:50:55.759044096,2019-10-28 18:50:55.759028637,10035125,T,IEX,247.365000,2
2019-10-28 18:51:12.909401088,2019-10-28 18:51:12.909380388,10041054,T,IEX,247.350000,100
2019-10-28 18:52:13.447866112,2019-10-28 18:52:13.447846388,10061002,T,IEX,247.415000,200
2019-10-28 18:53:31.590369024,2019-10-28 18:53:31.590352838,10085574,T,IEX,247.410000,41
2019-10-28 18:53:32.391470080,2019-10-28 18:53:32.391453011,10085793,T,IEX,247.390000,45
2019-10-28 18:53:32.391483904,2019-10-28 18:53:32.391466106,10085794,T,IEX,247.390000,155
2019-10-28 18:53:49.510482944,2019-10-28 18:53:49.510462893,10091013,T,IEX,247.310000,700
2019-10-28 18:53:49.511581952,2019-10-28 18:53:49.511562582,10091014,T,IEX,247.310000,900
2019-10-28 18:54:43.239294976,2019-10-28 18:54:43.239274775,10109849,T,IEX,246.970000,100
2019-10-28 18:55:00.359280896,2019-10-28 18:55:00.359263212,10116478,T,IEX,247.020000,100
2019-10-28 18:55:09.362098944,2019-10-28 18:55:09.362081239,10119466,T,IEX,247.090000,45
2019-10-28 18:55:09.362116096,2019-10-28 18:55:09.362098946,10119467,T,IEX,247.100000,55
2019-10-28 18:56:55.331201024,2019-10-28 18:56:55.331180797,10163346,T,IEX,247.280000,100
2019-10-28 18:58:31.187752960,2019-10-28 18:58:31.187733848,10197113,T,IEX,247.280000,100
2019-10-28 18:58:46.668820992,2019-10-28 18:58:46.668800465,10203803,T,IEX,247.345000,742
2019-10-28 19:00:04.981900032,2019-10-28 19:00:04.981881289,10237631,T,IEX,247.310000,100
2019-10-28 19:00:06.213440000,2019-10-28 19:00:06.213422051,10238066,T,IEX,247.310000,100
2019-10-28 19:00:52.334073088,2019-10-28 19:00:52.334055263,10255279,T,IEX,247.325000,100
2019-10-28 19:01:07.175510016,2019-10-28 19:01:07.175489574,10260611,T,IEX,247.365000,100
2019-10-28 19:01:08.744478976,2019-10-28 19:01:08.744458211,10261296,T,IEX,247.360000,100
2019-10-28 19:05:00.938885888,2019-10-28 19:05:00.938865274,10349970,T,IEX,247.230000,27
2019-10-28 19:05:09.971134976,2019-10-28 19:05:09.971117464,10354015,T,IEX,247.230000,100
2019-10-28 19:06:31.726407936,2019-10-28 19:06:31.726391494,10378871,T,IEX,247.205000,4
2019-10-28 19:06:33.226053888,2019-10-28 19:06:33.226034021,10379290,T,IEX,247.210000,54
2019-10-28 19:07:05.430979072,2019-10-28 19:07:05.430960002,10388821,T,IEX,247.280000,11
2019-10-28 19:09:52.362279936,2019-10-28 19:09:52.362261577,10445776,T,IEX,247.370000,100
2019-10-28 19:10:06.718906112,2019-10-28 19:10:06.718885293,10449971,T,IEX,247.400000,100
2019-10-28 19:10:07.359635968,2019-10-28 19:10:07.359615392,10450136,T,IEX,247.400000,100
2019-10-28 19:10:13.223766016,2019-10-28 19:10:13.223744917,10451915,T,IEX,247.390000,100
2019-10-28 19:11:00.720324096,2019-10-28 19:11:00.720300948,10470100,T,IEX,247.390000,100
2019-10-28 19:11:39.387365888,2019-10-28 19:11:39.387343489,10483104,T,IEX,247.400000,100
2019-10-28 19:12:42.456000000,2019-10-28 19:12:42.455982309,10507880,T,IEX,247.370000,77
2019-10-28 19:12:42.456146944,2019-10-28 19:12:42.456129947,10507882,T,IEX,247.370000,13
2019-10-28 19:12:59.36686080,2019-10-28 19:12:59.36670213,10512990,T,IEX,247.390000,1
2019-10-28 19:13:08.941391872,2019-10-28 19:13:08.941374132,10516591,T,IEX,247.380000,500
2019-10-28 19:15:22.730907904,2019-10-28 19:15:22.730890367,10566273,T,IEX,247.405000,100
2019-10-28 19:15:25.551026944,2019-10-28 19:15:25.551008470,10567051,T,IEX,247.410000,100
2019-10-28 19:17:22.808856064,2019-10-28 19:17:22.808837147,10608595,T,IEX,247.420000,100
2019-10-28 19:17:29.632486912,2019-10-28 19:17:29.632466725,10611875,T,IEX,247.450000,93
2019-10-28 19:17:34.893453056,2019-10-28 19:17:34.893434376,10613581,T,IEX,247.435000,2
2019-10-28 19:18:04.532515072,2019-10-28 19:18:04.532492478,10623904,T,IEX,247.495000,36
2019-10-28 19:18:26.765961984,2019-10-28 19:18:26.765942017,10631804,T,IEX,247.430000,1
2019-10-28 19:18:26.766001920,2019-10-28 19:18:26.765985094,10631805,T,IEX,247.430000,4
2019-10-28 19:18:26.766044928,2019-10-28 19:18:26.766028444,10631806,T,IEX,247.430000,3
2019-10-28 19:18:26.766088960,2019-10-28 19:18:26.766072676,10631807,T,IEX,247.430000,7
2019-10-28 19:18:26.778750976,2019-10-28 19:18:26.778729861,10631811,T,IEX,247.420000,1
2019-10-28 19:19:10.34544896,2019-10-28 19:19:10.34524510,10646920,T,IEX,247.455000,100
2019-10-28 19:19:13.106420992,2019-10-28 19:19:13.106400568,10647813,T,IEX,247.450000,100
2019-10-28 19:21:32.303542016,2019-10-28 19:21:32.303521900,10697934,T,IEX,247.440000,7
2019-10-28 19:25:34.788737024,2019-10-28 19:25:34.788718116,10788997,T,IEX,247.370000,67
2019-10-28 19:27:41.899133952,2019-10-28 19:27:41.899115512,10830890,T,IEX,247.325000,100
2019-10-28 19:28:09.87995904,2019-10-28 19:28:09.87978520,10842018,T,IEX,247.240000,200
2019-10-28 19:29:52.925876992,2019-10-28 19:29:52.925859097,10877612,T,IEX,247.200000,100
2019-10-28 19:30:41.629847040,2019-10-28 19:30:41.629828991,10901107,T,IEX,247.170000,100
2019-10-28 19:30:41.629938944,2019-10-28 19:30:41.629923060,10901109,T,IEX,247.180000,100
2019-10-28 19:31:29.75276032,2019-10-28 19:31:29.75255305,10919841,T,IEX,247.170000,100
2019-10-28 19:32:14.66862080,2019-10-28 19:32:14.66842533,10937761,T,IEX,247.210000,6
2019-10-28 19:32:14.66881024,2019-10-28 19:32:14.66863539,10937762,T,IEX,247.210000,4
2019-10-28 19:32:14.66899968,2019-10-28 19:32:14.66883536,10937763,T,IEX,247.210000,5
2019-10-28 19:32:14.812346880,2019-10-28 19:32:14.812328305,10938253,T,IEX,247.200000,300
2019-10-28 19:32:14.812369920,2019-10-28 19:32:14.812353402,10938254,T,IEX,247.200000,100
2019-10-28 19:33:03.250117120,2019-10-28 19:33:03.250095876,10958893,T,IEX,247.210000,3
2019-10-28 19:34:22.716666880,2019-10-28 19:34:22.716642573,10991233,T,IEX,247.175000,100
2019-10-28 19:34:28.521807872,2019-10-28 19:34:28.521787528,10993443,T,IEX,247.180000,100
2019-10-28 19:34:30.985606912,2019-10-28 19:34:30.985586791,10994295,T,IEX,247.180000,100
2019-10-28 19:34:30.990068992,2019-10-28 19:34:30.990049630,10994296,T,IEX,247.180000,100
2019-10-28 19:34:30.993349888,2019-10-28 19:34:30.993329057,10994297,T,IEX,247.180000,400
2019-10-28 19:34:47.565810944,2019-10-28 19:34:47.565794269,11000677,T,IEX,247.170000,100
2019-10-28 19:34:49.62196992,2019-10-28 19:34:49.62175721,11001150,T,IEX,247.190000,100
2019-10-28 19:35:05.10885888,2019-10-28 19:35:05.10865265,11009671,T,IEX,247.140000,7
2019-10-28 19:35:20.897029120,2019-10-28 19:35:20.897007192,11017430,T,IEX,247.150000,37
2019-10-28 19:36:05.664500992,2019-10-28 19:36:05.664484053,11038047,T,IEX,247.085000,100
2019-10-28 19:36:07.985734912,2019-10-28 19:36:07.985714516,11039129,T,IEX,247.080000,100
2019-10-28 19:37:23.240689920,2019-10-28 19:37:23.240668431,11070615,T,IEX,246.920000,6
2019-10-28 19:41:24.341281024,2019-10-28 19:41:24.341259363,11191270,T,IEX,246.900000,100
2019-10-28 19:41:25.150766080,2019-10-28 19:41:25.150747036,11191678,T,IEX,246.860000,100
2019-10-28 19:42:01.206759936,2019-10-28 19:42:01.206742126,11206074,T,IEX,246.850000,5
2019-10-28 19:42:55.668156928,2019-10-28 19:42:55.668139561,11232404,T,IEX,246.880000,100
2019-10-28 19:43:41.882895104,2019-10-28 19:43:41.882877658,11254903,T,IEX,246.855000,100
2019-10-28 19:43:59.181153024,2019-10-28 19:43:59.181135528,11264218,T,IEX,246.905000,50
2019-10-28 19:44:34.497806080,2019-10-28 19:44:34.497784809,11281356,T,IEX,246.900000,57
2019-10-28 19:44:40.778820096,2019-10-28 19:44:40.778800206,11284485,T,IEX,246.940000,100
2019-10-28 19:44:40.780382976,2019-10-28 19:44:40.780362355,11284487,T,IEX,246.940000,100
2019-10-28 19:45:01.634735104,2019-10-28 19:45:01.634714442,11296441,T,IEX,246.940000,1
2019-10-28 19:45:07.624960000,2019-10-28 19:45:07.624940681,11302453,T,IEX,246.910000,25
2019-10-28 19:45:08.369933056,2019-10-28 19:45:08.369912564,11302893,T,IEX,246.910000,75
2019-10-28 19:45:14.474593024,2019-10-28 19:45:14.474573802,11306767,T,IEX,246.895000,100
2019-10-28 19:45:14.474604032,2019-10-28 19:45:14.474587363,11306768,T,IEX,246.895000,361
2019-10-28 19:45:17.679705088,2019-10-28 19:45:17.679681356,11308332,T,IEX,246.890000,100
2019-10-28 19:45:24.784190976,2019-10-28 19:45:24.784163353,11317722,T,IEX,246.830000,100
2019-10-28 19:45:24.891804928,2019-10-28 19:45:24.891786573,11318169,T,IEX,246.835000,100
2019-10-28 19:45:29.500820992,2019-10-28 19:45:29.500803497,11321827,T,IEX,246.820000,100
2019-10-28 19:46:03.275634944,2019-10-28 19:46:03.275617371,11344833,T,IEX,246.830000,19
2019-10-28 19:46:04.768250112,2019-10-28 19:46:04.768228219,11346789,T,IEX,246.870000,9
2019-10-28 19:46:04.768264960,2019-10-28 19:46:04.768247842,11346790,T,IEX,246.870000,5
2019-10-28 19:46:10.409452032,2019-10-28 19:46:10.409427446,11352939,T,IEX,246.855000,100
2019-10-28 19:46:40.250208000,2019-10-28 19:46:40.250190283,11372108,T,IEX,246.890000,40
2019-10-28 19:46:54.880687104,2019-10-28 19:46:54.880666505,11382056,T,IEX,246.920000,100
2019-10-28 19:47:00.879909120,2019-10-28 19:47:00.879889395,11387261,T,IEX,246.880000,4
2019-10-28 19:47:02.853105920,2019-10-28 19:47:02.853086276,11389047,T,IEX,246.840000,100
2019-10-28 19:47:51.796570880,2019-10-28 19:47:51.796550894,11413817,T,IEX,246.910000,100
2019-10-28 19:47:51.796730112,2019-10-28 19:47:51.796709090,11413819,T,IEX,246.910000,100
2019-10-28 19:47:53.78340096,2019-10-28 19:47:53.78318324,11414515,T,IEX,246.945000,100
2019-10-28 19:47:53.382827008,2019-10-28 19:47:53.382809025,11414609,T,IEX,246.945000,100
2019-10-28 19:48:02.222806016,2019-10-28 19:48:02.222787490,11420322,T,IEX,246.940000,100
2019-10-28 19:48:02.224282112,2019-10-28 19:48:02.224262919,11420324,T,IEX,246.940000,100
2019-10-28 19:48:05.752879104,2019-10-28 19:48:05.752860732,11422691,T,IEX,246.890000,100
2019-10-28 19:48:22.666189056,2019-10-28 19:48:22.666170694,11433455,T,IEX,246.870000,100
2019-10-28 19:48:59.669884928,2019-10-28 19:48:59.669864828,11457248,T,IEX,246.850000,1
2019-10-28 19:49:04.945154048,2019-10-28 19:49:04.945134957,11460797,T,IEX,246.870000,1
2019-10-28 19:49:06.311923968,2019-10-28 19:49:06.311903036,11462065,T,IEX,246.875000,1
2019-10-28 19:49:06.322800896,2019-10-28 19:49:06.322779726,11462076,T,IEX,246.880000,9
2019-10-28 19:49:19.565241088,2019-10-28 19:49:19.565225286,11469361,T,IEX,246.890000,1
2019-10-28 19:49:19.572722944,2019-10-28 19:49:19.572703937,11469365,T,IEX,246.890000,1
2019-10-28 19:49:26.336180992,2019-10-28 19:49:26.336161682,11473596,T,IEX,246.865000,1
2019-10-28 19:49:33.166484992,2019-10-28 19:49:33.166469959,11478587,T,IEX,246.850000,1
2019-10-28 19:49:34.354404096,2019-10-28 19:49:34.354382415,11479149,T,IEX,246.860000,97
2019-10-28 19:49:36.138633984,2019-10-28 19:49:36.138616192,11480041,T,IEX,246.860000,3
2019-10-28 19:49:40.937498112,2019-10-28 19:49:40.937482995,11483741,T,IEX,246.890000,1
2019-10-28 19:49:45.437017088,2019-10-28 19:49:45.436995082,11486462,T,IEX,246.890000,100
2019-10-28 19:50:00.517541888,2019-10-28 19:50:00.517522712,11498408,T,IEX,246.890000,1
2019-10-28 19:50:00.529896960,2019-10-28 19:50:00.529878737,11498527,T,IEX,246.890000,2
2019-10-28 19:50:04.785566976,2019-10-28 19:50:04.785549524,11505961,T,IEX,246.890000,1
2019-10-28 19:50:51.52849920,2019-10-28 19:50:51.52829482,11541402,T,IEX,246.900000,100
2019-10-28 19:50:51.937760000,2019-10-28 19:50:51.937737221,11543836,T,IEX,246.920000,100
2019-10-28 19:50:51.938765056,2019-10-28 19:50:51.938746532,11543838,T,IEX,246.915000,100
2019-10-28 19:51:16.251931904,2019-10-28 19:51:16.251911922,11562780,T,IEX,246.925000,100
2019-10-28 19:51:32.226245120,2019-10-28 19:51:32.226226039,11572472,T,IEX,246.960000,100
2019-10-28 19:51:45.184691968,2019-10-28 19:51:45.184672132,11581315,T,IEX,246.950000,183
2019-10-28 19:51:48.861206016,2019-10-28 19:51:48.861186154,11584461,T,IEX,246.970000,63
2019-10-28 19:51:49.13705984,2019-10-28 19:51:49.13689903,11584541,T,IEX,246.970000,37
2019-10-28 19:52:02.243074048,2019-10-28 19:52:02.243055740,11593639,T,IEX,247.010000,7
2019-10-28 19:52:05.853940992,2019-10-28 19:52:05.853921234,11596198,T,IEX,247.000000,100
2019-10-28 19:52:29.808640000,2019-10-28 19:52:29.808623493,11613856,T,IEX,246.975000,100
2019-10-28 19:52:35.361771008,2019-10-28 19:52:35.361749998,11617250,T,IEX,246.975000,100
2019-10-28 19:52:40.311017984,2019-10-28 19:52:40.310997446,11620122,T,IEX,246.980000,100
2019-10-28 19:53:21.455115008,2019-10-28 19:53:21.455095471,11649940,T,IEX,247.030000,100
2019-10-28 19:53:25.612344064,2019-10-28 19:53:25.612323886,11652710,T,IEX,246.980000,100
2019-10-28 19:53:28.169469952,2019-10-28 19:53:28.169449324,11654286,T,IEX,246.980000,100
2019-10-28 19:53:53.138317056,2019-10-28 19:53:53.138301446,11674671,T,IEX,247.020000,1
2019-10-28 19:53:58.401233920,2019-10-28 19:53:58.401214859,11678873,T,IEX,246.990000,100
2019-10-28 19:54:14.866291968,2019-10-28 19:54:14.866274163,11694333,T,IEX,247.005000,100
2019-10-28 19:54:14.870673920,2019-10-28 19:54:14.870657868,11694336,T,IEX,247.000000,100
2019-10-28 19:54:24.216377088,2019-10-28 19:54:24.216201024,11701976,T,IEX,247.010000,100
2019-10-28 19:54:33.207296000,2019-10-28 19:54:33.207275715,11708990,T,IEX,247.025000,100
2019-10-28 19:54:39.53498112,2019-10-28 19:54:39.53482190,11713711,T,IEX,247.030000,100
2019-10-28 19:54:41.757467904,2019-10-28 19:54:41.757452015,11715725,T,IEX,247.050000,100
2019-10-28 19:54:42.198522112,2019-10-28 19:54:42.198502042,11716509,T,IEX,247.060000,100
2019-10-28 19:54:53.144290048,2019-10-28 19:54:53.144270491,11725191,T,IEX,247.040000,100
2019-10-28 19:55:00.632008960,2019-10-28 19:55:00.631990631,11737688,T,IEX,247.015000,100
2019-10-28 19:55:00.660007936,2019-10-28 19:55:00.659989321,11737734,T,IEX,247.015000,100
2019-10-28 19:55:01.836599040,2019-10-28 19:55:01.836578253,11740810,T,IEX,247.020000,100
2019-10-28 19:55:02.106565120,2019-10-28 19:55:02.106546383,11741389,T,IEX,247.020000,100
2019-10-28 19:55:02.106619904,2019-10-28 19:55:02.106600144,11741391,T,IEX,247.020000,100
2019-10-28 19:55:03.908592896,2019-10-28 19:55:03.908575575,11744061,T,IEX,247.035000,100
2019-10-28 19:55:04.863550976,2019-10-28 19:55:04.863529915,11744966,T,IEX,247.030000,100
2019-10-28 19:55:11.192337920,2019-10-28 19:55:11.192317602,11755956,T,IEX,247.040000,100
2019-10-28 19:55:11.192350976,2019-10-28 19:55:11.192333453,11755957,T,IEX,247.040000,100
2019-10-28 19:55:11.832250112,2019-10-28 19:55:11.832234122,11758092,T,IEX,247.060000,100
2019-10-28 19:55:17.254656000,2019-10-28 19:55:17.254635091,11764351,T,IEX,247.045000,100
2019-10-28 19:55:17.720772096,2019-10-28 19:55:17.720750149,11764866,T,IEX,247.050000,100
2019-10-28 19:55:29.910696960,2019-10-28 19:55:29.910676239,11775421,T,IEX,247.035000,100
2019-10-28 19:55:33.48557056,2019-10-28 19:55:33.48538402,11778340,T,IEX,247.010000,100
2019-10-28 19:55:34.937377024,2019-10-28 19:55:34.937360867,11781177,T,IEX,247.010000,100
2019-10-28 19:55:35.245228032,2019-10-28 19:55:35.245211763,11781489,T,IEX,247.010000,100
2019-10-28 19:55:45.254555904,2019-10-28 19:55:45.254540591,11791068,T,IEX,246.970000,5
2019-10-28 19:55:56.911416064,2019-10-28 19:55:56.911397562,11803303,T,IEX,247.005000,100
2019-10-28 19:56:00.495148032,2019-10-28 19:56:00.495131082,11807010,T,IEX,247.030000,100
2019-10-28 19:56:01.498545920,2019-10-28 19:56:01.498526968,11808197,T,IEX,247.035000,100
2019-10-28 19:56:08.872525056,2019-10-28 19:56:08.872506885,11815607,T,IEX,247.045000,143
2019-10-28 19:56:17.598793984,2019-10-28 19:56:17.598775742,11825034,T,IEX,247.045000,100
2019-10-28 19:56:25.912435968,2019-10-28 19:56:25.912416608,11832526,T,IEX,247.050000,100
2019-10-28 19:56:33.491344896,2019-10-28 19:56:33.491326239,11839567,T,IEX,247.055000,100
2019-10-28 19:56:44.370714880,2019-10-28 19:56:44.370694248,11849372,T,IEX,247.060000,100
2019-10-28 19:56:48.207030016,2019-10-28 19:56:48.207012040,11853038,T,IEX,247.060000,100
2019-10-28 19:56:50.397192960,2019-10-28 19:56:50.397176392,11855212,T,IEX,247.060000,100
2019-10-28 19:56:54.913940992,2019-10-28 19:56:54.913921286,11860108,T,IEX,247.070000,100
2019-10-28 19:56:57.731147008,2019-10-28 19:56:57.731128028,11862710,T,IEX,247.060000,100
2019-10-28 19:56:57.747461120,2019-10-28 19:56:57.747441507,11862725,T,IEX,247.060000,100
2019-10-28 19:57:02.782583040,2019-10-28 19:57:02.782561775,11868812,T,IEX,247.060000,100
2019-10-28 19:57:06.657020928,2019-10-28 19:57:06.657003031,11873119,T,IEX,247.070000,100
2019-10-28 19:57:07.650402048,2019-10-28 19:57:07.650386762,11874324,T,IEX,247.070000,3
2019-10-28 19:57:08.528496128,2019-10-28 19:57:08.528473748,11875251,T,IEX,247.080000,100
2019-10-28 19:57:08.742599936,2019-10-28 19:57:08.742582623,11875486,T,IEX,247.080000,100
2019-10-28 19:57:09.481837056,2019-10-28 19:57:09.481816697,11876143,T,IEX,247.080000,100
2019-10-28 19:57:09.511898112,2019-10-28 19:57:09.511876796,11876172,T,IEX,247.080000,100
2019-10-28 19:57:13.206362880,2019-10-28 19:57:13.206348016,11880045,T,IEX,247.090000,23
2019-10-28 19:57:15.331362048,2019-10-28 19:57:15.331344936,11882183,T,IEX,247.080000,100
2019-10-28 19:57:19.915354112,2019-10-28 19:57:19.915332537,11886226,T,IEX,247.070000,100
2019-10-28 19:57:27.986444032,2019-10-28 19:57:27.986425547,11895051,T,IEX,247.050000,100
2019-10-28 19:57:29.682423040,2019-10-28 19:57:29.682406496,11897576,T,IEX,247.050000,100
2019-10-28 19:57:29.684194048,2019-10-28 19:57:29.684175955,11897579,T,IEX,247.050000,100
2019-10-28 19:57:33.380531968,2019-10-28 19:57:33.380514628,11902564,T,IEX,247.040000,100
2019-10-28 19:57:44.917500928,2019-10-28 19:57:44.917483941,11915840,T,IEX,247.015000,100
2019-10-28 19:57:50.935770112,2019-10-28 19:57:50.935748826,11924023,T,IEX,247.025000,100
2019-10-28 19:57:59.31240960,2019-10-28 19:57:59.31221007,11931684,T,IEX,247.025000,100
2019-10-28 19:57:59.63053056,2019-10-28 19:57:59.63036574,11931707,T,IEX,247.040000,100
2019-10-28 19:58:07.922981888,2019-10-28 19:58:07.922964510,11947163,T,IEX,247.010000,100
2019-10-28 19:58:08.664668928,2019-10-28 19:58:08.664650817,11948199,T,IEX,247.010000,100
2019-10-28 19:58:10.837750016,2019-10-28 19:58:10.837732029,11950889,T,IEX,247.020000,100
2019-10-28 19:58:11.897483008,2019-10-28 19:58:11.897461813,11952024,T,IEX,247.120000,100
2019-10-28 19:58:25.923706880,2019-10-28 19:58:25.923685736,11969381,T,IEX,247.125000,100
2019-10-28 19:58:27.463853056,2019-10-28 19:58:27.463835269,11971262,T,IEX,247.125000,100
2019-10-28 19:58:36.510532096,2019-10-28 19:58:36.510513547,11980815,T,IEX,247.125000,100
2019-10-28 19:58:36.726712064,2019-10-28 19:58:36.726695249,11981247,T,IEX,247.120000,100
2019-10-28 19:58:36.794082048,2019-10-28 19:58:36.794062446,11981941,T,IEX,247.125000,2
2019-10-28 19:58:40.510550016,2019-10-28 19:58:40.510529121,11986172,T,IEX,247.125000,100
2019-10-28 19:58:40.510831104,2019-10-28 19:58:40.510813213,11986173,T,IEX,247.125000,100
2019-10-28 19:58:42.923450880,2019-10-28 19:58:42.923434436,11988586,T,IEX,247.125000,100
2019-10-28 19:58:43.510565120,2019-10-28 19:58:43.510544478,11989116,T,IEX,247.125000,200
2019-10-28 19:58:45.271897088,2019-10-28 19:58:45.271879621,11990970,T,IEX,247.125000,100
2019-10-28 19:58:45.510857984,2019-10-28 19:58:45.510836714,11991503,T,IEX,247.125000,300
2019-10-28 19:58:46.510905088,2019-10-28 19:58:46.510882199,11992782,T,IEX,247.125000,200
2019-10-28 19:58:47.510617088,2019-10-28 19:58:47.510597138,11993941,T,IEX,247.125000,200
2019-10-28 19:58:48.511387904,2019-10-28 19:58:48.511372093,11994775,T,IEX,247.125000,200
2019-10-28 19:58:48.754727936,2019-10-28 19:58:48.754707736,11995106,T,IEX,247.130000,2
2019-10-28 19:58:49.462102016,2019-10-28 19:58:49.462080593,11995733,T,IEX,247.125000,100
2019-10-28 19:58:49.510637056,2019-10-28 19:58:49.510619316,11995776,T,IEX,247.125000,300
2019-10-28 19:58:49.906202112,2019-10-28 19:58:49.906184221,11996198,T,IEX,247.130000,7
2019-10-28 19:58:49.906214912,2019-10-28 19:58:49.906199641,11996199,T,IEX,247.130000,4
2019-10-28 19:58:54.67753984,2019-10-28 19:58:54.67734325,12001588,T,IEX,247.125000,100
2019-10-28 19:58:59.23066112,2019-10-28 19:58:59.23047357,12008538,T,IEX,247.130000,55
2019-10-28 19:58:59.188524032,2019-10-28 19:58:59.188505590,12008774,T,IEX,247.130000,45
2019-10-28 19:59:00.14964992,2019-10-28 19:59:00.14946420,12009897,T,IEX,247.125000,300
2019-10-28 19:59:00.88987904,2019-10-28 19:59:00.88971440,12010563,T,IEX,247.125000,200
2019-10-28 19:59:01.22006016,2019-10-28 19:59:01.21987979,12014232,T,IEX,247.110000,100
2019-10-28 19:59:03.220378112,2019-10-28 19:59:03.220362213,12019340,T,IEX,247.130000,100
2019-10-28 19:59:03.220400128,2019-10-28 19:59:03.220384513,12019341,T,IEX,247.130000,100
2019-10-28 19:59:06.954661120,2019-10-28 19:59:06.954640925,12026346,T,IEX,247.155000,300
2019-10-28 19:59:07.463201024,2019-10-28 19:59:07.463184115,12027389,T,IEX,247.155000,100
2019-10-28 19:59:07.535862016,2019-10-28 19:59:07.535841463,12027516,T,IEX,247.140000,300
2019-10-28 19:59:07.925833984,2019-10-28 19:59:07.925813164,12028225,T,IEX,247.140000,100
2019-10-28 19:59:11.444687872,2019-10-28 19:59:11.444660520,12037386,T,IEX,247.160000,100
2019-10-28 19:59:11.460306944,2019-10-28 19:59:11.460286470,12037679,T,IEX,247.150000,100
2019-10-28 19:59:14.926368000,2019-10-28 19:59:14.926346467,12045060,T,IEX,247.165000,100
2019-10-28 19:59:14.928197120,2019-10-28 19:59:14.928182074,12045071,T,IEX,247.165000,300
2019-10-28 19:59:17.535344896,2019-10-28 19:59:17.535325304,12050416,T,IEX,247.150000,100
2019-10-28 19:59:24.663236096,2019-10-28 19:59:24.663219879,12061843,T,IEX,247.165000,100
2019-10-28 19:59:31.544171008,2019-10-28 19:59:31.544154827,12083903,T,IEX,247.170000,100
2019-10-28 19:59:34.14223872,2019-10-28 19:59:34.14208741,12098011,T,IEX,247.140000,100
2019-10-28 19:59:36.867314944,2019-10-28 19:59:36.867298616,12114879,T,IEX,247.200000,100
2019-10-28 19:59:38.636636928,2019-10-28 19:59:38.636619987,12121996,T,IEX,247.210000,100
2019-10-28 19:59:38.968599040,2019-10-28 19:59:38.968583418,12126364,T,IEX,247.190000,100
2019-10-28 19:59:39.10723072,2019-10-28 19:59:39.10703934,12126616,T,IEX,247.190000,100
2019-10-28 19:59:40.361787904,2019-10-28 19:59:40.361770158,12136238,T,IEX,247.175000,100
2019-10-28 19:59:40.386406912,2019-10-28 19:59:40.386389986,12136403,T,IEX,247.175000,8
2019-10-28 19:59:45.552574976,2019-10-28 19:59:45.552555537,12166303,T,IEX,247.110000,100
2019-10-28 19:59:55.570145024,2019-10-28 19:59:55.570125168,12219149,T,IEX,247.130000,100
2019-10-28 19:59:56.226649088,2019-10-28 19:59:56.226632063,12224125,T,IEX,247.040000,100
2019-10-28 19:59:57.753534976,2019-10-28 19:59:57.753518101,12232497,T,IEX,247.000000,100
