2019-10-30 13:30:00.857310976,2019-10-30 13:30:00.857287558,95964,T,IEX,1760.500000,100
2019-10-30 13:30:01.628239872,2019-10-30 13:30:01.628216335,100869,T,IEX,1761.200000,1
2019-10-30 13:30:01.771205888,2019-10-30 13:30:01.771183469,101777,T,IEX,1761.090000,1
2019-10-30 13:30:03.279323904,2019-10-30 13:30:03.279298814,106743,T,IEX,1761.450000,100
2019-10-30 13:30:06.112944128,2019-10-30 13:30:06.112915947,112814,T,IEX,1761.505000,40
2019-10-30 13:30:06.113001984,2019-10-30 13:30:06.112979271,112817,T,IEX,1761.505000,7
2019-10-30 13:30:13.217199104,2019-10-30 13:30:13.217173834,124420,T,IEX,1761.460000,1
2019-10-30 13:30:15.685242112,2019-10-30 13:30:15.685216439,127177,T,IEX,1761.845000,100
2019-10-30 13:30:15.685302016,2019-10-30 13:30:15.685280693,127178,T,IEX,1761.845000,100
2019-10-30 13:30:54.579796992,2019-10-30 13:30:54.579772330,167715,T,IEX,1760.690000,100
2019-10-30 13:30:59.305780992,2019-10-30 13:30:59.305753167,173461,T,IEX,1761.060000,50
2019-10-30 13:30:59.305830912,2019-10-30 13:30:59.305807951,173462,T,IEX,1761.150000,25
2019-10-30 13:30:59.305882880,2019-10-30 13:30:59.305859315,173463,T,IEX,1761.160000,25
2019-10-30 13:30:59.308677888,2019-10-30 13:30:59.308655953,173481,T,IEX,1761.160000,100
2019-10-30 13:31:06.60732928,2019-10-30 13:31:06.60707551,183981,T,IEX,1760.970000,50
2019-10-30 13:31:06.60777984,2019-10-30 13:31:06.60756573,183982,T,IEX,1760.970000,50
2019-10-30 13:31:06.63028992,2019-10-30 13:31:06.63006166,183990,T,IEX,1760.980000,25
2019-10-30 13:31:06.377807104,2019-10-30 13:31:06.377779166,184577,T,IEX,1760.495000,30
2019-10-30 13:31:06.377850880,2019-10-30 13:31:06.377830025,184578,T,IEX,1760.495000,80
2019-10-30 13:31:10.35346944,2019-10-30 13:31:10.35319116,189104,T,IEX,1760.990000,100
2019-10-30 13:31:13.276515072,2019-10-30 13:31:13.276492239,192783,T,IEX,1761.380000,100
2019-10-30 13:31:13.278304000,2019-10-30 13:31:13.278281251,192786,T,IEX,1761.380000,100
2019-10-30 13:31:17.815851008,2019-10-30 13:31:17.815826318,196469,T,IEX,1761.370000,100
2019-10-30 13:32:33.844844032,2019-10-30 13:32:33.844821593,270641,T,IEX,1763.325000,100
2019-10-30 13:32:44.253174016,2019-10-30 13:32:44.253152596,280038,T,IEX,1763.265000,100
2019-10-30 13:33:04.492434944,2019-10-30 13:33:04.492411946,303362,T,IEX,1762.550000,100
2019-10-30 13:33:19.913125120,2019-10-30 13:33:19.913103945,319148,T,IEX,1763.520000,100
2019-10-30 13:33:21.6587904,2019-10-30 13:33:21.6566671,320297,T,IEX,1763.520000,100
2019-10-30 13:33:40.802526976,2019-10-30 13:33:40.802511302,339716,T,IEX,1765.340000,100
2019-10-30 13:33:41.90221056,2019-10-30 13:33:41.90204811,340007,T,IEX,1765.645000,100
2019-10-30 13:33:51.157796096,2019-10-30 13:33:51.157776183,350032,T,IEX,1765.000000,100
2019-10-30 13:34:41.612857088,2019-10-30 13:34:41.612836855,401919,T,IEX,1763.520000,2
2019-10-30 13:35:00.50343936,2019-10-30 13:35:00.50326174,419198,T,IEX,1762.510000,46
2019-10-30 13:35:10.689532928,2019-10-30 13:35:10.689510552,437547,T,IEX,1761.800000,10
2019-10-30 13:35:10.689634048,2019-10-30 13:35:10.689617340,437548,T,IEX,1761.810000,10
2019-10-30 13:35:25.134327040,2019-10-30 13:35:25.134306175,457577,T,IEX,1762.090000,100
2019-10-30 13:35:54.542451968,2019-10-30 13:35:54.542425604,487657,T,IEX,1763.870000,100
2019-10-30 13:36:36.784040960,2019-10-30 13:36:36.784018714,530482,T,IEX,1763.300000,100
2019-10-30 13:36:37.461625088,2019-10-30 13:36:37.461603725,531381,T,IEX,1762.900000,30
2019-10-30 13:36:40.95062016,2019-10-30 13:36:40.95038188,534706,T,IEX,1762.500000,70
2019-10-30 13:38:16.409921024,2019-10-30 13:38:16.409902315,632278,T,IEX,1761.370000,100
2019-10-30 13:38:41.375002880,2019-10-30 13:38:41.374980641,655438,T,IEX,1761.810000,100
2019-10-30 13:39:37.334974976,2019-10-30 13:39:37.334957664,712092,T,IEX,1761.475000,100
2019-10-30 13:39:37.358384128,2019-10-30 13:39:37.358366418,712113,T,IEX,1761.700000,18
2019-10-30 13:39:51.495298048,2019-10-30 13:39:51.495282096,724786,T,IEX,1761.545000,100
2019-10-30 13:39:52.15190016,2019-10-30 13:39:52.15172924,725715,T,IEX,1761.535000,100
2019-10-30 13:39:56.747459072,2019-10-30 13:39:56.747439612,730964,T,IEX,1761.575000,100
2019-10-30 13:39:56.757492992,2019-10-30 13:39:56.757472481,731010,T,IEX,1762.010000,100
2019-10-30 13:40:27.762787072,2019-10-30 13:40:27.762766761,760910,T,IEX,1760.565000,100
2019-10-30 13:40:31.527683072,2019-10-30 13:40:31.527664893,763736,T,IEX,1760.630000,100
2019-10-30 13:41:11.966260992,2019-10-30 13:41:11.966245274,802114,T,IEX,1761.040000,1
2019-10-30 13:41:11.967112960,2019-10-30 13:41:11.967096656,802118,T,IEX,1761.040000,99
2019-10-30 13:41:11.967136000,2019-10-30 13:41:11.967120356,802119,T,IEX,1761.040000,1
2019-10-30 13:41:28.537829120,2019-10-30 13:41:28.537809261,816560,T,IEX,1761.170000,10
2019-10-30 13:42:11.610245888,2019-10-30 13:42:11.610228786,852919,T,IEX,1762.070000,100
2019-10-30 13:42:29.793659904,2019-10-30 13:42:29.793644128,868551,T,IEX,1763.420000,9
2019-10-30 13:42:38.411963904,2019-10-30 13:42:38.411942946,874917,T,IEX,1763.555000,100
2019-10-30 13:42:41.667105024,2019-10-30 13:42:41.667086677,877486,T,IEX,1763.400000,100
2019-10-30 13:42:58.435632896,2019-10-30 13:42:58.435615575,890002,T,IEX,1763.010000,100
2019-10-30 13:43:00.366158080,2019-10-30 13:43:00.366137060,891379,T,IEX,1762.640000,10
2019-10-30 13:43:57.415001088,2019-10-30 13:43:57.414978412,939114,T,IEX,1763.660000,61
2019-10-30 13:43:57.415021056,2019-10-30 13:43:57.415004947,939115,T,IEX,1763.840000,100
2019-10-30 13:44:26.765349120,2019-10-30 13:44:26.765326775,965898,T,IEX,1763.415000,100
2019-10-30 13:45:16.999473920,2019-10-30 13:45:16.999453738,1011119,T,IEX,1763.570000,5
2019-10-30 13:46:09.261007872,2019-10-30 13:46:09.260986872,1054434,T,IEX,1764.875000,100
2019-10-30 13:47:14.472389120,2019-10-30 13:47:14.472369773,1105240,T,IEX,1765.115000,1
2019-10-30 13:47:20.826824960,2019-10-30 13:47:20.826800426,1109614,T,IEX,1765.550000,1
2019-10-30 13:47:20.841000960,2019-10-30 13:47:20.840981184,1109641,T,IEX,1765.700000,1
2019-10-30 13:47:22.314127872,2019-10-30 13:47:22.314107412,1110968,T,IEX,1765.700000,1
2019-10-30 13:47:22.323929088,2019-10-30 13:47:22.323910664,1110995,T,IEX,1766.230000,2
2019-10-30 13:47:22.342544896,2019-10-30 13:47:22.342524417,1111033,T,IEX,1766.265000,1
2019-10-30 13:47:23.943195904,2019-10-30 13:47:23.943175510,1112338,T,IEX,1766.425000,1
2019-10-30 13:47:40.121629952,2019-10-30 13:47:40.121609175,1127360,T,IEX,1766.570000,1
2019-10-30 13:47:56.680061952,2019-10-30 13:47:56.680044580,1137463,T,IEX,1766.505000,2
2019-10-30 13:47:56.688263936,2019-10-30 13:47:56.688244040,1137465,T,IEX,1766.510000,3
2019-10-30 13:48:03.799568896,2019-10-30 13:48:03.799549691,1143280,T,IEX,1766.250000,1
2019-10-30 13:48:08.196240896,2019-10-30 13:48:08.196221814,1148298,T,IEX,1766.010000,10
2019-10-30 13:48:15.542329088,2019-10-30 13:48:15.542312660,1153982,T,IEX,1766.340000,1
2019-10-30 13:48:34.6548992,2019-10-30 13:48:34.6531179,1167002,T,IEX,1766.410000,1
2019-10-30 13:48:38.449135104,2019-10-30 13:48:38.449116588,1170686,T,IEX,1767.060000,1
2019-10-30 13:48:38.584911104,2019-10-30 13:48:38.584893227,1170751,T,IEX,1767.350000,1
2019-10-30 13:48:41.596898048,2019-10-30 13:48:41.596878826,1173745,T,IEX,1767.480000,1
2019-10-30 13:48:48.158682112,2019-10-30 13:48:48.158665889,1180533,T,IEX,1767.880000,1
2019-10-30 13:48:57.845548032,2019-10-30 13:48:57.845532763,1187593,T,IEX,1767.845000,2
2019-10-30 13:49:06.277504000,2019-10-30 13:49:06.277484584,1193796,T,IEX,1767.670000,1
2019-10-30 13:49:11.365740032,2019-10-30 13:49:11.365719240,1197545,T,IEX,1768.005000,1
2019-10-30 13:49:11.365746944,2019-10-30 13:49:11.365731461,1197546,T,IEX,1768.005000,100
2019-10-30 13:49:14.114838016,2019-10-30 13:49:14.114816709,1199783,T,IEX,1768.400000,1
2019-10-30 13:49:33.694519040,2019-10-30 13:49:33.694498902,1211210,T,IEX,1768.740000,100
2019-10-30 13:49:36.171025920,2019-10-30 13:49:36.171007367,1212824,T,IEX,1768.800000,100
2019-10-30 13:49:36.171333888,2019-10-30 13:49:36.171314660,1212827,T,IEX,1768.710000,1
2019-10-30 13:49:36.697704960,2019-10-30 13:49:36.697683987,1213053,T,IEX,1768.540000,3
2019-10-30 13:49:37.750490112,2019-10-30 13:49:37.750471772,1213730,T,IEX,1768.750000,1
2019-10-30 13:49:38.124797952,2019-10-30 13:49:38.124778627,1214288,T,IEX,1769.140000,1
2019-10-30 13:49:50.560228096,2019-10-30 13:49:50.560212062,1224415,T,IEX,1769.000000,10
2019-10-30 13:49:50.675163904,2019-10-30 13:49:50.675146581,1224517,T,IEX,1768.830000,1
2019-10-30 13:50:02.738466048,2019-10-30 13:50:02.738444828,1232885,T,IEX,1769.050000,2
2019-10-30 13:50:03.294083072,2019-10-30 13:50:03.294056492,1233165,T,IEX,1769.050000,1
2019-10-30 13:50:07.115421952,2019-10-30 13:50:07.115403003,1236021,T,IEX,1769.110000,1
2019-10-30 13:50:10.605275904,2019-10-30 13:50:10.605260379,1239257,T,IEX,1769.480000,1
2019-10-30 13:50:21.2547968,2019-10-30 13:50:21.2529381,1248088,T,IEX,1769.680000,1
2019-10-30 13:50:41.533369088,2019-10-30 13:50:41.533351018,1262303,T,IEX,1769.270000,1
2019-10-30 13:50:43.197231104,2019-10-30 13:50:43.197208567,1263355,T,IEX,1769.125000,100
2019-10-30 13:50:47.35254016,2019-10-30 13:50:47.35235747,1266970,T,IEX,1769.010000,1
2019-10-30 13:50:47.43726080,2019-10-30 13:50:47.43705612,1266971,T,IEX,1768.980000,1
2019-10-30 13:50:50.117711104,2019-10-30 13:50:50.117693214,1269117,T,IEX,1768.930000,1
2019-10-30 13:51:34.623100928,2019-10-30 13:51:34.623084123,1310762,T,IEX,1767.775000,1
2019-10-30 13:51:34.623109888,2019-10-30 13:51:34.623090228,1310763,T,IEX,1767.775000,100
2019-10-30 13:51:45.665039872,2019-10-30 13:51:45.665021779,1318291,T,IEX,1767.520000,100
2019-10-30 13:51:48.990286080,2019-10-30 13:51:48.990269066,1320737,T,IEX,1767.870000,4
2019-10-30 13:52:03.939744000,2019-10-30 13:52:03.939724745,1334323,T,IEX,1767.820000,1
2019-10-30 13:52:03.939761920,2019-10-30 13:52:03.939744645,1334324,T,IEX,1767.820000,100
2019-10-30 13:52:07.395247104,2019-10-30 13:52:07.395229355,1337319,T,IEX,1767.820000,1
2019-10-30 13:52:07.781707008,2019-10-30 13:52:07.781686791,1337950,T,IEX,1768.030000,1
2019-10-30 13:52:08.738464000,2019-10-30 13:52:08.738444880,1338982,T,IEX,1768.125000,1
2019-10-30 13:52:32.839869952,2019-10-30 13:52:32.839852901,1355961,T,IEX,1768.280000,100
2019-10-30 13:53:00.4798976,2019-10-30 13:53:00.4780887,1380617,T,IEX,1768.460000,1
2019-10-30 13:53:03.864004096,2019-10-30 13:53:03.863981512,1384016,T,IEX,1768.500000,14
2019-10-30 13:53:09.205953024,2019-10-30 13:53:09.205931864,1388953,T,IEX,1768.485000,2
2019-10-30 13:53:09.449472000,2019-10-30 13:53:09.449452029,1389240,T,IEX,1768.430000,8
2019-10-30 13:53:14.390765056,2019-10-30 13:53:14.390747157,1393458,T,IEX,1768.765000,1
2019-10-30 13:53:14.553860096,2019-10-30 13:53:14.553840134,1393623,T,IEX,1768.895000,1
2019-10-30 13:53:15.713601024,2019-10-30 13:53:15.713585319,1394818,T,IEX,1769.275000,2
2019-10-30 13:53:16.137776896,2019-10-30 13:53:16.137756518,1395097,T,IEX,1769.280000,48
2019-10-30 13:53:51.581026048,2019-10-30 13:53:51.581005765,1422397,T,IEX,1768.800000,100
2019-10-30 13:54:33.903674880,2019-10-30 13:54:33.903654412,1453072,T,IEX,1768.800000,50
2019-10-30 13:54:33.903682048,2019-10-30 13:54:33.903662843,1453073,T,IEX,1768.910000,50
2019-10-30 13:55:05.782668032,2019-10-30 13:55:05.782650455,1477625,T,IEX,1768.000000,5
2019-10-30 13:55:16.340402944,2019-10-30 13:55:16.340382443,1486129,T,IEX,1767.970000,100
2019-10-30 13:55:47.722895872,2019-10-30 13:55:47.722877881,1508320,T,IEX,1767.455000,1
2019-10-30 13:56:15.69687040,2019-10-30 13:56:15.69665868,1529913,T,IEX,1767.490000,1
2019-10-30 13:56:15.78362112,2019-10-30 13:56:15.78342268,1529928,T,IEX,1767.575000,2
2019-10-30 13:56:37.920009984,2019-10-30 13:56:37.919992588,1544966,T,IEX,1768.130000,1
2019-10-30 13:58:37.172980992,2019-10-30 13:58:37.172963185,1631426,T,IEX,1767.360000,10
2019-10-30 13:59:03.173626112,2019-10-30 13:59:03.173606455,1650155,T,IEX,1766.530000,2
2019-10-30 13:59:09.856346880,2019-10-30 13:59:09.856328215,1655819,T,IEX,1765.805000,2
2019-10-30 13:59:09.896101888,2019-10-30 13:59:09.896080238,1655865,T,IEX,1765.940000,3
2019-10-30 13:59:09.994950912,2019-10-30 13:59:09.994930223,1655927,T,IEX,1765.855000,1
2019-10-30 13:59:24.679013120,2019-10-30 13:59:24.678995616,1666778,T,IEX,1766.370000,1
2019-10-30 13:59:31.518622976,2019-10-30 13:59:31.518605269,1671367,T,IEX,1766.770000,1
2019-10-30 13:59:31.526642944,2019-10-30 13:59:31.526625160,1671396,T,IEX,1766.785000,1
2019-10-30 13:59:48.513219072,2019-10-30 13:59:48.513199025,1681956,T,IEX,1766.975000,1
2019-10-30 14:00:09.155950080,2019-10-30 14:00:09.155930016,1697601,T,IEX,1766.650000,1
2019-10-30 14:00:12.70533888,2019-10-30 14:00:12.70513194,1701313,T,IEX,1765.905000,1
2019-10-30 14:00:13.625011968,2019-10-30 14:00:13.624994144,1703476,T,IEX,1765.905000,49
2019-10-30 14:00:13.625031936,2019-10-30 14:00:13.625014613,1703477,T,IEX,1765.905000,1
2019-10-30 14:00:19.61057024,2019-10-30 14:00:19.61033986,1708406,T,IEX,1765.640000,19
2019-10-30 14:00:19.176899072,2019-10-30 14:00:19.176877074,1708511,T,IEX,1765.640000,40
2019-10-30 14:00:19.412963072,2019-10-30 14:00:19.412941665,1708660,T,IEX,1765.640000,41
2019-10-30 14:00:19.412977920,2019-10-30 14:00:19.412960921,1708661,T,IEX,1765.630000,10
2019-10-30 14:00:22.555661056,2019-10-30 14:00:22.555643182,1711304,T,IEX,1765.500000,2
2019-10-30 14:00:49.44092928,2019-10-30 14:00:49.44073956,1737092,T,IEX,1765.050000,10
2019-10-30 14:00:49.59333120,2019-10-30 14:00:49.59311318,1737119,T,IEX,1764.785000,1
2019-10-30 14:00:52.31994880,2019-10-30 14:00:52.31976608,1741101,T,IEX,1764.790000,1
2019-10-30 14:00:53.96844032,2019-10-30 14:00:53.96825214,1742922,T,IEX,1764.850000,2
2019-10-30 14:03:28.303814912,2019-10-30 14:03:28.303797097,1872240,T,IEX,1766.300000,1
2019-10-30 14:03:53.108322048,2019-10-30 14:03:53.108302805,1890790,T,IEX,1765.695000,1
2019-10-30 14:03:53.143133952,2019-10-30 14:03:53.143114753,1892314,T,IEX,1764.710000,5
2019-10-30 14:03:53.191524096,2019-10-30 14:03:53.191504059,1894142,T,IEX,1764.060000,5
2019-10-30 14:03:53.343709952,2019-10-30 14:03:53.343674140,1899565,T,IEX,1763.085000,15
2019-10-30 14:03:53.353155072,2019-10-30 14:03:53.353135766,1899889,T,IEX,1763.085000,35
2019-10-30 14:03:53.353181952,2019-10-30 14:03:53.353157949,1899892,T,IEX,1763.085000,50
2019-10-30 14:04:11.376291072,2019-10-30 14:04:11.376268335,2028321,T,IEX,1763.270000,1
2019-10-30 14:04:11.376726016,2019-10-30 14:04:11.376702753,2028330,T,IEX,1763.270000,2
2019-10-30 14:04:11.495642112,2019-10-30 14:04:11.495623150,2031123,T,IEX,1763.270000,2
2019-10-30 14:04:11.546916096,2019-10-30 14:04:11.546895932,2031666,T,IEX,1763.270000,2
2019-10-30 14:04:11.570286080,2019-10-30 14:04:11.570267781,2031897,T,IEX,1763.270000,1
2019-10-30 14:04:13.52270080,2019-10-30 14:04:13.52251075,2041520,T,IEX,1763.670000,2
2019-10-30 14:04:13.52280064,2019-10-30 14:04:13.52261493,2041521,T,IEX,1763.670000,2
2019-10-30 14:04:13.52292096,2019-10-30 14:04:13.52272896,2041522,T,IEX,1763.670000,1
2019-10-30 14:04:13.53019904,2019-10-30 14:04:13.52999069,2041539,T,IEX,1763.670000,1
2019-10-30 14:04:13.53847040,2019-10-30 14:04:13.53828707,2041559,T,IEX,1763.670000,2
2019-10-30 14:04:13.53856000,2019-10-30 14:04:13.53836989,2041560,T,IEX,1763.670000,2
2019-10-30 14:04:25.775019008,2019-10-30 14:04:25.774996522,2097428,T,IEX,1765.280000,2
2019-10-30 14:04:25.775030016,2019-10-30 14:04:25.775010429,2097429,T,IEX,1765.280000,3
2019-10-30 14:04:25.775040000,2019-10-30 14:04:25.775022246,2097430,T,IEX,1765.280000,5
2019-10-30 14:04:56.498136064,2019-10-30 14:04:56.498117415,2198367,T,IEX,1765.170000,2
2019-10-30 14:04:56.498929920,2019-10-30 14:04:56.498911826,2198369,T,IEX,1764.560000,9
2019-10-30 14:05:07.6145024,2019-10-30 14:05:07.6126630,2218675,T,IEX,1765.155000,100
2019-10-30 14:06:53.744171008,2019-10-30 14:06:53.744148821,2373736,T,IEX,1764.805000,10
2019-10-30 14:07:35.845155072,2019-10-30 14:07:35.845133582,2425652,T,IEX,1766.810000,47
2019-10-30 14:09:52.171799040,2019-10-30 14:09:52.171781255,2545363,T,IEX,1766.530000,10
2019-10-30 14:11:08.820122880,2019-10-30 14:11:08.820101503,2613931,T,IEX,1767.355000,100
2019-10-30 14:12:54.325419008,2019-10-30 14:12:54.325398634,2688454,T,IEX,1768.050000,10
2019-10-30 14:13:54.2382080,2019-10-30 14:13:54.2363205,2728238,T,IEX,1767.240000,100
2019-10-30 14:14:02.95543040,2019-10-30 14:14:02.95523871,2736590,T,IEX,1766.660000,100
2019-10-30 14:14:04.950679040,2019-10-30 14:14:04.950661477,2739153,T,IEX,1766.640000,10
2019-10-30 14:15:02.81530112,2019-10-30 14:15:02.81509510,2780110,T,IEX,1767.140000,10
2019-10-30 14:15:09.765785088,2019-10-30 14:15:09.765766047,2787294,T,IEX,1767.610000,100
2019-10-30 14:15:53.873943040,2019-10-30 14:15:53.873921433,2822550,T,IEX,1766.370000,100
2019-10-30 14:17:34.913310976,2019-10-30 14:17:34.913295520,2894777,T,IEX,1767.675000,1
2019-10-30 14:17:34.913331968,2019-10-30 14:17:34.913315020,2894778,T,IEX,1767.675000,1
2019-10-30 14:18:58.41984000,2019-10-30 14:18:58.41964854,2949972,T,IEX,1767.990000,10
2019-10-30 14:20:07.447700992,2019-10-30 14:20:07.447682973,3000568,T,IEX,1768.025000,100
2019-10-30 14:22:13.670083072,2019-10-30 14:22:13.670061500,3079344,T,IEX,1767.710000,10
2019-10-30 14:22:20.19023104,2019-10-30 14:22:20.19005839,3083621,T,IEX,1767.000000,5
2019-10-30 14:24:33.598095872,2019-10-30 14:24:33.598076129,3169173,T,IEX,1767.800000,20
2019-10-30 14:25:23.282333952,2019-10-30 14:25:23.282317672,3201045,T,IEX,1767.810000,12
2019-10-30 14:25:47.17100032,2019-10-30 14:25:47.17077278,3216093,T,IEX,1767.560000,1
2019-10-30 14:25:47.262363904,2019-10-30 14:25:47.262343527,3216197,T,IEX,1767.560000,1
2019-10-30 14:25:49.824957952,2019-10-30 14:25:49.824939819,3218255,T,IEX,1767.160000,5
2019-10-30 14:25:49.960180992,2019-10-30 14:25:49.960158996,3218611,T,IEX,1767.180000,100
2019-10-30 14:25:58.411616000,2019-10-30 14:25:58.411597632,3222625,T,IEX,1767.380000,5
2019-10-30 14:25:58.412787968,2019-10-30 14:25:58.412770035,3222629,T,IEX,1767.380000,5
2019-10-30 14:26:04.936913920,2019-10-30 14:26:04.936892368,3226782,T,IEX,1767.395000,1
2019-10-30 14:27:11.5010944,2019-10-30 14:27:11.4988820,3274469,T,IEX,1768.720000,20
2019-10-30 14:27:11.736911872,2019-10-30 14:27:11.736893691,3275169,T,IEX,1768.790000,10
2019-10-30 14:27:11.739975936,2019-10-30 14:27:11.739956322,3275222,T,IEX,1768.790000,5
2019-10-30 14:28:05.867158016,2019-10-30 14:28:05.867134337,3313420,T,IEX,1769.270000,50
2019-10-30 14:28:15.265732096,2019-10-30 14:28:15.265708964,3320299,T,IEX,1769.670000,100
2019-10-30 14:28:38.487617024,2019-10-30 14:28:38.487600949,3337274,T,IEX,1770.130000,100
2019-10-30 14:29:08.58088960,2019-10-30 14:29:08.58068549,3354035,T,IEX,1769.995000,10
2019-10-30 14:29:44.811088896,2019-10-30 14:29:44.811068566,3377494,T,IEX,1769.420000,100
2019-10-30 14:29:44.811105024,2019-10-30 14:29:44.811087516,3377495,T,IEX,1769.400000,100
2019-10-30 14:31:01.225465088,2019-10-30 14:31:01.225439301,3444281,T,IEX,1768.830000,100
2019-10-30 14:31:17.208439040,2019-10-30 14:31:17.208418478,3457433,T,IEX,1768.360000,42
2019-10-30 14:31:18.382256128,2019-10-30 14:31:18.382239199,3458000,T,IEX,1768.360000,15
2019-10-30 14:31:18.494372096,2019-10-30 14:31:18.494349933,3458043,T,IEX,1768.360000,15
2019-10-30 14:32:44.681757952,2019-10-30 14:32:44.681740163,3520508,T,IEX,1768.940000,5
2019-10-30 14:32:44.681848064,2019-10-30 14:32:44.681831487,3520509,T,IEX,1768.970000,5
2019-10-30 14:32:44.681946880,2019-10-30 14:32:44.681929208,3520512,T,IEX,1768.780000,83
2019-10-30 14:33:02.879169024,2019-10-30 14:33:02.879147123,3533196,T,IEX,1768.630000,1
2019-10-30 14:34:53.488122112,2019-10-30 14:34:53.488100524,3602933,T,IEX,1769.070000,30
2019-10-30 14:35:26.626806016,2019-10-30 14:35:26.626783322,3630520,T,IEX,1770.420000,4
2019-10-30 14:35:59.757430016,2019-10-30 14:35:59.757410444,3655003,T,IEX,1770.380000,1
2019-10-30 14:36:11.523886080,2019-10-30 14:36:11.523867417,3664078,T,IEX,1771.365000,100
2019-10-30 14:36:22.377912064,2019-10-30 14:36:22.377893903,3671324,T,IEX,1771.290000,5
2019-10-30 14:36:54.898478080,2019-10-30 14:36:54.898459340,3700179,T,IEX,1771.270000,1
2019-10-30 14:37:09.454625024,2019-10-30 14:37:09.454604480,3710052,T,IEX,1772.250000,100
2019-10-30 14:38:38.388640000,2019-10-30 14:38:38.388622906,3770939,T,IEX,1771.900000,100
2019-10-30 14:39:18.227100928,2019-10-30 14:39:18.227082590,3800116,T,IEX,1771.700000,5
2019-10-30 14:40:30.598323968,2019-10-30 14:40:30.598303011,3847343,T,IEX,1772.505000,5
2019-10-30 14:40:41.321676032,2019-10-30 14:40:41.321653062,3853632,T,IEX,1772.530000,8
2019-10-30 14:44:05.649008896,2019-10-30 14:44:05.648990685,3984870,T,IEX,1771.670000,10
2019-10-30 14:47:02.93142016,2019-10-30 14:47:02.93124712,4097989,T,IEX,1773.995000,50
2019-10-30 14:47:47.932411904,2019-10-30 14:47:47.932392654,4124529,T,IEX,1774.180000,1
2019-10-30 14:47:47.932423936,2019-10-30 14:47:47.932405589,4124530,T,IEX,1774.090000,4
2019-10-30 14:50:04.692389120,2019-10-30 14:50:04.692367813,4208341,T,IEX,1774.680000,10
2019-10-30 14:50:15.19235072,2019-10-30 14:50:15.19216332,4215157,T,IEX,1775.210000,2
2019-10-30 14:50:15.19254016,2019-10-30 14:50:15.19236301,4215158,T,IEX,1775.210000,50
2019-10-30 14:50:20.386384896,2019-10-30 14:50:20.386363020,4218329,T,IEX,1775.100000,41
2019-10-30 14:51:45.171028992,2019-10-30 14:51:45.171008123,4268965,T,IEX,1776.530000,4
2019-10-30 14:52:04.424736000,2019-10-30 14:52:04.424715909,4280189,T,IEX,1777.170000,10
2019-10-30 14:52:04.424953088,2019-10-30 14:52:04.424935612,4280190,T,IEX,1777.060000,5
2019-10-30 14:52:51.614330880,2019-10-30 14:52:51.614310510,4308072,T,IEX,1777.570000,100
2019-10-30 14:52:54.11685120,2019-10-30 14:52:54.11664494,4309019,T,IEX,1777.775000,100
2019-10-30 14:52:57.356655104,2019-10-30 14:52:57.356634795,4310849,T,IEX,1777.620000,1
2019-10-30 14:54:23.977817088,2019-10-30 14:54:23.977795884,4366442,T,IEX,1779.275000,1
2019-10-30 14:55:35.747677952,2019-10-30 14:55:35.747654934,4406199,T,IEX,1779.330000,10
2019-10-30 14:56:32.786661120,2019-10-30 14:56:32.786639487,4440669,T,IEX,1777.835000,100
2019-10-30 14:56:52.256057088,2019-10-30 14:56:52.256035980,4450653,T,IEX,1777.760000,10
2019-10-30 14:57:13.669982976,2019-10-30 14:57:13.669963912,4462346,T,IEX,1778.340000,50
2019-10-30 14:57:13.669996032,2019-10-30 14:57:13.669978158,4462347,T,IEX,1778.350000,2
2019-10-30 14:58:29.350358016,2019-10-30 14:58:29.350338343,4509005,T,IEX,1777.270000,3
2019-10-30 14:59:24.694949888,2019-10-30 14:59:24.694930392,4543633,T,IEX,1778.325000,4
2019-10-30 15:00:05.800617984,2019-10-30 15:00:05.800597375,4566842,T,IEX,1778.990000,10
2019-10-30 15:02:29.153152000,2019-10-30 15:02:29.153135102,4664537,T,IEX,1777.500000,62
2019-10-30 15:03:00.609342976,2019-10-30 15:03:00.609322747,4682770,T,IEX,1776.470000,1
2019-10-30 15:03:21.482822912,2019-10-30 15:03:21.482802299,4697596,T,IEX,1775.500000,50
2019-10-30 15:03:21.482833920,2019-10-30 15:03:21.482815308,4697597,T,IEX,1775.430000,50
2019-10-30 15:06:24.148647936,2019-10-30 15:06:24.148628025,4803967,T,IEX,1775.100000,50
2019-10-30 15:06:24.148663040,2019-10-30 15:06:24.148645295,4803968,T,IEX,1775.070000,50
2019-10-30 15:09:34.5649920,2019-10-30 15:09:34.5632674,4906896,T,IEX,1774.000000,4
2019-10-30 15:09:53.213927936,2019-10-30 15:09:53.213907911,4916799,T,IEX,1773.660000,10
2019-10-30 15:10:14.744012032,2019-10-30 15:10:14.743994789,4927705,T,IEX,1773.660000,14
2019-10-30 15:12:57.739006976,2019-10-30 15:12:57.738986218,5007480,T,IEX,1776.245000,2
2019-10-30 15:12:57.739025920,2019-10-30 15:12:57.739008327,5007481,T,IEX,1776.245000,10
2019-10-30 15:13:11.285502976,2019-10-30 15:13:11.285483380,5014609,T,IEX,1776.110000,2
2019-10-30 15:15:34.561673984,2019-10-30 15:15:34.561655425,5097594,T,IEX,1774.140000,10
2019-10-30 15:16:36.140140032,2019-10-30 15:16:36.140118768,5127716,T,IEX,1773.430000,2
2019-10-30 15:17:08.288898048,2019-10-30 15:17:08.288877353,5147048,T,IEX,1772.770000,50
2019-10-30 15:17:08.288911104,2019-10-30 15:17:08.288893724,5147049,T,IEX,1772.740000,50
2019-10-30 15:17:47.822757120,2019-10-30 15:17:47.822737303,5166205,T,IEX,1773.340000,40
2019-10-30 15:18:29.96410112,2019-10-30 15:18:29.96392963,5185692,T,IEX,1772.550000,41
2019-10-30 15:18:56.411740928,2019-10-30 15:18:56.411719333,5202676,T,IEX,1772.440000,50
2019-10-30 15:20:04.490149888,2019-10-30 15:20:04.490132355,5237644,T,IEX,1771.770000,148
2019-10-30 15:20:08.143316992,2019-10-30 15:20:08.143294709,5240790,T,IEX,1771.630000,100
2019-10-30 15:20:25.695525888,2019-10-30 15:20:25.695506314,5255859,T,IEX,1771.570000,1
2019-10-30 15:24:52.446872064,2019-10-30 15:24:52.446851118,5408127,T,IEX,1772.775000,100
2019-10-30 15:25:21.115459072,2019-10-30 15:25:21.115438811,5427589,T,IEX,1772.270000,100
2019-10-30 15:25:26.658542080,2019-10-30 15:25:26.658521897,5431141,T,IEX,1771.900000,4
2019-10-30 15:25:49.798265088,2019-10-30 15:25:49.798246564,5441934,T,IEX,1772.000000,10
2019-10-30 15:27:57.945340928,2019-10-30 15:27:57.945320518,5510137,T,IEX,1773.440000,100
2019-10-30 15:36:50.457912064,2019-10-30 15:36:50.457890604,5809301,T,IEX,1772.530000,100
2019-10-30 15:38:33.85282048,2019-10-30 15:38:33.85260788,5861014,T,IEX,1771.765000,10
2019-10-30 15:39:07.384637952,2019-10-30 15:39:07.384617918,5881455,T,IEX,1771.560000,1
2019-10-30 15:39:07.385703936,2019-10-30 15:39:07.385687735,5881474,T,IEX,1771.600000,5
2019-10-30 15:39:07.386817024,2019-10-30 15:39:07.386799400,5881481,T,IEX,1771.600000,44
2019-10-30 15:40:00.665382912,2019-10-30 15:40:00.665361160,5909279,T,IEX,1770.910000,100
2019-10-30 15:40:28.565500928,2019-10-30 15:40:28.565483658,5922048,T,IEX,1771.000000,5
2019-10-30 15:42:07.843718912,2019-10-30 15:42:07.843700169,5988085,T,IEX,1771.210000,10
2019-10-30 15:42:49.78146048,2019-10-30 15:42:49.78126208,6011047,T,IEX,1770.030000,100
2019-10-30 15:42:49.79755008,2019-10-30 15:42:49.79735244,6011048,T,IEX,1770.020000,100
2019-10-30 15:42:50.258914048,2019-10-30 15:42:50.258895421,6011871,T,IEX,1769.790000,1
2019-10-30 15:47:17.408406016,2019-10-30 15:47:17.408382989,6161340,T,IEX,1768.780000,25
2019-10-30 15:53:02.562002944,2019-10-30 15:53:02.561981648,6349279,T,IEX,1771.550000,5
2019-10-30 15:53:02.562191872,2019-10-30 15:53:02.562174957,6349280,T,IEX,1771.560000,5
2019-10-30 15:53:11.708635904,2019-10-30 15:53:11.708615464,6353536,T,IEX,1771.305000,1
2019-10-30 15:54:38.782653952,2019-10-30 15:54:38.782632495,6398225,T,IEX,1770.910000,7
2019-10-30 15:56:05.756982016,2019-10-30 15:56:05.756963595,6444056,T,IEX,1773.140000,5
2019-10-30 16:02:20.523315968,2019-10-30 16:02:20.523296374,6652340,T,IEX,1771.610000,85
2019-10-30 16:02:30.6136064,2019-10-30 16:02:30.6113062,6658756,T,IEX,1771.600000,1
2019-10-30 16:03:02.730152960,2019-10-30 16:03:02.730133101,6681040,T,IEX,1771.120000,10
2019-10-30 16:13:30.690232064,2019-10-30 16:13:30.690213139,6995258,T,IEX,1770.320000,10
2019-10-30 16:14:23.495341056,2019-10-30 16:14:23.495324694,7022474,T,IEX,1769.540000,6
2019-10-30 16:15:31.57849088,2019-10-30 16:15:31.57828670,7058543,T,IEX,1769.380000,2
2019-10-30 16:20:24.977720064,2019-10-30 16:20:24.977697380,7190275,T,IEX,1768.670000,49
2019-10-30 16:20:24.978099968,2019-10-30 16:20:24.978080015,7190284,T,IEX,1768.670000,148
2019-10-30 16:24:48.93442048,2019-10-30 16:24:48.93420598,7302726,T,IEX,1769.535000,300
2019-10-30 16:24:51.647872000,2019-10-30 16:24:51.647854762,7304276,T,IEX,1769.770000,89
2019-10-30 16:25:55.658336000,2019-10-30 16:25:55.658318502,7332330,T,IEX,1769.470000,10
2019-10-30 16:28:11.498676992,2019-10-30 16:28:11.498658403,7400357,T,IEX,1769.920000,100
2019-10-30 16:28:11.498691072,2019-10-30 16:28:11.498674858,7400358,T,IEX,1770.130000,100
2019-10-30 16:28:11.512229120,2019-10-30 16:28:11.512206498,7400361,T,IEX,1770.130000,100
2019-10-30 16:28:11.512235008,2019-10-30 16:28:11.512215221,7400362,T,IEX,1770.160000,100
2019-10-30 16:28:56.393274880,2019-10-30 16:28:56.393253740,7421555,T,IEX,1769.440000,1
2019-10-30 16:32:55.413565952,2019-10-30 16:32:55.413549875,7526749,T,IEX,1768.285000,4
2019-10-30 16:34:04.776550912,2019-10-30 16:34:04.776534830,7557660,T,IEX,1768.275000,1
2019-10-30 16:34:51.668169984,2019-10-30 16:34:51.668152481,7578731,T,IEX,1768.220000,10
2019-10-30 16:35:29.737809920,2019-10-30 16:35:29.737787478,7595735,T,IEX,1767.320000,15
2019-10-30 16:35:29.737844992,2019-10-30 16:35:29.737827386,7595736,T,IEX,1767.320000,15
2019-10-30 16:38:14.303689984,2019-10-30 16:38:14.303674168,7655618,T,IEX,1767.670000,1
2019-10-30 16:41:57.76251904,2019-10-30 16:41:57.76235430,7739052,T,IEX,1768.120000,4
2019-10-30 16:45:11.837765120,2019-10-30 16:45:11.837746595,7811036,T,IEX,1767.630000,10
2019-10-30 16:47:23.572985088,2019-10-30 16:47:23.572966879,7852792,T,IEX,1766.685000,1
2019-10-30 16:53:27.320411904,2019-10-30 16:53:27.320393168,7982609,T,IEX,1766.390000,10
2019-10-30 16:55:06.678735872,2019-10-30 16:55:06.678715706,8016550,T,IEX,1765.505000,2
2019-10-30 16:55:06.678758912,2019-10-30 16:55:06.678741486,8016551,T,IEX,1765.505000,10
2019-10-30 16:57:00.753497088,2019-10-30 16:57:00.753476803,8052927,T,IEX,1765.510000,1
2019-10-30 16:57:00.868488960,2019-10-30 16:57:00.868467579,8052962,T,IEX,1765.500000,1
2019-10-30 17:01:42.321115904,2019-10-30 17:01:42.321094936,8158973,T,IEX,1765.450000,1
2019-10-30 17:05:27.202265088,2019-10-30 17:05:27.202246838,8239139,T,IEX,1765.295000,10
2019-10-30 17:05:27.211301120,2019-10-30 17:05:27.211281449,8239140,T,IEX,1765.030000,100
2019-10-30 17:06:52.584182016,2019-10-30 17:06:52.584153971,8277240,T,IEX,1765.260000,50
2019-10-30 17:08:02.796861952,2019-10-30 17:08:02.796841258,8299659,T,IEX,1765.990000,100
2019-10-30 17:13:13.867678976,2019-10-30 17:13:13.867659023,8401878,T,IEX,1767.360000,1
2019-10-30 17:15:42.215282944,2019-10-30 17:15:42.215266388,8446886,T,IEX,1767.670000,49
2019-10-30 17:16:03.533082880,2019-10-30 17:16:03.533063606,8452810,T,IEX,1767.750000,10
2019-10-30 17:18:37.73325056,2019-10-30 17:18:37.73304184,8501948,T,IEX,1767.115000,100
2019-10-30 17:25:04.63158016,2019-10-30 17:25:04.63138022,8620374,T,IEX,1768.430000,50
2019-10-30 17:26:29.573135872,2019-10-30 17:26:29.573116909,8649958,T,IEX,1768.590000,10
2019-10-30 17:30:10.297075968,2019-10-30 17:30:10.297055399,8724662,T,IEX,1768.010000,50
2019-10-30 17:30:10.297089024,2019-10-30 17:30:10.297071443,8724663,T,IEX,1768.180000,50
2019-10-30 17:33:19.815198976,2019-10-30 17:33:19.815179914,8785283,T,IEX,1768.100000,100
2019-10-30 17:37:06.784276992,2019-10-30 17:37:06.784261649,8872505,T,IEX,1767.350000,50
2019-10-30 17:37:06.784291072,2019-10-30 17:37:06.784274607,8872506,T,IEX,1767.430000,34
2019-10-30 17:37:12.212945920,2019-10-30 17:37:12.212924978,8874036,T,IEX,1767.200000,5
2019-10-30 17:37:12.213789952,2019-10-30 17:37:12.213771146,8874044,T,IEX,1767.240000,5
2019-10-30 17:42:39.465807104,2019-10-30 17:42:39.465789478,8972845,T,IEX,1768.785000,100
2019-10-30 17:42:49.165267968,2019-10-30 17:42:49.165251768,8975530,T,IEX,1768.670000,2
2019-10-30 17:43:46.805853952,2019-10-30 17:43:46.805829473,8992400,T,IEX,1768.620000,100
2019-10-30 17:44:51.14981120,2019-10-30 17:44:51.14961603,9014552,T,IEX,1768.985000,15
2019-10-30 17:45:03.327142912,2019-10-30 17:45:03.327123680,9018822,T,IEX,1768.580000,45
2019-10-30 17:45:15.104368128,2019-10-30 17:45:15.104351337,9023314,T,IEX,1768.250000,5
2019-10-30 17:45:18.844035072,2019-10-30 17:45:18.844013518,9024920,T,IEX,1768.220000,3
2019-10-30 17:47:32.772249088,2019-10-30 17:47:32.772227104,9072547,T,IEX,1767.920000,3
2019-10-30 17:47:38.395437056,2019-10-30 17:47:38.395419381,9090072,T,IEX,1769.570000,64
2019-10-30 17:47:46.413850880,2019-10-30 17:47:46.413829864,9118713,T,IEX,1768.410000,23
2019-10-30 17:49:41.702273024,2019-10-30 17:49:41.702254453,9182201,T,IEX,1768.130000,5
2019-10-30 17:49:41.703334912,2019-10-30 17:49:41.703319792,9182203,T,IEX,1768.130000,5
2019-10-30 17:49:42.414001920,2019-10-30 17:49:42.413980710,9183506,T,IEX,1768.070000,46
2019-10-30 17:50:43.441952000,2019-10-30 17:50:43.441932274,9211662,T,IEX,1767.740000,100
2019-10-30 17:52:22.188377088,2019-10-30 17:52:22.188355208,9249816,T,IEX,1767.590000,22
2019-10-30 17:53:11.889935872,2019-10-30 17:53:11.889917961,9269190,T,IEX,1767.755000,100
2019-10-30 17:55:32.558031872,2019-10-30 17:55:32.558011308,9330331,T,IEX,1767.740000,10
2019-10-30 17:55:57.357966080,2019-10-30 17:55:57.357947897,9348896,T,IEX,1767.675000,100
2019-10-30 17:56:42.206944000,2019-10-30 17:56:42.206925077,9365442,T,IEX,1767.825000,1
2019-10-30 17:58:35.843731968,2019-10-30 17:58:35.843713533,9412675,T,IEX,1767.710000,100
2019-10-30 17:58:42.250217984,2019-10-30 17:58:42.250199487,9415558,T,IEX,1767.710000,109
2019-10-30 17:59:25.752423936,2019-10-30 17:59:25.752395579,9437769,T,IEX,1767.150000,10
2019-10-30 17:59:25.753197056,2019-10-30 17:59:25.753178197,9437806,T,IEX,1767.150000,5
2019-10-30 17:59:25.755510016,2019-10-30 17:59:25.755491764,9437907,T,IEX,1767.190000,200
2019-10-30 17:59:25.756515072,2019-10-30 17:59:25.756496018,9437957,T,IEX,1767.140000,8
2019-10-30 17:59:36.205903872,2019-10-30 17:59:36.205882314,9443293,T,IEX,1767.485000,100
2019-10-30 17:59:42.324723968,2019-10-30 17:59:42.324701386,9446073,T,IEX,1767.630000,100
2019-10-30 17:59:47.917836032,2019-10-30 17:59:47.917817975,9449383,T,IEX,1767.445000,200
2019-10-30 17:59:48.674330112,2019-10-30 17:59:48.674309946,9450217,T,IEX,1767.330000,100
2019-10-30 17:59:48.674949120,2019-10-30 17:59:48.674930793,9450227,T,IEX,1767.545000,100
2019-10-30 17:59:54.716948992,2019-10-30 17:59:54.716929894,9456828,T,IEX,1767.500000,100
2019-10-30 18:00:01.47128064,2019-10-30 18:00:01.47109518,9460463,T,IEX,1765.130000,100
2019-10-30 18:00:01.160069120,2019-10-30 18:00:01.160051317,9461703,T,IEX,1765.235000,100
2019-10-30 18:00:04.6061056,2019-10-30 18:00:04.6040966,9466404,T,IEX,1765.235000,200
2019-10-30 18:00:06.10362880,2019-10-30 18:00:06.10343451,9467809,T,IEX,1767.160000,100
2019-10-30 18:00:06.12131072,2019-10-30 18:00:06.12111255,9467810,T,IEX,1767.560000,100
2019-10-30 18:00:16.44983040,2019-10-30 18:00:16.44966064,9486194,T,IEX,1766.010000,4
2019-10-30 18:01:18.650661888,2019-10-30 18:01:18.650640800,9594222,T,IEX,1768.940000,100
2019-10-30 18:09:12.218654976,2019-10-30 18:09:12.218637272,10005844,T,IEX,1768.770000,10
2019-10-30 18:10:34.861502976,2019-10-30 18:10:34.861480556,10067030,T,IEX,1770.920000,5
2019-10-30 18:11:44.183578880,2019-10-30 18:11:44.183558737,10132974,T,IEX,1772.670000,4
2019-10-30 18:12:21.399398912,2019-10-30 18:12:21.399382601,10160639,T,IEX,1773.295000,2
2019-10-30 18:13:26.946607104,2019-10-30 18:13:26.946585298,10199680,T,IEX,1773.800000,2
2019-10-30 18:13:26.972178944,2019-10-30 18:13:26.972156757,10199783,T,IEX,1773.860000,5
2019-10-30 18:14:21.663464960,2019-10-30 18:14:21.663446705,10229043,T,IEX,1774.670000,1
2019-10-30 18:14:30.767022080,2019-10-30 18:14:30.767002998,10234338,T,IEX,1774.760000,4
2019-10-30 18:14:39.634001920,2019-10-30 18:14:39.633982832,10239098,T,IEX,1775.000000,10
2019-10-30 18:14:39.787768064,2019-10-30 18:14:39.787748608,10239180,T,IEX,1775.000000,20
2019-10-30 18:16:06.985096960,2019-10-30 18:16:06.985076098,10316395,T,IEX,1777.210000,3
2019-10-30 18:16:15.600549120,2019-10-30 18:16:15.600520415,10324505,T,IEX,1777.980000,50
2019-10-30 18:16:32.893582080,2019-10-30 18:16:32.893561454,10335349,T,IEX,1778.000000,1
2019-10-30 18:16:52.916192000,2019-10-30 18:16:52.916170637,10348473,T,IEX,1778.200000,13
2019-10-30 18:17:07.29774080,2019-10-30 18:17:07.29752338,10357441,T,IEX,1778.205000,5
2019-10-30 18:17:07.29940992,2019-10-30 18:17:07.29923860,10357442,T,IEX,1778.205000,50
2019-10-30 18:17:15.849931008,2019-10-30 18:17:15.849911371,10362992,T,IEX,1777.980000,3
2019-10-30 18:17:19.985960960,2019-10-30 18:17:19.985941051,10365655,T,IEX,1778.200000,5
2019-10-30 18:17:19.988185088,2019-10-30 18:17:19.988167347,10365724,T,IEX,1778.200000,27
2019-10-30 18:17:37.539161088,2019-10-30 18:17:37.539139573,10378283,T,IEX,1777.490000,2
2019-10-30 18:17:40.386772992,2019-10-30 18:17:40.386753425,10379580,T,IEX,1777.400000,2
2019-10-30 18:18:36.152924928,2019-10-30 18:18:36.152906591,10418776,T,IEX,1776.320000,5
2019-10-30 18:18:36.153329920,2019-10-30 18:18:36.153314493,10418779,T,IEX,1776.260000,17
2019-10-30 18:18:36.153345024,2019-10-30 18:18:36.153326764,10418780,T,IEX,1776.260000,5
2019-10-30 18:18:56.19227904,2019-10-30 18:18:56.19204820,10436616,T,IEX,1775.040000,5
2019-10-30 18:18:56.45537024,2019-10-30 18:18:56.45517196,10437435,T,IEX,1775.000000,2
2019-10-30 18:19:00.998746112,2019-10-30 18:19:00.998727370,10442277,T,IEX,1775.150000,100
2019-10-30 18:19:47.865381120,2019-10-30 18:19:47.865362742,10473279,T,IEX,1775.020000,2
2019-10-30 18:20:26.880556032,2019-10-30 18:20:26.880535594,10495549,T,IEX,1775.410000,50
2019-10-30 18:20:26.880567040,2019-10-30 18:20:26.880548728,10495550,T,IEX,1775.370000,50
2019-10-30 18:26:12.356638976,2019-10-30 18:26:12.356618707,10689086,T,IEX,1773.160000,2
2019-10-30 18:26:44.455904000,2019-10-30 18:26:44.455882966,10707743,T,IEX,1773.150000,100
2019-10-30 18:26:58.964313088,2019-10-30 18:26:58.964297622,10714539,T,IEX,1772.760000,2
2019-10-30 18:27:34.873126912,2019-10-30 18:27:34.873109385,10730096,T,IEX,1772.500000,1
2019-10-30 18:28:15.165433088,2019-10-30 18:28:15.165413448,10751758,T,IEX,1772.745000,100
2019-10-30 18:28:44.54528000,2019-10-30 18:28:44.54507620,10766293,T,IEX,1772.200000,1
2019-10-30 18:28:44.583252992,2019-10-30 18:28:44.583232547,10766451,T,IEX,1772.015000,100
2019-10-30 18:28:53.325132032,2019-10-30 18:28:53.325113125,10769884,T,IEX,1771.650000,100
2019-10-30 18:28:57.686575104,2019-10-30 18:28:57.686555281,10771496,T,IEX,1771.320000,100
2019-10-30 18:29:03.397756928,2019-10-30 18:29:03.397740063,10774793,T,IEX,1771.210000,2
2019-10-30 18:29:05.821373952,2019-10-30 18:29:05.821352503,10775925,T,IEX,1771.405000,1
2019-10-30 18:29:19.8894976,2019-10-30 18:29:19.8872288,10783732,T,IEX,1771.250000,10
2019-10-30 18:29:19.15851008,2019-10-30 18:29:19.15832283,10783736,T,IEX,1771.040000,3
2019-10-30 18:29:19.15863040,2019-10-30 18:29:19.15845616,10783737,T,IEX,1771.040000,100
2019-10-30 18:29:40.445861120,2019-10-30 18:29:40.445841200,10791901,T,IEX,1770.945000,100
2019-10-30 18:30:41.558330880,2019-10-30 18:30:41.558309840,10821096,T,IEX,1772.390000,100
2019-10-30 18:30:41.559307008,2019-10-30 18:30:41.559286953,10821097,T,IEX,1772.390000,100
2019-10-30 18:31:18.315403008,2019-10-30 18:31:18.315377480,10858910,T,IEX,1771.445000,1
2019-10-30 18:31:46.847308032,2019-10-30 18:31:46.847289920,10891175,T,IEX,1770.445000,100
2019-10-30 18:31:55.349078016,2019-10-30 18:31:55.349056966,10897892,T,IEX,1770.440000,1
2019-10-30 18:32:17.846259968,2019-10-30 18:32:17.846239113,10914784,T,IEX,1771.095000,2
2019-10-30 18:33:17.322748928,2019-10-30 18:33:17.322729835,10950046,T,IEX,1770.680000,100
2019-10-30 18:34:07.231378944,2019-10-30 18:34:07.231361180,11005717,T,IEX,1769.200000,100
2019-10-30 18:35:45.229832960,2019-10-30 18:35:45.229815735,11120938,T,IEX,1771.000000,100
2019-10-30 18:37:08.360322048,2019-10-30 18:37:08.360302959,11223076,T,IEX,1770.160000,100
2019-10-30 18:39:09.941773056,2019-10-30 18:39:09.941753699,11353372,T,IEX,1769.170000,95
2019-10-30 18:39:35.946209024,2019-10-30 18:39:35.946188734,11382280,T,IEX,1769.420000,8
2019-10-30 18:39:35.950081024,2019-10-30 18:39:35.950061427,11382408,T,IEX,1769.410000,2
2019-10-30 18:40:08.624035072,2019-10-30 18:40:08.624013522,11428946,T,IEX,1770.060000,1
2019-10-30 18:40:29.142883072,2019-10-30 18:40:29.142862409,11448403,T,IEX,1770.640000,51
2019-10-30 18:40:29.143644928,2019-10-30 18:40:29.143627564,11448432,T,IEX,1770.640000,49
2019-10-30 18:41:24.377912064,2019-10-30 18:41:24.377893431,11497067,T,IEX,1771.170000,1
2019-10-30 18:44:19.248633088,2019-10-30 18:44:19.248616270,11652540,T,IEX,1775.000000,5
2019-10-30 18:46:36.706944000,2019-10-30 18:46:36.706924316,11757197,T,IEX,1775.200000,100
2019-10-30 18:49:22.877630976,2019-10-30 18:49:22.877614953,11858784,T,IEX,1775.110000,40
2019-10-30 18:49:42.348602112,2019-10-30 18:49:42.348584317,11869387,T,IEX,1775.145000,100
2019-10-30 18:50:04.653564928,2019-10-30 18:50:04.653544338,11895615,T,IEX,1776.250000,50
2019-10-30 18:50:13.809170944,2019-10-30 18:50:13.809148763,11910482,T,IEX,1776.370000,1
2019-10-30 18:50:29.58580992,2019-10-30 18:50:29.58564102,11940145,T,IEX,1777.075000,10
2019-10-30 18:51:37.190917120,2019-10-30 18:51:37.190897426,12018610,T,IEX,1778.060000,10
2019-10-30 18:52:27.596989952,2019-10-30 18:52:27.596971368,12078060,T,IEX,1777.710000,1
2019-10-30 18:52:30.430584064,2019-10-30 18:52:30.430567187,12080309,T,IEX,1778.210000,50
2019-10-30 18:52:30.430597888,2019-10-30 18:52:30.430580247,12080310,T,IEX,1778.280000,100
2019-10-30 18:52:30.430608896,2019-10-30 18:52:30.430592696,12080311,T,IEX,1778.290000,50
2019-10-30 18:53:03.31962112,2019-10-30 18:53:03.31939456,12110640,T,IEX,1777.590000,10
2019-10-30 18:53:03.258673920,2019-10-30 18:53:03.258652177,12110784,T,IEX,1777.580000,2
2019-10-30 18:53:16.14128896,2019-10-30 18:53:16.14109679,12121734,T,IEX,1778.270000,5
2019-10-30 18:54:11.404930048,2019-10-30 18:54:11.404912676,12166760,T,IEX,1779.065000,100
2019-10-30 18:54:46.305278976,2019-10-30 18:54:46.305259435,12192893,T,IEX,1778.790000,3
2019-10-30 18:54:46.305294080,2019-10-30 18:54:46.305275769,12192894,T,IEX,1778.770000,2
2019-10-30 18:56:26.423226880,2019-10-30 18:56:26.423209541,12301568,T,IEX,1779.060000,4
2019-10-30 18:56:45.217048064,2019-10-30 18:56:45.217027983,12322937,T,IEX,1778.755000,1
2019-10-30 18:58:21.652336128,2019-10-30 18:58:21.652320824,12398229,T,IEX,1779.100000,7
2019-10-30 18:59:31.777800960,2019-10-30 18:59:31.777779431,12453025,T,IEX,1779.230000,1
2019-10-30 19:00:05.578672896,2019-10-30 19:00:05.578655915,12483022,T,IEX,1780.090000,6
2019-10-30 19:00:05.579888128,2019-10-30 19:00:05.579868226,12483025,T,IEX,1780.090000,10
2019-10-30 19:00:05.584653056,2019-10-30 19:00:05.584633835,12483034,T,IEX,1780.075000,24
2019-10-30 19:00:36.465778944,2019-10-30 19:00:36.465760222,12511902,T,IEX,1779.780000,10
2019-10-30 19:01:24.477658880,2019-10-30 19:01:24.477635669,12543672,T,IEX,1779.190000,5
2019-10-30 19:01:45.922032128,2019-10-30 19:01:45.922014274,12554443,T,IEX,1779.100000,1
2019-10-30 19:04:12.938254080,2019-10-30 19:04:12.938233636,12669163,T,IEX,1780.880000,100
2019-10-30 19:04:13.967782912,2019-10-30 19:04:13.967765600,12669767,T,IEX,1780.890000,100
2019-10-30 19:05:25.25840128,2019-10-30 19:05:25.25819288,12710380,T,IEX,1780.640000,3
2019-10-30 19:06:07.689927936,2019-10-30 19:06:07.689907814,12734819,T,IEX,1780.850000,1
2019-10-30 19:06:50.200142080,2019-10-30 19:06:50.200125374,12757635,T,IEX,1779.400000,100
2019-10-30 19:06:57.210614016,2019-10-30 19:06:57.210596927,12762339,T,IEX,1779.200000,7
2019-10-30 19:08:21.230322944,2019-10-30 19:08:21.230300790,12826491,T,IEX,1779.785000,100
2019-10-30 19:08:26.343816960,2019-10-30 19:08:26.343796651,12829171,T,IEX,1779.785000,100
2019-10-30 19:08:26.515440896,2019-10-30 19:08:26.515420856,12829320,T,IEX,1779.705000,100
2019-10-30 19:08:29.594695936,2019-10-30 19:08:29.594678387,12831772,T,IEX,1779.635000,100
2019-10-30 19:08:49.383393024,2019-10-30 19:08:49.383374850,12847424,T,IEX,1779.330000,1
2019-10-30 19:08:56.604572928,2019-10-30 19:08:56.604553644,12852630,T,IEX,1779.280000,21
2019-10-30 19:09:21.743076096,2019-10-30 19:09:21.743056994,12871447,T,IEX,1779.490000,9
2019-10-30 19:10:23.604387072,2019-10-30 19:10:23.604367850,12907427,T,IEX,1780.090000,100
2019-10-30 19:11:00.817832960,2019-10-30 19:11:00.817812463,12934190,T,IEX,1780.425000,1
2019-10-30 19:11:01.937252096,2019-10-30 19:11:01.937235226,12935263,T,IEX,1780.425000,1
2019-10-30 19:11:16.109449984,2019-10-30 19:11:16.109431010,12943997,T,IEX,1780.180000,1
2019-10-30 19:11:46.582388992,2019-10-30 19:11:46.582368216,12961075,T,IEX,1779.900000,10
2019-10-30 19:13:26.935457024,2019-10-30 19:13:26.935437436,13028068,T,IEX,1778.655000,5
2019-10-30 19:14:09.338077952,2019-10-30 19:14:09.338056940,13054603,T,IEX,1778.640000,5
2019-10-30 19:14:11.906759936,2019-10-30 19:14:11.906738322,13057025,T,IEX,1778.730000,10
2019-10-30 19:14:29.961188096,2019-10-30 19:14:29.961168414,13065499,T,IEX,1778.410000,100
2019-10-30 19:14:29.964459008,2019-10-30 19:14:29.964438059,13065514,T,IEX,1778.400000,17
2019-10-30 19:16:59.273609984,2019-10-30 19:16:59.273591345,13154356,T,IEX,1778.330000,10
2019-10-30 19:16:59.273940992,2019-10-30 19:16:59.273922869,13154371,T,IEX,1778.330000,9
2019-10-30 19:18:08.792859904,2019-10-30 19:18:08.792831518,13197582,T,IEX,1779.300000,50
2019-10-30 19:18:16.9423104,2019-10-30 19:18:16.9404328,13201984,T,IEX,1779.195000,10
2019-10-30 19:18:16.526702080,2019-10-30 19:18:16.526678170,13202379,T,IEX,1779.195000,10
2019-10-30 19:18:16.529753088,2019-10-30 19:18:16.529732446,13202464,T,IEX,1779.190000,10
2019-10-30 19:18:17.622148096,2019-10-30 19:18:17.622128816,13203646,T,IEX,1779.185000,10
2019-10-30 19:18:27.852244992,2019-10-30 19:18:27.852220852,13211200,T,IEX,1779.400000,100
2019-10-30 19:18:49.309737984,2019-10-30 19:18:49.309717693,13223164,T,IEX,1779.700000,9
2019-10-30 19:20:42.675379968,2019-10-30 19:20:42.675361905,13292041,T,IEX,1779.700000,100
2019-10-30 19:21:24.561669888,2019-10-30 19:21:24.561647900,13321782,T,IEX,1779.550000,1
2019-10-30 19:21:24.561682944,2019-10-30 19:21:24.561666373,13321783,T,IEX,1779.510000,1
2019-10-30 19:21:39.951634944,2019-10-30 19:21:39.951617002,13329383,T,IEX,1779.470000,4
2019-10-30 19:23:04.184518912,2019-10-30 19:23:04.184500169,13374752,T,IEX,1779.700000,10
2019-10-30 19:24:06.532291072,2019-10-30 19:24:06.532273935,13432816,T,IEX,1781.060000,100
2019-10-30 19:24:07.94780928,2019-10-30 19:24:07.94763303,13433430,T,IEX,1780.900000,100
2019-10-30 19:24:11.476741888,2019-10-30 19:24:11.476718926,13438955,T,IEX,1781.400000,1
2019-10-30 19:24:11.477635072,2019-10-30 19:24:11.476744773,13438957,T,IEX,1781.400000,8
2019-10-30 19:24:11.496997888,2019-10-30 19:24:11.496979587,13439676,T,IEX,1781.400000,51
2019-10-30 19:24:13.653721088,2019-10-30 19:24:13.653701337,13450712,T,IEX,1782.000000,1
2019-10-30 19:24:25.928613120,2019-10-30 19:24:25.928595846,13472946,T,IEX,1781.100000,50
2019-10-30 19:25:07.374479104,2019-10-30 19:25:07.374460537,13509345,T,IEX,1781.260000,6
2019-10-30 19:25:20.318257920,2019-10-30 19:25:20.318241009,13520653,T,IEX,1781.680000,14
2019-10-30 19:25:20.318753024,2019-10-30 19:25:20.318733355,13520659,T,IEX,1781.680000,86
2019-10-30 19:25:22.104442112,2019-10-30 19:25:22.104420427,13521733,T,IEX,1781.660000,30
2019-10-30 19:27:20.842788096,2019-10-30 19:27:20.842766326,13621661,T,IEX,1780.430000,1
2019-10-30 19:27:22.741412096,2019-10-30 19:27:22.741391095,13622810,T,IEX,1780.430000,14
2019-10-30 19:28:29.425449984,2019-10-30 19:28:29.425427382,13660832,T,IEX,1780.280000,1
2019-10-30 19:28:29.425487104,2019-10-30 19:28:29.425470203,13660833,T,IEX,1780.280000,1
2019-10-30 19:28:34.331904000,2019-10-30 19:28:34.331883399,13663694,T,IEX,1780.170000,1
2019-10-30 19:28:34.331913984,2019-10-30 19:28:34.331895633,13663695,T,IEX,1780.170000,4
2019-10-30 19:28:34.331995904,2019-10-30 19:28:34.331975670,13663696,T,IEX,1780.170000,5
2019-10-30 19:28:34.333248000,2019-10-30 19:28:34.333229115,13663727,T,IEX,1780.000000,4
2019-10-30 19:28:34.745271040,2019-10-30 19:28:34.745249590,13664193,T,IEX,1779.890000,24
2019-10-30 19:29:18.217551872,2019-10-30 19:29:18.217530754,13691958,T,IEX,1780.040000,43
2019-10-30 19:29:40.385687040,2019-10-30 19:29:40.385668664,13706721,T,IEX,1779.640000,50
2019-10-30 19:29:40.385699072,2019-10-30 19:29:40.385683229,13706722,T,IEX,1779.580000,100
2019-10-30 19:29:40.423831040,2019-10-30 19:29:40.423811479,13706748,T,IEX,1779.475000,2
2019-10-30 19:32:53.428749056,2019-10-30 19:32:53.428727880,13840579,T,IEX,1778.780000,1
2019-10-30 19:32:54.784752896,2019-10-30 19:32:54.784730543,13841762,T,IEX,1778.650000,50
2019-10-30 19:33:40.286727936,2019-10-30 19:33:40.286702998,13866951,T,IEX,1778.590000,1
2019-10-30 19:33:40.286757888,2019-10-30 19:33:40.286731626,13866954,T,IEX,1778.590000,99
2019-10-30 19:33:40.289891072,2019-10-30 19:33:40.289867387,13867072,T,IEX,1778.550000,50
2019-10-30 19:33:40.441078016,2019-10-30 19:33:40.441057602,13867289,T,IEX,1778.580000,50
2019-10-30 19:33:40.674032896,2019-10-30 19:33:40.674017047,13867423,T,IEX,1778.550000,4
2019-10-30 19:33:40.674053888,2019-10-30 19:33:40.674036294,13867424,T,IEX,1778.550000,1
2019-10-30 19:35:36.896645120,2019-10-30 19:35:36.896625354,13942404,T,IEX,1777.750000,1
2019-10-30 19:35:58.595715072,2019-10-30 19:35:58.595694105,13953666,T,IEX,1777.500000,1
2019-10-30 19:36:46.376985088,2019-10-30 19:36:46.376963535,13982900,T,IEX,1777.915000,2
2019-10-30 19:41:05.633125120,2019-10-30 19:41:05.633104408,14144386,T,IEX,1777.720000,100
2019-10-30 19:41:33.308825088,2019-10-30 19:41:33.308806551,14160363,T,IEX,1777.800000,30
2019-10-30 19:41:33.309060096,2019-10-30 19:41:33.309042662,14160366,T,IEX,1777.800000,70
2019-10-30 19:41:39.460678912,2019-10-30 19:41:39.460661561,14162855,T,IEX,1777.470000,9
2019-10-30 19:41:44.925711872,2019-10-30 19:41:44.925692113,14166686,T,IEX,1777.805000,1
2019-10-30 19:42:18.537760000,2019-10-30 19:42:18.537740666,14188978,T,IEX,1777.730000,10
2019-10-30 19:42:18.537771008,2019-10-30 19:42:18.537750987,14188979,T,IEX,1777.690000,10
2019-10-30 19:42:47.364025088,2019-10-30 19:42:47.364006751,14206535,T,IEX,1777.210000,1
2019-10-30 19:42:47.364043008,2019-10-30 19:42:47.364025634,14206536,T,IEX,1777.210000,1
2019-10-30 19:45:40.983858944,2019-10-30 19:45:40.983840455,14321560,T,IEX,1777.470000,100
2019-10-30 19:46:07.508965120,2019-10-30 19:46:07.508947656,14344866,T,IEX,1777.560000,1
2019-10-30 19:46:34.55540992,2019-10-30 19:46:34.55524797,14365945,T,IEX,1777.470000,1
2019-10-30 19:47:32.844749056,2019-10-30 19:47:32.844721684,14404992,T,IEX,1777.200000,50
2019-10-30 19:47:32.845064960,2019-10-30 19:47:32.845047578,14405004,T,IEX,1777.200000,50
2019-10-30 19:48:34.195539968,2019-10-30 19:48:34.195518176,14451267,T,IEX,1777.800000,4
2019-10-30 19:48:42.681196032,2019-10-30 19:48:42.681176847,14460469,T,IEX,1778.070000,1
2019-10-30 19:48:44.396251904,2019-10-30 19:48:44.396232102,14462697,T,IEX,1778.360000,2
2019-10-30 19:48:56.644215040,2019-10-30 19:48:56.644196485,14473661,T,IEX,1777.570000,2
2019-10-30 19:49:21.367709952,2019-10-30 19:49:21.367691700,14496450,T,IEX,1777.800000,90
2019-10-30 19:49:44.208466944,2019-10-30 19:49:44.208444686,14514357,T,IEX,1778.220000,3
2019-10-30 19:50:00.395495936,2019-10-30 19:50:00.395476574,14529325,T,IEX,1778.635000,15
2019-10-30 19:50:07.238245120,2019-10-30 19:50:07.238225015,14542422,T,IEX,1778.790000,10
2019-10-30 19:50:41.83653888,2019-10-30 19:50:41.83634938,14569025,T,IEX,1779.055000,1
2019-10-30 19:50:41.83668992,2019-10-30 19:50:41.83650993,14569026,T,IEX,1779.055000,2
2019-10-30 19:51:26.261040896,2019-10-30 19:51:26.261018434,14617729,T,IEX,1779.410000,60
2019-10-30 19:51:26.261382912,2019-10-30 19:51:26.261364814,14617731,T,IEX,1779.410000,4
2019-10-30 19:51:26.261394944,2019-10-30 19:51:26.261376817,14617732,T,IEX,1779.410000,36
2019-10-30 19:51:26.261435904,2019-10-30 19:51:26.261418077,14617733,T,IEX,1779.410000,4
2019-10-30 19:51:34.582913024,2019-10-30 19:51:34.582896088,14624206,T,IEX,1779.490000,2
2019-10-30 19:52:28.987399936,2019-10-30 19:52:28.987376796,14669938,T,IEX,1779.190000,39
2019-10-30 19:52:30.861374976,2019-10-30 19:52:30.861359014,14671459,T,IEX,1779.340000,10
2019-10-30 19:53:44.816544000,2019-10-30 19:53:44.816521759,14732780,T,IEX,1779.475000,60
2019-10-30 19:53:47.151823872,2019-10-30 19:53:47.151804912,14734672,T,IEX,1779.475000,50
2019-10-30 19:53:47.151834112,2019-10-30 19:53:47.151817765,14734673,T,IEX,1779.475000,40
2019-10-30 19:53:57.480355072,2019-10-30 19:53:57.480335693,14741767,T,IEX,1779.730000,3
2019-10-30 19:53:57.494676992,2019-10-30 19:53:57.494657483,14742260,T,IEX,1779.820000,100
2019-10-30 19:54:05.427724032,2019-10-30 19:54:05.427701619,14762276,T,IEX,1780.375000,5
2019-10-30 19:54:12.134419968,2019-10-30 19:54:12.134398722,14770047,T,IEX,1780.600000,2
2019-10-30 19:54:18.489300992,2019-10-30 19:54:18.489280692,14775972,T,IEX,1780.245000,4
2019-10-30 19:54:28.154471936,2019-10-30 19:54:28.154449203,14784920,T,IEX,1780.350000,30
2019-10-30 19:54:35.730541056,2019-10-30 19:54:35.730516743,14792106,T,IEX,1780.210000,2
2019-10-30 19:54:47.941506048,2019-10-30 19:54:47.941484790,14805543,T,IEX,1780.605000,4
2019-10-30 19:54:53.240111104,2019-10-30 19:54:53.240092789,14812748,T,IEX,1780.340000,100
2019-10-30 19:55:00.111119104,2019-10-30 19:55:00.111100692,14821543,T,IEX,1779.120000,1
2019-10-30 19:55:19.548793088,2019-10-30 19:55:19.548773476,14851916,T,IEX,1779.200000,1
2019-10-30 19:55:52.671142912,2019-10-30 19:55:52.671119557,14887814,T,IEX,1779.365000,10
2019-10-30 19:55:59.888122112,2019-10-30 19:55:59.888101984,14894605,T,IEX,1779.490000,2
2019-10-30 19:55:59.889036032,2019-10-30 19:55:59.889015711,14894634,T,IEX,1779.360000,100
2019-10-30 19:56:20.159238912,2019-10-30 19:56:20.159219017,14918824,T,IEX,1779.830000,32
2019-10-30 19:56:27.822931968,2019-10-30 19:56:27.822913433,14927930,T,IEX,1779.370000,10
2019-10-30 19:56:27.824406016,2019-10-30 19:56:27.824388386,14927966,T,IEX,1779.345000,7
2019-10-30 19:57:36.77392896,2019-10-30 19:57:36.77376826,15014145,T,IEX,1779.510000,1
2019-10-30 19:57:36.77413888,2019-10-30 19:57:36.77396269,15014146,T,IEX,1779.510000,5
2019-10-30 19:57:44.29538048,2019-10-30 19:57:44.29517145,15023619,T,IEX,1779.645000,100
2019-10-30 19:57:49.524463104,2019-10-30 19:57:49.524447419,15030303,T,IEX,1779.625000,100
2019-10-30 19:57:50.230861056,2019-10-30 19:57:50.230840859,15031128,T,IEX,1779.780000,31
2019-10-30 19:57:58.496628992,2019-10-30 19:57:58.496607331,15039854,T,IEX,1779.930000,1
2019-10-30 19:58:00.759204096,2019-10-30 19:58:00.759185519,15043753,T,IEX,1779.890000,5
2019-10-30 19:58:21.443937024,2019-10-30 19:58:21.443915988,15073427,T,IEX,1779.650000,3
2019-10-30 19:58:27.786515968,2019-10-30 19:58:27.786498770,15081224,T,IEX,1779.510000,10
2019-10-30 19:58:34.298082048,2019-10-30 19:58:34.298059667,15089502,T,IEX,1779.485000,100
2019-10-30 19:58:46.853246976,2019-10-30 19:58:46.853231546,15105055,T,IEX,1779.590000,1
2019-10-30 19:58:48.255016960,2019-10-30 19:58:48.254999097,15107255,T,IEX,1779.820000,100
2019-10-30 19:58:54.136088064,2019-10-30 19:58:54.136067445,15113744,T,IEX,1779.650000,3
2019-10-30 19:58:55.157864960,2019-10-30 19:58:55.157847207,15115097,T,IEX,1779.730000,10
2019-10-30 19:59:10.523168000,2019-10-30 19:59:10.523148764,15146120,T,IEX,1779.940000,16
2019-10-30 19:59:18.246955008,2019-10-30 19:59:18.246934153,15158284,T,IEX,1779.820000,4
2019-10-30 19:59:21.407077888,2019-10-30 19:59:21.407059766,15162682,T,IEX,1779.970000,22
2019-10-30 19:59:30.403453952,2019-10-30 19:59:30.403433846,15180194,T,IEX,1779.840000,1
2019-10-30 19:59:42.45773056,2019-10-30 19:59:42.45757277,15247859,T,IEX,1780.225000,2
2019-10-30 19:59:42.878475008,2019-10-30 19:59:42.878448338,15251297,T,IEX,1780.200000,10
2019-10-30 19:59:54.51862016,2019-10-30 19:59:54.51835113,15310284,T,IEX,1780.840000,100
2019-10-30 19:59:56.493339904,2019-10-30 19:59:56.493324456,15323549,T,IEX,1780.985000,48
2019-10-30 19:59:58.197957120,2019-10-30 19:59:58.197939465,15335228,T,IEX,1780.840000,90
2019-10-30 19:59:59.24664064,2019-10-30 19:59:59.24636766,15341075,T,IEX,1780.170000,100
