2019-10-02 13:29:13.334484992,2019-10-02 13:29:13.334461806,75552,T,IEX,49.480000,1400
2019-10-02 13:59:32.241505024,2019-10-02 13:59:32.241481477,2550930,T,IEX,48.470000,1000
2019-10-02 14:05:02.38523904,2019-10-02 14:05:02.38503557,3039794,T,IEX,48.400000,100
2019-10-02 14:07:42.23361024,2019-10-02 14:07:42.23341811,3276228,T,IEX,48.570000,100
2019-10-02 14:18:56.875208960,2019-10-02 14:18:56.875187141,3998650,T,IEX,48.705000,100
2019-10-02 14:21:12.114149120,2019-10-02 14:21:12.114129800,4140713,T,IEX,48.710000,1000
2019-10-02 14:21:20.43848960,2019-10-02 14:21:20.43830275,4150614,T,IEX,48.715000,10
2019-10-02 14:31:20.247776000,2019-10-02 14:31:20.247758300,4830301,T,IEX,48.105000,100
2019-10-02 14:31:20.665968128,2019-10-02 14:31:20.665950156,4830739,T,IEX,48.105000,100
2019-10-02 14:45:29.366136064,2019-10-02 14:45:29.366114119,5992655,T,IEX,47.860000,100
2019-10-02 14:50:13.341943040,2019-10-02 14:50:13.341913728,6342005,T,IEX,47.720000,100
2019-10-02 14:54:27.603609088,2019-10-02 14:54:27.603580513,6664229,T,IEX,47.900000,100
2019-10-02 14:54:46.558991872,2019-10-02 14:54:46.558975002,6692694,T,IEX,47.950000,1
2019-10-02 14:57:57.48474880,2019-10-02 14:57:57.48457562,6930189,T,IEX,48.025000,100
2019-10-02 15:00:33.973093888,2019-10-02 15:00:33.973065230,7128640,T,IEX,47.990000,100
2019-10-02 15:00:37.281294080,2019-10-02 15:00:37.281265247,7140820,T,IEX,47.990000,100
2019-10-02 15:06:40.870116096,2019-10-02 15:06:40.870097829,7550652,T,IEX,48.100000,100
2019-10-02 15:31:26.185858048,2019-10-02 15:31:26.185839636,9216605,T,IEX,47.590000,100
2019-10-02 15:31:53.830052096,2019-10-02 15:31:53.830033890,9261966,T,IEX,47.570000,100
2019-10-02 15:32:07.924027904,2019-10-02 15:32:07.924009438,9282859,T,IEX,47.580000,35
2019-10-02 15:33:37.61799936,2019-10-02 15:33:37.61780437,9383395,T,IEX,47.590000,100
2019-10-02 15:36:07.198329088,2019-10-02 15:36:07.198308601,9540592,T,IEX,47.460000,100
2019-10-02 15:36:07.627121920,2019-10-02 15:36:07.627104918,9541083,T,IEX,47.455000,100
2019-10-02 15:36:08.110508032,2019-10-02 15:36:08.110487159,9541937,T,IEX,47.455000,100
2019-10-02 15:36:09.942700032,2019-10-02 15:36:09.942674325,9543566,T,IEX,47.450000,10
2019-10-02 15:36:10.318934016,2019-10-02 15:36:10.318917716,9543819,T,IEX,47.450000,100
2019-10-02 15:36:11.279898880,2019-10-02 15:36:11.279881161,9544697,T,IEX,47.460000,100
2019-10-02 15:36:12.631661056,2019-10-02 15:36:12.631642176,9547298,T,IEX,47.480000,100
2019-10-02 15:36:12.636913920,2019-10-02 15:36:12.636896683,9547303,T,IEX,47.475000,100
2019-10-02 15:36:12.701477120,2019-10-02 15:36:12.701451347,9547392,T,IEX,47.475000,100
2019-10-02 15:37:52.76919040,2019-10-02 15:37:52.76894995,9640202,T,IEX,47.540000,300
2019-10-02 15:48:34.136032000,2019-10-02 15:48:34.136010975,10182113,T,IEX,47.635000,5
2019-10-02 15:49:03.30714112,2019-10-02 15:49:03.30692417,10200262,T,IEX,47.635000,100
2019-10-02 15:51:12.290900992,2019-10-02 15:51:12.290883022,10312711,T,IEX,47.670000,31
2019-10-02 15:55:24.542875904,2019-10-02 15:55:24.542858816,10558180,T,IEX,47.845000,100
2019-10-02 16:00:14.329028096,2019-10-02 16:00:14.329008253,10793247,T,IEX,47.760000,100
2019-10-02 16:00:29.243780096,2019-10-02 16:00:29.243762984,10806053,T,IEX,47.760000,6
2019-10-02 16:16:41.938669056,2019-10-02 16:16:41.938649006,11505403,T,IEX,47.475000,20
2019-10-02 16:16:44.858565888,2019-10-02 16:16:44.858547888,11507224,T,IEX,47.465000,10
2019-10-02 16:17:17.128645120,2019-10-02 16:17:17.128626498,11524138,T,IEX,47.465000,50
2019-10-02 16:17:28.421402112,2019-10-02 16:17:28.421383376,11536201,T,IEX,47.420000,100
2019-10-02 16:17:28.422696960,2019-10-02 16:17:28.422679562,11536242,T,IEX,47.420000,100
2019-10-02 16:17:39.945774080,2019-10-02 16:17:39.945758288,11545096,T,IEX,47.425000,100
2019-10-02 16:17:50.723940096,2019-10-02 16:17:50.723922278,11552211,T,IEX,47.465000,40
2019-10-02 16:26:33.935335936,2019-10-02 16:26:33.935318100,11862962,T,IEX,47.520000,100
2019-10-02 16:35:28.597321984,2019-10-02 16:35:28.597296687,12131896,T,IEX,47.380000,200
2019-10-02 16:35:58.302607104,2019-10-02 16:35:58.302588610,12153311,T,IEX,47.350000,100
2019-10-02 16:51:30.371560960,2019-10-02 16:51:30.371541294,12691837,T,IEX,47.105000,10
2019-10-02 16:51:45.242120960,2019-10-02 16:51:45.242102291,12698983,T,IEX,47.080000,41
2019-10-02 16:56:33.994028032,2019-10-02 16:56:33.994009684,12858200,T,IEX,47.135000,100
2019-10-02 16:57:28.195101952,2019-10-02 16:57:28.195081416,12893269,T,IEX,47.205000,100
2019-10-02 17:08:06.521167104,2019-10-02 17:08:06.521149482,13349554,T,IEX,47.360000,100
2019-10-02 17:30:33.636480000,2019-10-02 17:30:33.636462024,14213542,T,IEX,47.530000,500
2019-10-02 17:43:13.572626944,2019-10-02 17:43:13.572607574,14658978,T,IEX,47.385000,100
2019-10-02 17:43:13.577362944,2019-10-02 17:43:13.577347056,14659177,T,IEX,47.385000,100
2019-10-02 17:43:14.761999872,2019-10-02 17:43:14.761981364,14659963,T,IEX,47.390000,100
2019-10-02 17:43:15.593448960,2019-10-02 17:43:15.593430382,14660370,T,IEX,47.390000,100
2019-10-02 17:55:09.619513088,2019-10-02 17:55:09.619494238,15052182,T,IEX,47.330000,300
2019-10-02 18:04:31.836141056,2019-10-02 18:04:31.836122194,15416002,T,IEX,47.510000,100
2019-10-02 18:15:39.759557888,2019-10-02 18:15:39.759538012,15854186,T,IEX,47.550000,100
2019-10-02 18:45:20.849605120,2019-10-02 18:45:20.849575859,16863729,T,IEX,47.810000,700
2019-10-02 18:45:20.849848064,2019-10-02 18:45:20.849829005,16863744,T,IEX,47.810000,300
2019-10-02 18:45:43.889198080,2019-10-02 18:45:43.889181739,16892154,T,IEX,47.830000,100
2019-10-02 18:49:26.76642048,2019-10-02 18:49:26.76623814,17045205,T,IEX,47.985000,100
2019-10-02 19:00:19.378414080,2019-10-02 19:00:19.378396275,17410149,T,IEX,47.990000,100
2019-10-02 19:00:36.495475968,2019-10-02 19:00:36.495456340,17421228,T,IEX,48.000000,1000
2019-10-02 19:06:14.612989952,2019-10-02 19:06:14.612967960,17651850,T,IEX,47.755000,100
2019-10-02 19:43:40.696704000,2019-10-02 19:43:40.696687416,19367369,T,IEX,48.030000,100
2019-10-02 19:44:50.51414016,2019-10-02 19:44:50.51394931,19435597,T,IEX,47.900000,1000
2019-10-02 19:44:59.827817984,2019-10-02 19:44:59.827742606,19444936,T,IEX,47.930000,100
2019-10-02 19:45:22.245936896,2019-10-02 19:45:22.245900325,19472537,T,IEX,47.910000,100
2019-10-02 19:45:22.245947904,2019-10-02 19:45:22.245924300,19472540,T,IEX,47.910000,100
2019-10-02 19:46:54.183077120,2019-10-02 19:46:54.183057883,19568592,T,IEX,47.775000,186
2019-10-02 19:47:03.664480000,2019-10-02 19:47:03.664453114,19576422,T,IEX,47.780000,100
2019-10-02 19:47:56.788750080,2019-10-02 19:47:56.788733126,19622730,T,IEX,47.725000,100
2019-10-02 19:47:56.788770048,2019-10-02 19:47:56.788753038,19622731,T,IEX,47.725000,100
2019-10-02 19:50:01.191252992,2019-10-02 19:50:01.191235241,19746010,T,IEX,47.580000,500
2019-10-02 19:51:15.286785024,2019-10-02 19:51:15.286766406,19870934,T,IEX,47.630000,100
2019-10-02 19:51:42.184663040,2019-10-02 19:51:42.184647349,19896827,T,IEX,47.650000,100
2019-10-02 19:52:11.154767104,2019-10-02 19:52:11.154746638,19924256,T,IEX,47.690000,100
2019-10-02 19:52:31.986029056,2019-10-02 19:52:31.986009415,19945828,T,IEX,47.670000,100
2019-10-02 19:52:35.17807104,2019-10-02 19:52:35.17788134,19949100,T,IEX,47.670000,100
2019-10-02 19:53:43.680214016,2019-10-02 19:53:43.680194824,20009081,T,IEX,47.700000,100
2019-10-02 19:54:25.923990016,2019-10-02 19:54:25.923970691,20061654,T,IEX,47.730000,100
2019-10-02 19:55:00.190450944,2019-10-02 19:55:00.190428651,20108465,T,IEX,47.700000,145
2019-10-02 19:55:00.192396032,2019-10-02 19:55:00.192376722,20108510,T,IEX,47.700000,55
2019-10-02 19:55:00.302629120,2019-10-02 19:55:00.302608260,20109937,T,IEX,47.690000,100
2019-10-02 19:55:21.736035072,2019-10-02 19:55:21.736007365,20158776,T,IEX,47.680000,100
2019-10-02 19:55:31.601243904,2019-10-02 19:55:31.601225634,20174974,T,IEX,47.705000,100
2019-10-02 19:55:31.601280000,2019-10-02 19:55:31.601262572,20174975,T,IEX,47.700000,100
2019-10-02 19:55:36.86565120,2019-10-02 19:55:36.86546544,20180730,T,IEX,47.685000,100
2019-10-02 19:55:41.869981952,2019-10-02 19:55:41.869961738,20187982,T,IEX,47.670000,100
2019-10-02 19:55:47.26106112,2019-10-02 19:55:47.26086370,20194505,T,IEX,47.660000,100
2019-10-02 19:56:35.916537088,2019-10-02 19:56:35.916518002,20260753,T,IEX,47.670000,90
