2019-10-09 13:30:00.308407040,2019-10-09 13:30:00.308386381,79687,T,IEX,53.980000,100
2019-10-09 13:30:19.592909056,2019-10-09 13:30:19.592883367,123872,T,IEX,53.900000,100
2019-10-09 13:30:47.768473088,2019-10-09 13:30:47.768447274,157091,T,IEX,53.865000,100
2019-10-09 13:30:47.768527872,2019-10-09 13:30:47.768507319,157092,T,IEX,53.865000,43
2019-10-09 13:31:01.19480064,2019-10-09 13:31:01.19458262,171677,T,IEX,53.890000,100
2019-10-09 13:31:08.978928128,2019-10-09 13:31:08.978900488,183779,T,IEX,53.890000,10
2019-10-09 13:31:10.895873024,2019-10-09 13:31:10.895846842,185766,T,IEX,53.900000,100
2019-10-09 13:32:08.126040064,2019-10-09 13:32:08.126017150,253903,T,IEX,53.930000,100
2019-10-09 13:32:18.614529024,2019-10-09 13:32:18.614508896,265918,T,IEX,53.930000,100
2019-10-09 13:34:09.234201088,2019-10-09 13:34:09.234185048,397067,T,IEX,53.890000,1
2019-10-09 13:34:09.360160000,2019-10-09 13:34:09.360142726,397368,T,IEX,53.880000,100
2019-10-09 13:34:29.11141120,2019-10-09 13:34:29.11119927,422799,T,IEX,53.830000,100
2019-10-09 13:35:03.714405120,2019-10-09 13:35:03.714387176,460310,T,IEX,53.765000,100
2019-10-09 13:35:06.511545088,2019-10-09 13:35:06.511519920,463400,T,IEX,53.755000,89
2019-10-09 13:35:15.21338112,2019-10-09 13:35:15.21320638,473453,T,IEX,53.780000,200
2019-10-09 13:35:22.667225088,2019-10-09 13:35:22.667207583,483453,T,IEX,53.780000,13
2019-10-09 13:35:22.667544064,2019-10-09 13:35:22.667528103,483455,T,IEX,53.780000,187
2019-10-09 13:35:22.667589120,2019-10-09 13:35:22.667573766,483456,T,IEX,53.780000,13
2019-10-09 13:35:22.673167872,2019-10-09 13:35:22.673150100,483465,T,IEX,53.780000,13
2019-10-09 13:35:22.679057920,2019-10-09 13:35:22.679041118,483469,T,IEX,53.780000,13
2019-10-09 13:35:23.658778880,2019-10-09 13:35:23.658761259,484621,T,IEX,53.780000,11
2019-10-09 13:35:23.664738048,2019-10-09 13:35:23.664716499,484627,T,IEX,53.780000,11
2019-10-09 13:35:23.670616064,2019-10-09 13:35:23.670600733,484639,T,IEX,53.780000,11
2019-10-09 13:35:23.678086912,2019-10-09 13:35:23.678070341,484645,T,IEX,53.780000,9
2019-10-09 13:35:23.683960064,2019-10-09 13:35:23.683942701,484650,T,IEX,53.780000,9
2019-10-09 13:35:23.689833984,2019-10-09 13:35:23.689813250,484654,T,IEX,53.780000,9
2019-10-09 13:35:23.697408000,2019-10-09 13:35:23.697388716,484661,T,IEX,53.780000,7
2019-10-09 13:35:39.486105088,2019-10-09 13:35:39.486085441,501093,T,IEX,53.800000,100
2019-10-09 13:35:45.744203008,2019-10-09 13:35:45.744187689,506304,T,IEX,53.800000,1
2019-10-09 13:35:45.744257024,2019-10-09 13:35:45.744242735,506305,T,IEX,53.800000,3
2019-10-09 13:35:57.331075072,2019-10-09 13:35:57.331054724,517963,T,IEX,53.800000,12
2019-10-09 13:36:12.230693888,2019-10-09 13:36:12.230675090,532833,T,IEX,53.830000,100
2019-10-09 13:36:12.244590080,2019-10-09 13:36:12.244572785,532857,T,IEX,53.840000,100
2019-10-09 13:36:17.928261120,2019-10-09 13:36:17.928243076,538169,T,IEX,53.840000,100
2019-10-09 13:36:19.413042944,2019-10-09 13:36:19.413027105,539611,T,IEX,53.840000,100
2019-10-09 13:36:20.427418880,2019-10-09 13:36:20.427401613,540489,T,IEX,53.835000,100
2019-10-09 13:36:29.758866944,2019-10-09 13:36:29.758850842,545482,T,IEX,53.850000,100
2019-10-09 13:36:30.233189120,2019-10-09 13:36:30.233171061,545777,T,IEX,53.850000,100
2019-10-09 13:36:30.436926976,2019-10-09 13:36:30.436909658,545868,T,IEX,53.855000,100
2019-10-09 13:36:42.296581888,2019-10-09 13:36:42.296564632,555268,T,IEX,53.855000,100
2019-10-09 13:36:45.658028032,2019-10-09 13:36:45.658007548,558422,T,IEX,53.860000,100
2019-10-09 13:36:45.658080000,2019-10-09 13:36:45.658063118,558423,T,IEX,53.860000,100
2019-10-09 13:36:45.732918016,2019-10-09 13:36:45.732899749,558523,T,IEX,53.870000,100
2019-10-09 13:36:46.42048000,2019-10-09 13:36:46.42030296,558773,T,IEX,53.860000,200
2019-10-09 13:36:48.702873088,2019-10-09 13:36:48.702854634,560811,T,IEX,53.860000,100
2019-10-09 13:36:48.702931968,2019-10-09 13:36:48.702914709,560812,T,IEX,53.860000,100
2019-10-09 13:36:48.703517952,2019-10-09 13:36:48.703502817,560815,T,IEX,53.860000,100
2019-10-09 13:36:48.703611904,2019-10-09 13:36:48.703598093,560816,T,IEX,53.860000,100
2019-10-09 13:37:17.361602048,2019-10-09 13:37:17.361583027,583135,T,IEX,53.880000,100
2019-10-09 13:37:54.20009984,2019-10-09 13:37:54.19991736,606651,T,IEX,53.870000,100
2019-10-09 13:38:32.562257920,2019-10-09 13:38:32.562240688,638666,T,IEX,53.860000,100
2019-10-09 13:39:01.54808064,2019-10-09 13:39:01.54792446,663976,T,IEX,53.890000,100
2019-10-09 13:39:09.674234880,2019-10-09 13:39:09.674217718,679556,T,IEX,53.850000,100
2019-10-09 13:40:21.191468032,2019-10-09 13:40:21.191451184,742568,T,IEX,53.880000,2
2019-10-09 13:40:24.693073920,2019-10-09 13:40:24.693050295,746293,T,IEX,53.885000,39
2019-10-09 13:45:00.241914112,2019-10-09 13:45:00.241897674,1001136,T,IEX,53.925000,200
2019-10-09 13:45:00.272226048,2019-10-09 13:45:00.272211075,1001210,T,IEX,53.925000,100
2019-10-09 13:45:08.854452992,2019-10-09 13:45:08.854436956,1012670,T,IEX,53.915000,100
2019-10-09 13:45:28.862656000,2019-10-09 13:45:28.862637695,1034316,T,IEX,53.910000,75
2019-10-09 13:45:40.366907904,2019-10-09 13:45:40.366888368,1045066,T,IEX,53.940000,100
2019-10-09 13:46:12.61161984,2019-10-09 13:46:12.61144739,1071812,T,IEX,53.995000,100
2019-10-09 13:46:12.140133120,2019-10-09 13:46:12.140115572,1071900,T,IEX,54.000000,100
2019-10-09 13:46:12.265990912,2019-10-09 13:46:12.265972186,1072019,T,IEX,54.000000,100
2019-10-09 13:46:12.884680960,2019-10-09 13:46:12.884660405,1072674,T,IEX,54.000000,100
2019-10-09 13:47:02.386202880,2019-10-09 13:47:02.386187365,1110622,T,IEX,54.030000,100
2019-10-09 13:47:02.386233088,2019-10-09 13:47:02.386218175,1110623,T,IEX,54.030000,100
2019-10-09 13:47:02.386932992,2019-10-09 13:47:02.386915825,1110631,T,IEX,54.030000,100
2019-10-09 13:47:12.775419904,2019-10-09 13:47:12.775401776,1118245,T,IEX,54.015000,100
2019-10-09 13:47:40.982586880,2019-10-09 13:47:40.982569790,1143864,T,IEX,54.020000,1
2019-10-09 13:47:51.614577920,2019-10-09 13:47:51.614557976,1153116,T,IEX,54.025000,100
2019-10-09 13:47:53.356651008,2019-10-09 13:47:53.356631185,1154434,T,IEX,54.025000,100
2019-10-09 13:47:55.843636992,2019-10-09 13:47:55.843621443,1156728,T,IEX,54.025000,100
2019-10-09 13:48:22.595518976,2019-10-09 13:48:22.595498498,1178905,T,IEX,54.050000,100
2019-10-09 13:48:22.697341952,2019-10-09 13:48:22.697325184,1179381,T,IEX,54.050000,100
2019-10-09 13:48:36.438680064,2019-10-09 13:48:36.438663877,1192746,T,IEX,54.055000,100
2019-10-09 13:48:45.958977024,2019-10-09 13:48:45.958957466,1199764,T,IEX,54.055000,100
2019-10-09 13:48:55.774891008,2019-10-09 13:48:55.774871724,1206173,T,IEX,54.055000,100
2019-10-09 13:49:01.402368000,2019-10-09 13:49:01.402348449,1209410,T,IEX,54.055000,400
2019-10-09 13:49:05.444943104,2019-10-09 13:49:05.444924788,1211647,T,IEX,54.065000,1
2019-10-09 13:49:10.24782080,2019-10-09 13:49:10.24763089,1215294,T,IEX,54.060000,300
2019-10-09 13:49:21.430611968,2019-10-09 13:49:21.430592445,1224145,T,IEX,54.055000,100
2019-10-09 13:49:31.23987968,2019-10-09 13:49:31.23968767,1232228,T,IEX,54.055000,100
2019-10-09 13:49:46.449648896,2019-10-09 13:49:46.449630040,1243031,T,IEX,54.050000,100
2019-10-09 13:49:50.941767936,2019-10-09 13:49:50.941748852,1246963,T,IEX,54.055000,100
2019-10-09 13:49:55.476848896,2019-10-09 13:49:55.476830451,1249827,T,IEX,54.050000,100
2019-10-09 13:49:59.714492928,2019-10-09 13:49:59.714475246,1252788,T,IEX,54.040000,100
2019-10-09 13:50:00.992812032,2019-10-09 13:50:00.992792669,1253635,T,IEX,54.035000,100
2019-10-09 13:50:10.883156992,2019-10-09 13:50:10.883138930,1262791,T,IEX,54.005000,100
2019-10-09 13:50:35.695196928,2019-10-09 13:50:35.695178055,1293158,T,IEX,54.025000,100
2019-10-09 13:51:09.617864960,2019-10-09 13:51:09.617847308,1325875,T,IEX,53.990000,100
2019-10-09 13:51:24.540279040,2019-10-09 13:51:24.540257564,1341933,T,IEX,53.980000,1
2019-10-09 13:51:28.139235072,2019-10-09 13:51:28.139219472,1346147,T,IEX,53.990000,100
2019-10-09 13:51:28.924677120,2019-10-09 13:51:28.924656640,1347209,T,IEX,53.980000,100
2019-10-09 13:52:19.21625088,2019-10-09 13:52:19.21607382,1389256,T,IEX,53.940000,100
2019-10-09 13:52:43.777818112,2019-10-09 13:52:43.777797994,1412704,T,IEX,53.900000,100
2019-10-09 13:53:02.648827904,2019-10-09 13:53:02.648809492,1437148,T,IEX,53.890000,100
2019-10-09 13:53:11.786395904,2019-10-09 13:53:11.786367183,1456651,T,IEX,53.880000,100
2019-10-09 13:53:58.738311936,2019-10-09 13:53:58.738292723,1514007,T,IEX,53.830000,100
2019-10-09 13:54:47.816162048,2019-10-09 13:54:47.816146066,1566152,T,IEX,53.845000,100
2019-10-09 13:55:19.463708928,2019-10-09 13:55:19.463692778,1597950,T,IEX,53.845000,100
2019-10-09 13:55:35.829422080,2019-10-09 13:55:35.829403254,1613407,T,IEX,53.800000,100
2019-10-09 13:55:54.175900928,2019-10-09 13:55:54.175884956,1627239,T,IEX,53.795000,100
2019-10-09 13:57:19.644389888,2019-10-09 13:57:19.644373287,1696575,T,IEX,53.810000,100
2019-10-09 13:57:30.988548096,2019-10-09 13:57:30.988528511,1705071,T,IEX,53.820000,100
2019-10-09 13:58:49.2862080,2019-10-09 13:58:49.2844868,1765396,T,IEX,53.815000,49
2019-10-09 13:59:26.97602048,2019-10-09 13:59:26.97582796,1795143,T,IEX,53.795000,100
2019-10-09 13:59:45.172017920,2019-10-09 13:59:45.171999955,1809975,T,IEX,53.760000,2
2019-10-09 13:59:52.32653056,2019-10-09 13:59:52.32634686,1814351,T,IEX,53.770000,622
2019-10-09 14:00:06.679962880,2019-10-09 14:00:06.679938660,1823745,T,IEX,53.780000,100
2019-10-09 14:01:37.122880000,2019-10-09 14:01:37.122864176,1940498,T,IEX,53.775000,100
2019-10-09 14:01:40.350342912,2019-10-09 14:01:40.350323533,1945819,T,IEX,53.775000,100
2019-10-09 14:02:44.391817984,2019-10-09 14:02:44.391800597,2023026,T,IEX,53.740000,100
2019-10-09 14:02:44.392817920,2019-10-09 14:02:44.392800101,2023029,T,IEX,53.740000,200
2019-10-09 14:06:25.377827072,2019-10-09 14:06:25.377809280,2225846,T,IEX,53.655000,100
2019-10-09 14:06:25.377851904,2019-10-09 14:06:25.377833728,2225847,T,IEX,53.655000,100
2019-10-09 14:06:25.378883072,2019-10-09 14:06:25.378862976,2225848,T,IEX,53.655000,100
2019-10-09 14:06:25.380114944,2019-10-09 14:06:25.380095106,2225849,T,IEX,53.655000,153
2019-10-09 14:06:25.380243968,2019-10-09 14:06:25.380228729,2225850,T,IEX,53.655000,100
2019-10-09 14:06:29.474885120,2019-10-09 14:06:29.474867194,2228674,T,IEX,53.645000,426
2019-10-09 14:06:29.474928128,2019-10-09 14:06:29.474909778,2228675,T,IEX,53.645000,182
2019-10-09 14:06:39.264795904,2019-10-09 14:06:39.264777231,2236761,T,IEX,53.655000,100
2019-10-09 14:06:39.267685120,2019-10-09 14:06:39.267666080,2236762,T,IEX,53.655000,300
2019-10-09 14:06:39.270062080,2019-10-09 14:06:39.270042878,2236766,T,IEX,53.655000,300
2019-10-09 14:06:39.272459008,2019-10-09 14:06:39.272439242,2236768,T,IEX,53.655000,300
2019-10-09 14:06:39.274823936,2019-10-09 14:06:39.274805820,2236772,T,IEX,53.655000,300
2019-10-09 14:06:54.344433920,2019-10-09 14:06:54.344417169,2245935,T,IEX,53.655000,100
2019-10-09 14:06:55.274792960,2019-10-09 14:06:55.274773173,2246486,T,IEX,53.655000,300
2019-10-09 14:06:55.277143040,2019-10-09 14:06:55.277125828,2246494,T,IEX,53.655000,300
2019-10-09 14:06:55.279620096,2019-10-09 14:06:55.279599763,2246500,T,IEX,53.655000,300
2019-10-09 14:07:15.74877952,2019-10-09 14:07:15.74860667,2261036,T,IEX,53.645000,123
2019-10-09 14:07:20.823919104,2019-10-09 14:07:20.823901579,2266531,T,IEX,53.655000,100
2019-10-09 14:07:20.823962880,2019-10-09 14:07:20.823947223,2266532,T,IEX,53.655000,100
2019-10-09 14:07:27.898624000,2019-10-09 14:07:27.898605299,2272707,T,IEX,53.655000,103
2019-10-09 14:07:31.822093056,2019-10-09 14:07:31.822074034,2275696,T,IEX,53.655000,100
2019-10-09 14:08:17.428307968,2019-10-09 14:08:17.428292545,2315704,T,IEX,53.685000,44
2019-10-09 14:08:21.743245056,2019-10-09 14:08:21.743229623,2319824,T,IEX,53.695000,6
2019-10-09 14:08:21.753904896,2019-10-09 14:08:21.753886136,2319829,T,IEX,53.695000,2
2019-10-09 14:08:28.432093952,2019-10-09 14:08:28.432077908,2325086,T,IEX,53.685000,137
2019-10-09 14:08:54.408762880,2019-10-09 14:08:54.408742043,2344640,T,IEX,53.695000,100
2019-10-09 14:08:54.412751104,2019-10-09 14:08:54.412732726,2344643,T,IEX,53.695000,1
2019-10-09 14:08:59.758629888,2019-10-09 14:08:59.758612994,2347658,T,IEX,53.695000,100
2019-10-09 14:09:04.640467968,2019-10-09 14:09:04.640448909,2352357,T,IEX,53.695000,100
2019-10-09 14:09:27.994556928,2019-10-09 14:09:27.994539974,2375034,T,IEX,53.740000,100
2019-10-09 14:09:35.345128960,2019-10-09 14:09:35.345112744,2380990,T,IEX,53.745000,1
2019-10-09 14:10:04.719249920,2019-10-09 14:10:04.719229965,2408169,T,IEX,53.735000,1
2019-10-09 14:10:06.183429888,2019-10-09 14:10:06.183414558,2409722,T,IEX,53.735000,100
2019-10-09 14:10:25.294823936,2019-10-09 14:10:25.294805647,2425548,T,IEX,53.755000,1
2019-10-09 14:10:25.313691904,2019-10-09 14:10:25.313674100,2425997,T,IEX,53.755000,99
2019-10-09 14:10:40.999766016,2019-10-09 14:10:40.999748220,2441490,T,IEX,53.755000,8
2019-10-09 14:10:53.878938112,2019-10-09 14:10:53.878920021,2454898,T,IEX,53.750000,100
2019-10-09 14:10:53.879247104,2019-10-09 14:10:53.879231204,2454901,T,IEX,53.750000,100
2019-10-09 14:10:53.879311104,2019-10-09 14:10:53.879295289,2454902,T,IEX,53.750000,72
2019-10-09 14:11:24.343254016,2019-10-09 14:11:24.343236208,2479013,T,IEX,53.785000,1
2019-10-09 14:11:32.236578048,2019-10-09 14:11:32.236558550,2485943,T,IEX,53.790000,100
2019-10-09 14:11:53.915981056,2019-10-09 14:11:53.915965704,2506039,T,IEX,53.790000,40
2019-10-09 14:12:03.660571904,2019-10-09 14:12:03.660554766,2514752,T,IEX,53.785000,1
2019-10-09 14:12:19.545634048,2019-10-09 14:12:19.545614478,2529960,T,IEX,53.790000,8
2019-10-09 14:12:49.583205120,2019-10-09 14:12:49.583183171,2551527,T,IEX,53.815000,1
2019-10-09 14:13:36.563010048,2019-10-09 14:13:36.562995101,2593210,T,IEX,53.805000,1
2019-10-09 14:13:47.265331968,2019-10-09 14:13:47.265311789,2599981,T,IEX,53.780000,100
2019-10-09 14:14:26.633784064,2019-10-09 14:14:26.633763723,2642842,T,IEX,53.765000,1
2019-10-09 14:15:08.781651968,2019-10-09 14:15:08.781634121,2675360,T,IEX,53.785000,100
2019-10-09 14:15:08.781696000,2019-10-09 14:15:08.781679094,2675361,T,IEX,53.785000,100
2019-10-09 14:15:20.249805056,2019-10-09 14:15:20.249786322,2683236,T,IEX,53.785000,1
2019-10-09 14:15:38.827793920,2019-10-09 14:15:38.827776256,2698551,T,IEX,53.755000,60
2019-10-09 14:16:29.155001088,2019-10-09 14:16:29.154984165,2733110,T,IEX,53.735000,1
2019-10-09 14:17:33.919239936,2019-10-09 14:17:33.919224605,2776537,T,IEX,53.755000,1
2019-10-09 14:17:33.986360064,2019-10-09 14:17:33.986342252,2776594,T,IEX,53.760000,100
2019-10-09 14:18:30.958466048,2019-10-09 14:18:30.958450704,2811350,T,IEX,53.795000,1
2019-10-09 14:18:54.644003072,2019-10-09 14:18:54.643985251,2834879,T,IEX,53.785000,55
2019-10-09 14:19:27.701835008,2019-10-09 14:19:27.701817808,2861131,T,IEX,53.805000,1
2019-10-09 14:19:58.736965888,2019-10-09 14:19:58.736950697,2881353,T,IEX,53.805000,9
2019-10-09 14:20:21.954362112,2019-10-09 14:20:21.954340648,2900165,T,IEX,53.815000,1
2019-10-09 14:21:30.402198016,2019-10-09 14:21:30.402181424,2946798,T,IEX,53.805000,1
2019-10-09 14:22:19.544862976,2019-10-09 14:22:19.544847379,2977244,T,IEX,53.825000,1
2019-10-09 14:23:05.365956096,2019-10-09 14:23:05.365936317,3001294,T,IEX,53.805000,1
2019-10-09 14:23:21.166650880,2019-10-09 14:23:21.166631613,3012323,T,IEX,53.800000,100
2019-10-09 14:23:25.839628032,2019-10-09 14:23:25.839606731,3016248,T,IEX,53.800000,100
2019-10-09 14:23:25.936098048,2019-10-09 14:23:25.936077191,3017843,T,IEX,53.810000,100
2019-10-09 14:23:28.948872960,2019-10-09 14:23:28.948855405,3023911,T,IEX,53.810000,100
2019-10-09 14:23:29.137511936,2019-10-09 14:23:29.137495152,3024042,T,IEX,53.810000,100
2019-10-09 14:23:30.731988992,2019-10-09 14:23:30.731970910,3025550,T,IEX,53.810000,9
2019-10-09 14:23:30.732038912,2019-10-09 14:23:30.732021762,3025553,T,IEX,53.810000,100
2019-10-09 14:23:30.732090880,2019-10-09 14:23:30.732072671,3025555,T,IEX,53.810000,91
2019-10-09 14:23:51.955078912,2019-10-09 14:23:51.955057811,3043158,T,IEX,53.815000,1
2019-10-09 14:24:13.542774016,2019-10-09 14:24:13.542755888,3056583,T,IEX,53.815000,118
2019-10-09 14:24:13.542792960,2019-10-09 14:24:13.542775976,3056584,T,IEX,53.820000,100
2019-10-09 14:24:15.296235008,2019-10-09 14:24:15.296215155,3057644,T,IEX,53.830000,100
2019-10-09 14:24:16.933818880,2019-10-09 14:24:16.933802687,3058810,T,IEX,53.835000,100
2019-10-09 14:24:17.932300032,2019-10-09 14:24:17.932282298,3059367,T,IEX,53.830000,9
2019-10-09 14:24:17.932374016,2019-10-09 14:24:17.932357279,3059369,T,IEX,53.830000,191
2019-10-09 14:24:19.977667072,2019-10-09 14:24:19.977651686,3061354,T,IEX,53.815000,39
2019-10-09 14:24:37.377008128,2019-10-09 14:24:37.376991711,3072410,T,IEX,53.815000,1
2019-10-09 14:24:41.569059072,2019-10-09 14:24:41.569040754,3075108,T,IEX,53.810000,3
2019-10-09 14:24:41.572500992,2019-10-09 14:24:41.572478748,3075110,T,IEX,53.810000,3
2019-10-09 14:24:41.575907072,2019-10-09 14:24:41.575889158,3075115,T,IEX,53.810000,3
2019-10-09 14:24:41.580785920,2019-10-09 14:24:41.580764275,3075119,T,IEX,53.810000,3
2019-10-09 14:24:41.584186880,2019-10-09 14:24:41.584164288,3075121,T,IEX,53.810000,3
2019-10-09 14:24:41.587584000,2019-10-09 14:24:41.587563963,3075123,T,IEX,53.810000,3
2019-10-09 14:24:41.592185088,2019-10-09 14:24:41.592165434,3075126,T,IEX,53.810000,2
2019-10-09 14:24:41.595585024,2019-10-09 14:24:41.595562612,3075128,T,IEX,53.810000,2
2019-10-09 14:24:41.598978048,2019-10-09 14:24:41.598959406,3075132,T,IEX,53.810000,2
2019-10-09 14:24:41.608043008,2019-10-09 14:24:41.608023303,3075135,T,IEX,53.810000,176
2019-10-09 14:25:13.539296000,2019-10-09 14:25:13.539280404,3095752,T,IEX,53.825000,100
2019-10-09 14:25:27.630363904,2019-10-09 14:25:27.630348701,3106119,T,IEX,53.815000,1
2019-10-09 14:25:47.102700032,2019-10-09 14:25:47.102680300,3117552,T,IEX,53.800000,100
2019-10-09 14:25:47.136359936,2019-10-09 14:25:47.136337303,3118697,T,IEX,53.815000,100
2019-10-09 14:25:57.192945920,2019-10-09 14:25:57.192929052,3127593,T,IEX,53.805000,100
2019-10-09 14:26:15.397214976,2019-10-09 14:26:15.397196820,3137868,T,IEX,53.795000,1
2019-10-09 14:26:20.409923072,2019-10-09 14:26:20.409905941,3140096,T,IEX,53.800000,100
2019-10-09 14:26:51.509864960,2019-10-09 14:26:51.509846587,3157120,T,IEX,53.810000,100
2019-10-09 14:26:51.510209024,2019-10-09 14:26:51.510186985,3157139,T,IEX,53.805000,100
2019-10-09 14:26:54.862012928,2019-10-09 14:26:54.861994788,3160028,T,IEX,53.805000,1
2019-10-09 14:27:53.117071104,2019-10-09 14:27:53.117051288,3192740,T,IEX,53.810000,100
2019-10-09 14:27:59.178375936,2019-10-09 14:27:59.178356327,3195709,T,IEX,53.805000,1
2019-10-09 14:28:02.461583872,2019-10-09 14:28:02.461563692,3197684,T,IEX,53.805000,20
2019-10-09 14:28:27.928453120,2019-10-09 14:28:27.928437115,3212929,T,IEX,53.790000,100
2019-10-09 14:28:52.426441984,2019-10-09 14:28:52.426423962,3225450,T,IEX,53.795000,1
2019-10-09 14:29:21.688400896,2019-10-09 14:29:21.688379017,3240639,T,IEX,53.810000,100
2019-10-09 14:29:21.688416000,2019-10-09 14:29:21.688390624,3240641,T,IEX,53.810000,100
2019-10-09 14:29:32.181477888,2019-10-09 14:29:32.181455468,3247773,T,IEX,53.810000,100
2019-10-09 14:29:32.182387968,2019-10-09 14:29:32.182370536,3247811,T,IEX,53.810000,100
2019-10-09 14:29:32.379340032,2019-10-09 14:29:32.379322919,3248214,T,IEX,53.805000,100
2019-10-09 14:29:37.433966080,2019-10-09 14:29:37.433944364,3251959,T,IEX,53.805000,1
2019-10-09 14:29:53.790984960,2019-10-09 14:29:53.790966259,3262231,T,IEX,53.810000,100
2019-10-09 14:30:00.158915072,2019-10-09 14:30:00.158897654,3266010,T,IEX,53.810000,100
2019-10-09 14:30:00.158996992,2019-10-09 14:30:00.158980589,3266013,T,IEX,53.810000,100
2019-10-09 14:30:07.224600064,2019-10-09 14:30:07.224579990,3275042,T,IEX,53.850000,100
2019-10-09 14:30:21.291902976,2019-10-09 14:30:21.291884101,3290129,T,IEX,53.845000,100
2019-10-09 14:30:21.291930112,2019-10-09 14:30:21.291912820,3290130,T,IEX,53.845000,100
2019-10-09 14:30:28.18393088,2019-10-09 14:30:28.18372030,3295646,T,IEX,53.875000,1
2019-10-09 14:30:36.510094080,2019-10-09 14:30:36.510077886,3303035,T,IEX,53.875000,139
2019-10-09 14:31:27.317103104,2019-10-09 14:31:27.317083514,3357360,T,IEX,53.890000,11
2019-10-09 14:31:27.801415936,2019-10-09 14:31:27.801400619,3358052,T,IEX,53.905000,1
2019-10-09 14:31:34.48488960,2019-10-09 14:31:34.48469798,3362240,T,IEX,53.890000,100
2019-10-09 14:31:41.386951936,2019-10-09 14:31:41.386935030,3366398,T,IEX,53.910000,100
2019-10-09 14:31:49.680236032,2019-10-09 14:31:49.680220514,3371118,T,IEX,53.910000,100
2019-10-09 14:32:15.777672960,2019-10-09 14:32:15.777653684,3389271,T,IEX,53.925000,100
2019-10-09 14:32:23.779170048,2019-10-09 14:32:23.779152809,3395504,T,IEX,53.925000,100
2019-10-09 14:32:26.828139008,2019-10-09 14:32:26.828121262,3398726,T,IEX,53.925000,1
2019-10-09 14:32:40.592305920,2019-10-09 14:32:40.592288764,3408132,T,IEX,53.930000,200
2019-10-09 14:32:45.731885056,2019-10-09 14:32:45.731864670,3411689,T,IEX,53.925000,100
2019-10-09 14:32:47.54642944,2019-10-09 14:32:47.54627634,3412844,T,IEX,53.920000,9
2019-10-09 14:33:00.963747072,2019-10-09 14:33:00.963729254,3421066,T,IEX,53.925000,1
2019-10-09 14:33:02.300080896,2019-10-09 14:33:02.300063524,3421662,T,IEX,53.925000,1
2019-10-09 14:33:14.502797056,2019-10-09 14:33:14.502780301,3429350,T,IEX,53.905000,1
2019-10-09 14:33:21.410921984,2019-10-09 14:33:21.410906471,3433617,T,IEX,53.905000,1
2019-10-09 14:33:27.41731072,2019-10-09 14:33:27.41702738,3437946,T,IEX,53.885000,100
2019-10-09 14:33:40.973822976,2019-10-09 14:33:40.973803658,3449238,T,IEX,53.880000,158
2019-10-09 14:33:40.974784000,2019-10-09 14:33:40.974766094,3449239,T,IEX,53.880000,100
2019-10-09 14:33:45.153888000,2019-10-09 14:33:45.153872769,3451659,T,IEX,53.885000,1
2019-10-09 14:33:45.168943104,2019-10-09 14:33:45.168924475,3451685,T,IEX,53.885000,2
2019-10-09 14:33:45.499840000,2019-10-09 14:33:45.499820690,3451873,T,IEX,53.880000,200
2019-10-09 14:33:55.610191104,2019-10-09 14:33:55.610170143,3456585,T,IEX,53.875000,1
2019-10-09 14:33:56.889502976,2019-10-09 14:33:56.889488048,3457153,T,IEX,53.875000,1
2019-10-09 14:33:57.344889088,2019-10-09 14:33:57.344872170,3457432,T,IEX,53.865000,100
2019-10-09 14:34:08.486042880,2019-10-09 14:34:08.486025547,3464878,T,IEX,53.865000,1
2019-10-09 14:34:14.210891008,2019-10-09 14:34:14.210874126,3468721,T,IEX,53.865000,2
2019-10-09 14:34:22.728269056,2019-10-09 14:34:22.728249253,3474232,T,IEX,53.865000,100
2019-10-09 14:34:30.507162112,2019-10-09 14:34:30.507143036,3478647,T,IEX,53.865000,1
2019-10-09 14:34:41.22334976,2019-10-09 14:34:41.22316499,3484018,T,IEX,53.865000,100
2019-10-09 14:34:47.730184960,2019-10-09 14:34:47.730165490,3488951,T,IEX,53.865000,100
2019-10-09 14:34:49.554501120,2019-10-09 14:34:49.554486090,3490040,T,IEX,53.865000,2
2019-10-09 14:34:57.869647104,2019-10-09 14:34:57.869629928,3496328,T,IEX,53.865000,1
2019-10-09 14:34:57.920662016,2019-10-09 14:34:57.920644111,3496370,T,IEX,53.865000,1
2019-10-09 14:35:04.242576896,2019-10-09 14:35:04.242558289,3501355,T,IEX,53.865000,3
2019-10-09 14:35:04.334953984,2019-10-09 14:35:04.334936977,3501413,T,IEX,53.865000,100
2019-10-09 14:35:12.600059904,2019-10-09 14:35:12.600044185,3508397,T,IEX,53.855000,4
2019-10-09 14:35:44.998161920,2019-10-09 14:35:44.998143285,3526143,T,IEX,53.845000,295
2019-10-09 14:35:46.910277120,2019-10-09 14:35:46.910262159,3527411,T,IEX,53.845000,100
2019-10-09 14:36:00.788040960,2019-10-09 14:36:00.788016866,3535623,T,IEX,53.865000,1
2019-10-09 14:36:00.788058112,2019-10-09 14:36:00.788037175,3535625,T,IEX,53.865000,2
2019-10-09 14:36:31.922713088,2019-10-09 14:36:31.922691253,3560019,T,IEX,53.860000,1
2019-10-09 14:36:55.713478912,2019-10-09 14:36:55.713456976,3578453,T,IEX,53.865000,1
2019-10-09 14:37:18.361560064,2019-10-09 14:37:18.361541291,3594521,T,IEX,53.865000,2
2019-10-09 14:37:26.75927040,2019-10-09 14:37:26.75908617,3598473,T,IEX,53.855000,2
2019-10-09 14:37:26.75939072,2019-10-09 14:37:26.75921659,3598474,T,IEX,53.855000,1
2019-10-09 14:38:11.90723072,2019-10-09 14:38:11.90707751,3627803,T,IEX,53.855000,1
2019-10-09 14:38:34.765548032,2019-10-09 14:38:34.765531569,3643758,T,IEX,53.815000,100
2019-10-09 14:38:57.889859072,2019-10-09 14:38:57.889840705,3659817,T,IEX,53.815000,1
2019-10-09 14:39:13.358752000,2019-10-09 14:39:13.358730331,3674377,T,IEX,53.795000,1
2019-10-09 14:39:25.71747072,2019-10-09 14:39:25.71726898,3684471,T,IEX,53.790000,100
2019-10-09 14:39:29.426710016,2019-10-09 14:39:29.426694835,3687320,T,IEX,53.795000,100
2019-10-09 14:40:09.8333056,2019-10-09 14:40:09.8317442,3711919,T,IEX,53.815000,1
2019-10-09 14:41:11.81604096,2019-10-09 14:41:11.81583610,3750022,T,IEX,53.805000,1
2019-10-09 14:41:15.532793088,2019-10-09 14:41:15.532774867,3753545,T,IEX,53.800000,1
2019-10-09 14:42:00.81648128,2019-10-09 14:42:00.81625645,3783571,T,IEX,53.805000,1
2019-10-09 14:42:12.95920128,2019-10-09 14:42:12.95896894,3791178,T,IEX,53.815000,100
2019-10-09 14:42:14.175377920,2019-10-09 14:42:14.175362516,3792582,T,IEX,53.795000,40
2019-10-09 14:42:56.280989952,2019-10-09 14:42:56.280970312,3817406,T,IEX,53.815000,4
2019-10-09 14:43:00.743881984,2019-10-09 14:43:00.743862610,3819794,T,IEX,53.815000,1
2019-10-09 14:43:24.643002880,2019-10-09 14:43:24.642983987,3837642,T,IEX,53.835000,4
2019-10-09 14:44:03.557079040,2019-10-09 14:44:03.557061259,3859429,T,IEX,53.835000,1
2019-10-09 14:45:03.156672000,2019-10-09 14:45:03.156653068,3894317,T,IEX,53.845000,1
2019-10-09 14:45:33.535884032,2019-10-09 14:45:33.535868744,3910929,T,IEX,53.865000,1
2019-10-09 14:45:33.535898112,2019-10-09 14:45:33.535881848,3910930,T,IEX,53.865000,100
2019-10-09 14:45:51.93456896,2019-10-09 14:45:51.93438900,3921079,T,IEX,53.885000,100
2019-10-09 14:45:57.148699904,2019-10-09 14:45:57.148678987,3927056,T,IEX,53.880000,5
2019-10-09 14:46:02.512068096,2019-10-09 14:46:02.512049869,3930227,T,IEX,53.865000,100
2019-10-09 14:46:04.634362112,2019-10-09 14:46:04.634346538,3931606,T,IEX,53.865000,100
2019-10-09 14:46:05.35282944,2019-10-09 14:46:05.35265058,3931878,T,IEX,53.870000,4
2019-10-09 14:46:14.560112128,2019-10-09 14:46:14.560093824,3938709,T,IEX,53.855000,1
2019-10-09 14:46:47.947644928,2019-10-09 14:46:47.947629164,3956658,T,IEX,53.855000,100
2019-10-09 14:47:08.700054016,2019-10-09 14:47:08.700034298,3969155,T,IEX,53.845000,1
2019-10-09 14:47:50.569559040,2019-10-09 14:47:50.569541241,3999629,T,IEX,53.835000,1
2019-10-09 14:48:05.287337984,2019-10-09 14:48:05.287318148,4008708,T,IEX,53.840000,46
2019-10-09 14:48:13.102094080,2019-10-09 14:48:13.102076147,4014290,T,IEX,53.835000,100
2019-10-09 14:48:56.967392000,2019-10-09 14:48:56.967374406,4034797,T,IEX,53.835000,1
2019-10-09 14:49:20.232866048,2019-10-09 14:49:20.232849527,4049779,T,IEX,53.815000,100
2019-10-09 14:49:35.637086976,2019-10-09 14:49:35.637065541,4059297,T,IEX,53.820000,5
2019-10-09 14:49:44.35048960,2019-10-09 14:49:44.35028099,4062705,T,IEX,53.830000,100
2019-10-09 14:49:57.722201088,2019-10-09 14:49:57.722181049,4071357,T,IEX,53.835000,1
2019-10-09 14:50:03.139516928,2019-10-09 14:50:03.139497927,4074175,T,IEX,53.835000,100
2019-10-09 14:50:19.405411072,2019-10-09 14:50:19.405393077,4082680,T,IEX,53.845000,100
2019-10-09 14:50:23.41455104,2019-10-09 14:50:23.41437519,4084928,T,IEX,53.840000,100
2019-10-09 14:50:41.637936128,2019-10-09 14:50:41.637918660,4093187,T,IEX,53.840000,5
2019-10-09 14:50:55.729195008,2019-10-09 14:50:55.729180082,4100487,T,IEX,53.855000,1
2019-10-09 14:50:58.385978880,2019-10-09 14:50:58.385961422,4101844,T,IEX,53.845000,5
2019-10-09 14:51:30.335009024,2019-10-09 14:51:30.334993791,4119340,T,IEX,53.845000,13
2019-10-09 14:51:30.367017984,2019-10-09 14:51:30.366998245,4119432,T,IEX,53.850000,16
2019-10-09 14:51:31.787727104,2019-10-09 14:51:31.787708809,4121990,T,IEX,53.835000,3
2019-10-09 14:51:42.601626112,2019-10-09 14:51:42.601608942,4130221,T,IEX,53.835000,1
2019-10-09 14:51:42.691418880,2019-10-09 14:51:42.691402238,4130729,T,IEX,53.820000,100
2019-10-09 14:52:01.218007040,2019-10-09 14:52:01.217991421,4140793,T,IEX,53.825000,100
2019-10-09 14:52:01.218852096,2019-10-09 14:52:01.218835161,4140799,T,IEX,53.825000,100
2019-10-09 14:52:14.740909056,2019-10-09 14:52:14.740893424,4150565,T,IEX,53.830000,100
2019-10-09 14:52:15.827527936,2019-10-09 14:52:15.827512187,4151237,T,IEX,53.835000,3
2019-10-09 14:52:17.281476096,2019-10-09 14:52:17.281456181,4152046,T,IEX,53.840000,15
2019-10-09 14:52:34.610597120,2019-10-09 14:52:34.610581203,4165579,T,IEX,53.845000,1
2019-10-09 14:52:41.456687104,2019-10-09 14:52:41.456671692,4170041,T,IEX,53.840000,2
2019-10-09 14:53:04.327590912,2019-10-09 14:53:04.327574100,4181744,T,IEX,53.840000,3
2019-10-09 14:53:20.318492928,2019-10-09 14:53:20.318474461,4191121,T,IEX,53.835000,1
2019-10-09 14:54:00.615426048,2019-10-09 14:54:00.615406029,4214644,T,IEX,53.835000,1
2019-10-09 14:54:15.696945920,2019-10-09 14:54:15.696925107,4224140,T,IEX,53.840000,100
2019-10-09 14:54:26.104248064,2019-10-09 14:54:26.104229451,4231891,T,IEX,53.840000,4
2019-10-09 14:54:52.657650944,2019-10-09 14:54:52.657632539,4244633,T,IEX,53.845000,1
2019-10-09 14:55:12.116226048,2019-10-09 14:55:12.116205167,4263881,T,IEX,53.835000,100
2019-10-09 14:55:12.116272128,2019-10-09 14:55:12.116254095,4263882,T,IEX,53.835000,28
2019-10-09 14:55:20.189659904,2019-10-09 14:55:20.189643432,4270386,T,IEX,53.845000,100
2019-10-09 14:55:25.23360000,2019-10-09 14:55:25.23343500,4273666,T,IEX,53.835000,100
2019-10-09 14:55:25.23375104,2019-10-09 14:55:25.23356024,4273667,T,IEX,53.835000,100
2019-10-09 14:55:25.23385088,2019-10-09 14:55:25.23367522,4273668,T,IEX,53.835000,72
2019-10-09 14:55:42.245325056,2019-10-09 14:55:42.245304406,4284792,T,IEX,53.845000,64
2019-10-09 14:55:43.164135936,2019-10-09 14:55:43.164119258,4285904,T,IEX,53.855000,1
2019-10-09 14:56:29.245116928,2019-10-09 14:56:29.245096829,4312682,T,IEX,53.835000,100
2019-10-09 14:56:38.568815104,2019-10-09 14:56:38.568799254,4316872,T,IEX,53.835000,100
2019-10-09 14:56:46.964954112,2019-10-09 14:56:46.964935583,4321651,T,IEX,53.835000,1
2019-10-09 14:57:29.302355968,2019-10-09 14:57:29.302340292,4341248,T,IEX,53.825000,73
2019-10-09 14:57:29.303088128,2019-10-09 14:57:29.303070374,4341250,T,IEX,53.830000,100
2019-10-09 14:58:08.165444096,2019-10-09 14:58:08.165428449,4361912,T,IEX,53.835000,1
2019-10-09 14:58:28.987288064,2019-10-09 14:58:28.987272093,4372485,T,IEX,53.830000,1
2019-10-09 14:59:11.142812928,2019-10-09 14:59:11.142794065,4391066,T,IEX,53.835000,1
2019-10-09 14:59:24.65595904,2019-10-09 14:59:24.65576124,4395761,T,IEX,53.835000,2
2019-10-09 14:59:32.504619008,2019-10-09 14:59:32.504598565,4399734,T,IEX,53.830000,100
2019-10-09 14:59:32.504677120,2019-10-09 14:59:32.504659526,4399735,T,IEX,53.830000,100
2019-10-09 14:59:37.132133120,2019-10-09 14:59:37.132117426,4402134,T,IEX,53.830000,100
2019-10-09 15:00:19.189616896,2019-10-09 15:00:19.189599649,4432682,T,IEX,53.840000,100
2019-10-09 15:00:19.228743936,2019-10-09 15:00:19.228721910,4432952,T,IEX,53.840000,100
2019-10-09 15:00:19.229456896,2019-10-09 15:00:19.229438497,4432975,T,IEX,53.840000,100
2019-10-09 15:00:19.229792000,2019-10-09 15:00:19.229772792,4432983,T,IEX,53.840000,100
2019-10-09 15:00:19.230064128,2019-10-09 15:00:19.230044404,4432992,T,IEX,53.840000,100
2019-10-09 15:00:19.230155008,2019-10-09 15:00:19.230136309,4432995,T,IEX,53.840000,100
2019-10-09 15:00:20.755749888,2019-10-09 15:00:20.755725175,4434482,T,IEX,53.845000,1
2019-10-09 15:00:20.755799040,2019-10-09 15:00:20.755781120,4434483,T,IEX,53.845000,4
2019-10-09 15:00:20.756014080,2019-10-09 15:00:20.755998025,4434484,T,IEX,53.845000,13
2019-10-09 15:00:58.503887104,2019-10-09 15:00:58.503867657,4465379,T,IEX,53.830000,100
2019-10-09 15:01:00.292531968,2019-10-09 15:01:00.292514170,4467273,T,IEX,53.830000,100
2019-10-09 15:01:00.294432000,2019-10-09 15:01:00.294412720,4467275,T,IEX,53.825000,100
2019-10-09 15:01:23.62983936,2019-10-09 15:01:23.62964161,4483137,T,IEX,53.845000,1
2019-10-09 15:01:33.649705984,2019-10-09 15:01:33.649688823,4495552,T,IEX,53.835000,3
2019-10-09 15:02:06.545530880,2019-10-09 15:02:06.545515692,4533963,T,IEX,53.835000,1
2019-10-09 15:03:12.949219072,2019-10-09 15:03:12.949203109,4593492,T,IEX,53.765000,1
2019-10-09 15:03:56.536882944,2019-10-09 15:03:56.536865118,4632565,T,IEX,53.755000,100
2019-10-09 15:03:56.538554880,2019-10-09 15:03:56.538539173,4632574,T,IEX,53.755000,100
2019-10-09 15:04:23.786353920,2019-10-09 15:04:23.786335574,4648710,T,IEX,53.755000,1
2019-10-09 15:04:30.901159936,2019-10-09 15:04:30.901143112,4651973,T,IEX,53.735000,100
2019-10-09 15:05:00.80077056,2019-10-09 15:05:00.80060773,4666878,T,IEX,53.725000,100
2019-10-09 15:05:02.239480064,2019-10-09 15:05:02.239464799,4669307,T,IEX,53.725000,1
2019-10-09 15:05:10.513511936,2019-10-09 15:05:10.513496573,4677187,T,IEX,53.735000,100
2019-10-09 15:05:29.611326976,2019-10-09 15:05:29.611308791,4689453,T,IEX,53.740000,2
2019-10-09 15:05:42.750370048,2019-10-09 15:05:42.750348670,4699019,T,IEX,53.730000,69
2019-10-09 15:05:56.707378944,2019-10-09 15:05:56.707359600,4707402,T,IEX,53.725000,1
2019-10-09 15:06:10.281907968,2019-10-09 15:06:10.281890161,4719141,T,IEX,53.725000,1
2019-10-09 15:06:10.295023104,2019-10-09 15:06:10.295004803,4719167,T,IEX,53.715000,2
2019-10-09 15:06:30.828748032,2019-10-09 15:06:30.828727989,4731829,T,IEX,53.715000,1
2019-10-09 15:06:30.828758016,2019-10-09 15:06:30.828741126,4731830,T,IEX,53.715000,1
2019-10-09 15:06:42.75396096,2019-10-09 15:06:42.75376271,4738563,T,IEX,53.715000,1
2019-10-09 15:06:53.712939008,2019-10-09 15:06:53.712921378,4745961,T,IEX,53.725000,1
2019-10-09 15:07:43.541196032,2019-10-09 15:07:43.541180446,4786761,T,IEX,53.715000,100
2019-10-09 15:07:43.541210112,2019-10-09 15:07:43.541193613,4786762,T,IEX,53.715000,34
2019-10-09 15:07:43.554448896,2019-10-09 15:07:43.554431479,4786774,T,IEX,53.715000,2
2019-10-09 15:07:55.728731904,2019-10-09 15:07:55.728712049,4797410,T,IEX,53.705000,1
2019-10-09 15:08:05.195682048,2019-10-09 15:08:05.195662163,4802653,T,IEX,53.705000,1
2019-10-09 15:08:16.231686912,2019-10-09 15:08:16.231669772,4811941,T,IEX,53.695000,12
2019-10-09 15:08:16.232516096,2019-10-09 15:08:16.232497370,4811980,T,IEX,53.695000,86
2019-10-09 15:08:24.450800128,2019-10-09 15:08:24.450782127,4817436,T,IEX,53.705000,2
2019-10-09 15:08:24.466082048,2019-10-09 15:08:24.466066262,4817540,T,IEX,53.705000,1
2019-10-09 15:08:25.502560000,2019-10-09 15:08:25.502545105,4818399,T,IEX,53.700000,2
2019-10-09 15:08:25.502580992,2019-10-09 15:08:25.502564712,4818400,T,IEX,53.700000,1
2019-10-09 15:08:25.516422912,2019-10-09 15:08:25.516402392,4818419,T,IEX,53.695000,12
2019-10-09 15:08:53.737588992,2019-10-09 15:08:53.737568649,4839407,T,IEX,53.695000,1
2019-10-09 15:09:10.576112896,2019-10-09 15:09:10.576095038,4849932,T,IEX,53.705000,2
2019-10-09 15:09:10.590220032,2019-10-09 15:09:10.590197858,4849945,T,IEX,53.705000,2
2019-10-09 15:09:13.164314112,2019-10-09 15:09:13.164298498,4851537,T,IEX,53.695000,100
2019-10-09 15:09:26.638888960,2019-10-09 15:09:26.638869960,4857631,T,IEX,53.700000,12
2019-10-09 15:09:26.652122112,2019-10-09 15:09:26.652104453,4857720,T,IEX,53.705000,2
2019-10-09 15:09:52.796089088,2019-10-09 15:09:52.796068867,4873691,T,IEX,53.705000,6
2019-10-09 15:09:54.744342016,2019-10-09 15:09:54.744321877,4874725,T,IEX,53.705000,1
2019-10-09 15:10:05.719081984,2019-10-09 15:10:05.719062672,4884561,T,IEX,53.705000,48
2019-10-09 15:10:08.71408128,2019-10-09 15:10:08.71389756,4886148,T,IEX,53.705000,5
2019-10-09 15:10:08.419032064,2019-10-09 15:10:08.419012918,4886437,T,IEX,53.705000,33
2019-10-09 15:10:08.419053056,2019-10-09 15:10:08.419031400,4886439,T,IEX,53.705000,67
2019-10-09 15:10:08.851435008,2019-10-09 15:10:08.851419934,4887043,T,IEX,53.705000,100
2019-10-09 15:10:10.144621056,2019-10-09 15:10:10.144601863,4888901,T,IEX,53.705000,100
2019-10-09 15:10:10.290523904,2019-10-09 15:10:10.290504950,4889144,T,IEX,53.705000,100
2019-10-09 15:10:10.333976064,2019-10-09 15:10:10.333958806,4889225,T,IEX,53.705000,100
2019-10-09 15:10:12.802387968,2019-10-09 15:10:12.802368771,4892305,T,IEX,53.700000,3
2019-10-09 15:10:15.262046976,2019-10-09 15:10:15.262025863,4894378,T,IEX,53.690000,100
2019-10-09 15:10:15.321478912,2019-10-09 15:10:15.321452930,4894403,T,IEX,53.685000,100
2019-10-09 15:10:15.323176960,2019-10-09 15:10:15.323160304,4894407,T,IEX,53.685000,100
2019-10-09 15:10:53.688771072,2019-10-09 15:10:53.688753813,4916496,T,IEX,53.685000,1
2019-10-09 15:11:52.517611008,2019-10-09 15:11:52.517593751,4946645,T,IEX,53.665000,1
2019-10-09 15:11:54.139523072,2019-10-09 15:11:54.139505869,4947827,T,IEX,53.655000,100
2019-10-09 15:12:02.777445888,2019-10-09 15:12:02.777430225,4952255,T,IEX,53.655000,5
2019-10-09 15:12:32.937593088,2019-10-09 15:12:32.937576702,4972608,T,IEX,53.620000,100
2019-10-09 15:12:41.773466112,2019-10-09 15:12:41.773448469,4977645,T,IEX,53.625000,100
2019-10-09 15:12:41.782724096,2019-10-09 15:12:41.782702729,4977778,T,IEX,53.630000,5
2019-10-09 15:12:41.805069056,2019-10-09 15:12:41.805051405,4977916,T,IEX,53.625000,100
2019-10-09 15:12:41.813154048,2019-10-09 15:12:41.813134728,4977951,T,IEX,53.625000,13
2019-10-09 15:12:52.453389056,2019-10-09 15:12:52.453371354,4983829,T,IEX,53.645000,300
2019-10-09 15:12:55.305921024,2019-10-09 15:12:55.305902639,4985379,T,IEX,53.645000,100
2019-10-09 15:12:55.305993984,2019-10-09 15:12:55.305972510,4985382,T,IEX,53.645000,130
2019-10-09 15:12:55.315495936,2019-10-09 15:12:55.315478921,4985482,T,IEX,53.640000,100
2019-10-09 15:13:03.109638912,2019-10-09 15:13:03.109619644,4989975,T,IEX,53.635000,1
2019-10-09 15:13:26.609865984,2019-10-09 15:13:26.609848400,5003849,T,IEX,53.665000,100
2019-10-09 15:13:41.664463104,2019-10-09 15:13:41.664447124,5011075,T,IEX,53.655000,100
2019-10-09 15:13:41.678392064,2019-10-09 15:13:41.678375679,5011256,T,IEX,53.655000,100
2019-10-09 15:13:41.678412032,2019-10-09 15:13:41.678395490,5011257,T,IEX,53.655000,100
