2019-10-01 13:30:00.244553984,2019-10-01 13:30:00.244528816,92204,T,IEX,269.770000,50
2019-10-01 13:30:00.441688064,2019-10-01 13:30:00.441662635,93409,T,IEX,269.720000,300
2019-10-01 13:30:04.982856960,2019-10-01 13:30:04.982833312,111614,T,IEX,269.740000,1
2019-10-01 13:30:05.73136128,2019-10-01 13:30:05.73111654,112049,T,IEX,269.740000,1
2019-10-01 13:30:05.119238912,2019-10-01 13:30:05.119211587,112213,T,IEX,269.750000,1
2019-10-01 13:30:06.89391104,2019-10-01 13:30:06.89366632,115312,T,IEX,269.790000,100
2019-10-01 13:30:08.29473024,2019-10-01 13:30:08.29445927,120474,T,IEX,269.750000,100
2019-10-01 13:30:26.592013056,2019-10-01 13:30:26.591990226,147783,T,IEX,269.780000,100
2019-10-01 13:30:28.762452992,2019-10-01 13:30:28.762428986,150020,T,IEX,269.775000,100
2019-10-01 13:50:17.694750976,2019-10-01 13:50:17.694732646,1198991,T,IEX,270.260000,100
2019-10-01 14:00:00.707072,2019-10-01 14:00:00.687935,1655968,T,IEX,270.160000,29
2019-10-01 14:00:00.868096,2019-10-01 14:00:00.850549,1655971,T,IEX,270.160000,29
2019-10-01 14:00:00.944896,2019-10-01 14:00:00.927688,1655973,T,IEX,270.160000,42
2019-10-01 14:00:00.1239040,2019-10-01 14:00:00.1223863,1655986,T,IEX,270.150000,100
2019-10-01 14:00:00.2302976,2019-10-01 14:00:00.2286054,1656003,T,IEX,270.130000,100
2019-10-01 14:00:00.167721984,2019-10-01 14:00:00.167701602,1660013,T,IEX,269.770000,100
2019-10-01 14:00:10.62149120,2019-10-01 14:00:10.62130287,1689421,T,IEX,269.380000,100
2019-10-01 14:00:17.479013120,2019-10-01 14:00:17.478991551,1720475,T,IEX,269.620000,100
2019-10-01 14:05:19.899301120,2019-10-01 14:05:19.899281954,2314701,T,IEX,268.750000,38
2019-10-01 14:05:27.855941120,2019-10-01 14:05:27.855921974,2336593,T,IEX,268.630000,100
2019-10-01 14:05:31.610141952,2019-10-01 14:05:31.610122428,2347323,T,IEX,268.570000,100
2019-10-01 14:13:02.117408000,2019-10-01 14:13:02.117388659,3044452,T,IEX,267.760000,100
2019-10-01 14:20:27.547570944,2019-10-01 14:20:27.547551507,3665193,T,IEX,267.490000,54
2019-10-01 14:39:53.175385088,2019-10-01 14:39:53.175364378,5035546,T,IEX,267.930000,68
2019-10-01 14:43:05.162056960,2019-10-01 14:43:05.162036094,5236403,T,IEX,267.610000,100
2019-10-01 14:45:02.499089920,2019-10-01 14:45:02.499069706,5375832,T,IEX,267.620000,100
2019-10-01 14:45:40.55447040,2019-10-01 14:45:40.55427638,5415699,T,IEX,267.640000,100
2019-10-01 14:45:40.55460096,2019-10-01 14:45:40.55443431,5415700,T,IEX,267.640000,100
2019-10-01 14:45:41.230620928,2019-10-01 14:45:41.230602012,5416926,T,IEX,267.660000,100
2019-10-01 14:49:07.761806080,2019-10-01 14:49:07.761787728,5641726,T,IEX,267.590000,1
2019-10-01 14:49:10.590448896,2019-10-01 14:49:10.590431337,5644655,T,IEX,267.590000,100
2019-10-01 14:49:14.758973952,2019-10-01 14:49:14.758956075,5653347,T,IEX,267.570000,100
2019-10-01 15:00:01.496670976,2019-10-01 15:00:01.496651992,6371311,T,IEX,267.180000,100
2019-10-01 15:00:01.522188032,2019-10-01 15:00:01.522168593,6371808,T,IEX,267.180000,100
2019-10-01 15:00:09.271531008,2019-10-01 15:00:09.271511615,6390517,T,IEX,267.180000,100
2019-10-01 15:03:43.935194112,2019-10-01 15:03:43.935174033,6633143,T,IEX,266.900000,100
2019-10-01 15:07:40.19500032,2019-10-01 15:07:40.19483698,6882193,T,IEX,267.000000,100
2019-10-01 15:24:58.311179008,2019-10-01 15:24:58.311162796,7781999,T,IEX,267.290000,100
2019-10-01 15:25:10.194088960,2019-10-01 15:25:10.194070433,7793625,T,IEX,267.280000,100
2019-10-01 15:31:42.136073984,2019-10-01 15:31:42.135958998,8116588,T,IEX,267.435000,100
2019-10-01 15:32:00.399644928,2019-10-01 15:32:00.399627135,8129098,T,IEX,267.390000,100
2019-10-01 15:34:23.642448896,2019-10-01 15:34:23.642432647,8251329,T,IEX,267.235000,200
2019-10-01 15:34:23.642461952,2019-10-01 15:34:23.642445574,8251330,T,IEX,267.235000,200
2019-10-01 15:34:23.650007040,2019-10-01 15:34:23.649988712,8251334,T,IEX,267.235000,100
2019-10-01 15:34:23.900136960,2019-10-01 15:34:23.900117120,8251602,T,IEX,267.235000,100
2019-10-01 15:34:24.547520000,2019-10-01 15:34:24.547503900,8252052,T,IEX,267.235000,100
2019-10-01 15:43:11.502038016,2019-10-01 15:43:11.502018771,8675848,T,IEX,266.800000,100
2019-10-01 15:43:11.536956928,2019-10-01 15:43:11.536935728,8676688,T,IEX,266.770000,100
2019-10-01 15:43:19.771789056,2019-10-01 15:43:19.771771617,8692852,T,IEX,266.870000,100
2019-10-01 15:56:49.853512960,2019-10-01 15:56:49.853493728,9296736,T,IEX,266.870000,100
2019-10-01 16:15:03.254345984,2019-10-01 16:15:03.254330477,10115014,T,IEX,266.190000,100
2019-10-01 16:22:49.300300032,2019-10-01 16:22:49.300285018,10538512,T,IEX,266.410000,92
2019-10-01 16:54:46.202048000,2019-10-01 16:54:46.202029198,11763532,T,IEX,266.390000,100
2019-10-01 16:56:58.442926080,2019-10-01 16:56:58.442907895,11833200,T,IEX,266.370000,100
2019-10-01 17:15:40.293860096,2019-10-01 17:15:40.293842582,12560663,T,IEX,265.920000,100
2019-10-01 17:46:15.929722880,2019-10-01 17:46:15.929694450,13701119,T,IEX,265.770000,100
2019-10-01 17:49:51.910966016,2019-10-01 17:49:51.910946780,13829652,T,IEX,265.840000,100
2019-10-01 17:55:32.437271040,2019-10-01 17:55:32.437254528,14013423,T,IEX,265.790000,100
2019-10-01 17:56:00.914544128,2019-10-01 17:56:00.914528368,14030448,T,IEX,265.740000,100
2019-10-01 18:03:28.695525888,2019-10-01 18:03:28.695508720,14327277,T,IEX,265.920000,100
2019-10-01 18:06:49.133326080,2019-10-01 18:06:49.133306037,14460815,T,IEX,265.650000,200
2019-10-01 18:08:37.442160896,2019-10-01 18:08:37.442139970,14520915,T,IEX,265.690000,100
2019-10-01 18:11:08.298272000,2019-10-01 18:11:08.298250590,14647504,T,IEX,265.590000,100
2019-10-01 18:12:32.401443072,2019-10-01 18:12:32.401413292,14720231,T,IEX,265.780000,100
2019-10-01 18:20:09.678351872,2019-10-01 18:20:09.678331958,14965210,T,IEX,265.840000,100
2019-10-01 18:24:28.829933056,2019-10-01 18:24:28.829914696,15113603,T,IEX,265.930000,100
2019-10-01 18:38:35.928112896,2019-10-01 18:38:35.928083884,15646229,T,IEX,265.980000,100
2019-10-01 18:41:02.415857920,2019-10-01 18:41:02.415838856,15736664,T,IEX,266.120000,200
2019-10-01 18:41:58.30369024,2019-10-01 18:41:58.30352234,15768750,T,IEX,266.160000,50
2019-10-01 18:44:00.226579968,2019-10-01 18:44:00.226562638,15834906,T,IEX,266.130000,100
2019-10-01 18:49:20.383163904,2019-10-01 18:49:20.383144047,16036332,T,IEX,266.310000,100
2019-10-01 18:51:35.725912064,2019-10-01 18:51:35.725890671,16136239,T,IEX,266.140000,100
2019-10-01 19:03:05.857622016,2019-10-01 19:03:05.857601775,16519816,T,IEX,266.100000,100
2019-10-01 19:08:52.198494976,2019-10-01 19:08:52.198475261,16727429,T,IEX,266.350000,100
2019-10-01 19:16:52.141036032,2019-10-01 19:16:52.141018514,17051513,T,IEX,266.140000,100
2019-10-01 19:23:19.40291072,2019-10-01 19:23:19.40268091,17265395,T,IEX,266.170000,100
2019-10-01 19:25:09.740819968,2019-10-01 19:25:09.740803618,17317468,T,IEX,266.240000,100
2019-10-01 19:27:12.44278016,2019-10-01 19:27:12.44260217,17414102,T,IEX,266.240000,100
2019-10-01 19:33:01.813917952,2019-10-01 19:33:01.813897249,17675993,T,IEX,266.060000,100
2019-10-01 19:38:04.32878080,2019-10-01 19:38:04.32859032,17922453,T,IEX,265.920000,100
2019-10-01 19:38:28.669627904,2019-10-01 19:38:28.669611964,17947819,T,IEX,265.910000,100
2019-10-01 19:39:45.536342016,2019-10-01 19:39:45.536325116,18002644,T,IEX,265.910000,100
2019-10-01 19:47:19.578885120,2019-10-01 19:47:19.578865829,18362499,T,IEX,265.800000,100
2019-10-01 19:48:00.536601088,2019-10-01 19:48:00.536578618,18394627,T,IEX,265.780000,100
2019-10-01 19:50:18.831505920,2019-10-01 19:50:18.831486865,18539377,T,IEX,265.740000,100
2019-10-01 19:51:28.565636096,2019-10-01 19:51:28.565616961,18599543,T,IEX,265.790000,100
2019-10-01 19:54:57.976845056,2019-10-01 19:54:57.976818410,18786263,T,IEX,265.830000,100
2019-10-01 19:56:20.739099904,2019-10-01 19:56:20.739081859,18922748,T,IEX,265.700000,100
2019-10-01 19:57:49.581020928,2019-10-01 19:57:49.580994215,19024797,T,IEX,265.570000,100
2019-10-01 19:58:00.414951936,2019-10-01 19:58:00.414926703,19038674,T,IEX,265.570000,100
2019-10-01 19:58:02.719919104,2019-10-01 19:58:02.719896954,19043907,T,IEX,265.620000,100
2019-10-01 19:58:14.308760064,2019-10-01 19:58:14.308730158,19062388,T,IEX,265.630000,2
2019-10-01 19:58:14.415203072,2019-10-01 19:58:14.415186156,19062947,T,IEX,265.630000,98
2019-10-01 19:58:25.537912064,2019-10-01 19:58:25.537892779,19077653,T,IEX,265.580000,100
2019-10-01 19:58:28.679801088,2019-10-01 19:58:28.679783010,19081270,T,IEX,265.580000,100
2019-10-01 19:58:30.239728128,2019-10-01 19:58:30.239710547,19083952,T,IEX,265.580000,100
2019-10-01 19:58:32.654270976,2019-10-01 19:58:32.654250885,19087599,T,IEX,265.580000,100
2019-10-01 19:58:32.654285056,2019-10-01 19:58:32.654267030,19087600,T,IEX,265.580000,100
2019-10-01 19:58:39.36186880,2019-10-01 19:58:39.36168114,19095942,T,IEX,265.550000,100
2019-10-01 19:58:39.233350912,2019-10-01 19:58:39.233330660,19096154,T,IEX,265.550000,100
2019-10-01 19:58:46.327838976,2019-10-01 19:58:46.327818972,19107821,T,IEX,265.580000,100
2019-10-01 19:58:46.327851008,2019-10-01 19:58:46.327834256,19107822,T,IEX,265.580000,100
2019-10-01 19:58:46.350449920,2019-10-01 19:58:46.350433728,19107868,T,IEX,265.590000,100
2019-10-01 19:58:46.351568896,2019-10-01 19:58:46.351552419,19107877,T,IEX,265.570000,100
2019-10-01 19:58:49.864797952,2019-10-01 19:58:49.864777488,19113632,T,IEX,265.550000,9
2019-10-01 19:58:50.167838976,2019-10-01 19:58:50.167820964,19114130,T,IEX,265.545000,100
2019-10-01 19:58:54.269815040,2019-10-01 19:58:54.269789865,19119199,T,IEX,265.520000,100
2019-10-01 19:58:57.127712000,2019-10-01 19:58:57.127694107,19124286,T,IEX,265.510000,6
2019-10-01 19:58:57.822348032,2019-10-01 19:58:57.822332135,19125398,T,IEX,265.510000,100
2019-10-01 19:58:57.822403072,2019-10-01 19:58:57.822385452,19125399,T,IEX,265.510000,94
2019-10-01 19:58:57.822417920,2019-10-01 19:58:57.822401465,19125400,T,IEX,265.510000,100
2019-10-01 19:58:58.840933888,2019-10-01 19:58:58.840916699,19126734,T,IEX,265.515000,100
2019-10-01 19:58:58.840946944,2019-10-01 19:58:58.840928828,19126735,T,IEX,265.520000,7
2019-10-01 19:58:59.63343104,2019-10-01 19:58:59.63327173,19127089,T,IEX,265.510000,100
2019-10-01 19:58:59.174356992,2019-10-01 19:58:59.174337936,19127230,T,IEX,265.515000,100
2019-10-01 19:58:59.183597056,2019-10-01 19:58:59.183579283,19127328,T,IEX,265.510000,100
2019-10-01 19:59:00.720086016,2019-10-01 19:59:00.720066086,19131472,T,IEX,265.530000,100
2019-10-01 19:59:00.721792000,2019-10-01 19:59:00.721768411,19131559,T,IEX,265.530000,100
2019-10-01 19:59:00.724190976,2019-10-01 19:59:00.724174204,19131660,T,IEX,265.540000,100
2019-10-01 19:59:00.727339008,2019-10-01 19:59:00.727313687,19131786,T,IEX,265.540000,100
2019-10-01 19:59:00.727374080,2019-10-01 19:59:00.727344185,19131790,T,IEX,265.550000,100
2019-10-01 19:59:00.729935104,2019-10-01 19:59:00.729914614,19131892,T,IEX,265.550000,100
2019-10-01 19:59:00.785829888,2019-10-01 19:59:00.785811123,19132638,T,IEX,265.570000,100
2019-10-01 19:59:00.785850880,2019-10-01 19:59:00.785832997,19132639,T,IEX,265.570000,100
2019-10-01 19:59:00.792043008,2019-10-01 19:59:00.792024004,19132874,T,IEX,265.580000,100
2019-10-01 19:59:00.792077056,2019-10-01 19:59:00.792047206,19132877,T,IEX,265.580000,100
2019-10-01 19:59:01.188429056,2019-10-01 19:59:01.188410281,19134371,T,IEX,265.580000,100
2019-10-01 19:59:02.26091008,2019-10-01 19:59:02.26072762,19136581,T,IEX,265.550000,16
2019-10-01 19:59:04.434168064,2019-10-01 19:59:04.434146565,19141507,T,IEX,265.550000,100
2019-10-01 19:59:07.299092992,2019-10-01 19:59:07.299074839,19146757,T,IEX,265.560000,25
2019-10-01 19:59:07.299727104,2019-10-01 19:59:07.299706164,19146769,T,IEX,265.560000,75
2019-10-01 19:59:15.36684032,2019-10-01 19:59:15.36662448,19161927,T,IEX,265.510000,5
2019-10-01 19:59:15.479881984,2019-10-01 19:59:15.479863864,19162837,T,IEX,265.520000,100
2019-10-01 19:59:15.480218880,2019-10-01 19:59:15.480201168,19162842,T,IEX,265.520000,100
2019-10-01 19:59:15.493754112,2019-10-01 19:59:15.493734909,19162896,T,IEX,265.520000,100
2019-10-01 19:59:15.493771008,2019-10-01 19:59:15.493754594,19162897,T,IEX,265.520000,100
2019-10-01 19:59:15.535315968,2019-10-01 19:59:15.535297121,19163397,T,IEX,265.570000,100
2019-10-01 19:59:17.490816000,2019-10-01 19:59:17.490796753,19167187,T,IEX,265.570000,100
2019-10-01 19:59:22.533008896,2019-10-01 19:59:22.532989108,19175034,T,IEX,265.570000,100
2019-10-01 19:59:24.950565120,2019-10-01 19:59:24.950548883,19180025,T,IEX,265.590000,100
2019-10-01 19:59:30.595228928,2019-10-01 19:59:30.595212061,19192420,T,IEX,265.530000,100
2019-10-01 19:59:32.478913024,2019-10-01 19:59:32.478895611,19204311,T,IEX,265.600000,100
2019-10-01 19:59:32.801349120,2019-10-01 19:59:32.801332765,19205466,T,IEX,265.600000,100
2019-10-01 19:59:32.801364992,2019-10-01 19:59:32.801347908,19205467,T,IEX,265.600000,100
2019-10-01 19:59:37.165553920,2019-10-01 19:59:37.165536619,19227549,T,IEX,265.570000,100
2019-10-01 19:59:38.1734912,2019-10-01 19:59:38.1716032,19230464,T,IEX,265.580000,100
2019-10-01 19:59:41.480965888,2019-10-01 19:59:41.480945841,19249325,T,IEX,265.550000,100
2019-10-01 19:59:44.708037120,2019-10-01 19:59:44.708013728,19269812,T,IEX,265.640000,100
2019-10-01 19:59:44.708069120,2019-10-01 19:59:44.708039984,19269817,T,IEX,265.640000,100
2019-10-01 19:59:45.22852096,2019-10-01 19:59:45.22833651,19272953,T,IEX,265.610000,100
2019-10-01 19:59:45.479212032,2019-10-01 19:59:45.479193276,19275629,T,IEX,265.620000,100
2019-10-01 19:59:45.479300096,2019-10-01 19:59:45.479281740,19275634,T,IEX,265.620000,100
2019-10-01 19:59:45.535546112,2019-10-01 19:59:45.535530127,19275959,T,IEX,265.610000,100
2019-10-01 19:59:49.91315968,2019-10-01 19:59:49.91301288,19289644,T,IEX,265.600000,100
2019-10-01 19:59:49.91335936,2019-10-01 19:59:49.91319156,19289645,T,IEX,265.600000,100
2019-10-01 19:59:49.92962048,2019-10-01 19:59:49.92941791,19289651,T,IEX,265.600000,69
2019-10-01 19:59:51.97744896,2019-10-01 19:59:51.97724587,19303852,T,IEX,265.570000,100
2019-10-01 19:59:52.519153920,2019-10-01 19:59:52.519137097,19311378,T,IEX,265.630000,100
2019-10-01 19:59:52.519176960,2019-10-01 19:59:52.519158253,19311380,T,IEX,265.630000,100
2019-10-01 19:59:54.91261952,2019-10-01 19:59:54.91246045,19322777,T,IEX,265.650000,100
2019-10-01 19:59:57.649208064,2019-10-01 19:59:57.649186626,19353676,T,IEX,265.450000,100
2019-10-01 19:59:59.187593984,2019-10-01 19:59:59.187577936,19370748,T,IEX,265.490000,100
2019-10-01 19:59:59.224665088,2019-10-01 19:59:59.224645902,19371176,T,IEX,265.480000,100
2019-10-01 19:59:59.251784960,2019-10-01 19:59:59.251765608,19371413,T,IEX,265.490000,100
2019-10-01 19:59:59.251799040,2019-10-01 19:59:59.251781950,19371414,T,IEX,265.490000,100
2019-10-01 19:59:59.281242880,2019-10-01 19:59:59.281224275,19371980,T,IEX,265.510000,100
2019-10-01 19:59:59.281273088,2019-10-01 19:59:59.281248797,19371983,T,IEX,265.510000,100
2019-10-01 19:59:59.499694080,2019-10-01 19:59:59.499676235,19374565,T,IEX,265.540000,100
2019-10-01 19:59:59.538865920,2019-10-01 19:59:59.538826920,19375119,T,IEX,265.550000,100
