2019-10-07 13:32:02.328467968,2019-10-07 13:32:02.328438970,210212,T,IEX,50.420000,220
2019-10-07 13:36:36.350181120,2019-10-07 13:36:36.350161687,499397,T,IEX,50.250000,33
2019-10-07 13:43:35.531262976,2019-10-07 13:43:35.531243510,833653,T,IEX,50.120000,197
2019-10-07 14:00:42.640327936,2019-10-07 14:00:42.640308945,1729608,T,IEX,50.130000,75
2019-10-07 14:01:35.390842112,2019-10-07 14:01:35.390817575,1779982,T,IEX,50.150000,75
2019-10-07 14:01:37.478409984,2019-10-07 14:01:37.478388634,1781223,T,IEX,50.150000,100
2019-10-07 14:01:37.478488064,2019-10-07 14:01:37.478468476,1781225,T,IEX,50.150000,34
2019-10-07 14:05:27.60254976,2019-10-07 14:05:27.60223774,1975861,T,IEX,50.300000,800
2019-10-07 14:09:49.562532096,2019-10-07 14:09:49.562516982,2222134,T,IEX,50.480000,100
2019-10-07 14:27:04.783853056,2019-10-07 14:27:04.783826223,2960221,T,IEX,50.540000,100
2019-10-07 14:27:51.319709952,2019-10-07 14:27:51.319686130,2993650,T,IEX,50.570000,100
2019-10-07 14:35:24.908806912,2019-10-07 14:35:24.908787208,3305559,T,IEX,50.530000,3
2019-10-07 14:47:49.436080896,2019-10-07 14:47:49.436061430,3862585,T,IEX,50.510000,100
2019-10-07 14:47:49.436355072,2019-10-07 14:47:49.436336685,3862597,T,IEX,50.510000,100
