2019-10-03 13:20:21.119595008,2019-10-03 13:20:21.119555057,76577,T,IEX,264.400000,5
2019-10-03 13:30:01.534043904,2019-10-03 13:30:01.534019910,116327,T,IEX,264.315000,100
2019-10-03 13:44:55.612222976,2019-10-03 13:44:55.612207574,1293034,T,IEX,264.450000,8
2019-10-03 13:47:39.487085056,2019-10-03 13:47:39.487067158,1535055,T,IEX,264.800000,100
2019-10-03 13:47:50.798246912,2019-10-03 13:47:50.798228005,1548721,T,IEX,264.785000,110
2019-10-03 13:51:42.215586048,2019-10-03 13:51:42.215561783,1796633,T,IEX,264.700000,100
2019-10-03 14:00:14.699297024,2019-10-03 14:00:14.699277017,2356561,T,IEX,263.470000,100
2019-10-03 14:00:14.699319040,2019-10-03 14:00:14.699297489,2356563,T,IEX,263.470000,100
2019-10-03 14:00:25.853135104,2019-10-03 14:00:25.853117705,2414240,T,IEX,262.870000,68
2019-10-03 14:00:25.854534912,2019-10-03 14:00:25.854516800,2414257,T,IEX,262.870000,32
2019-10-03 14:00:38.945328896,2019-10-03 14:00:38.945305197,2473880,T,IEX,262.700000,100
2019-10-03 14:01:00.411543040,2019-10-03 14:01:00.411522407,2536359,T,IEX,263.000000,100
2019-10-03 14:04:00.585736960,2019-10-03 14:04:00.585712644,2966351,T,IEX,262.480000,6400
2019-10-03 14:04:48.938600960,2019-10-03 14:04:48.938584113,3057495,T,IEX,262.420000,461
2019-10-03 14:04:48.939548928,2019-10-03 14:04:48.939532750,3057498,T,IEX,262.420000,439
2019-10-03 14:05:07.713329920,2019-10-03 14:05:07.713310693,3089890,T,IEX,262.430000,4800
2019-10-03 14:05:57.899246080,2019-10-03 14:05:57.899217651,3183185,T,IEX,262.205000,100
2019-10-03 14:06:11.715678976,2019-10-03 14:06:11.715653755,3214682,T,IEX,261.990000,2100
2019-10-03 14:07:01.894851072,2019-10-03 14:07:01.894831502,3303322,T,IEX,262.030000,200
2019-10-03 14:07:01.894921984,2019-10-03 14:07:01.894903186,3303325,T,IEX,262.030000,400
2019-10-03 14:07:12.356066048,2019-10-03 14:07:12.356039185,3319924,T,IEX,261.980000,600
2019-10-03 14:09:22.54798080,2019-10-03 14:09:22.54777330,3557870,T,IEX,261.910000,100
2019-10-03 14:09:35.99026944,2019-10-03 14:09:35.99006127,3586788,T,IEX,261.900000,100
2019-10-03 14:11:00.640242944,2019-10-03 14:11:00.640223558,3733341,T,IEX,261.900000,100
2019-10-03 14:11:45.728520960,2019-10-03 14:11:45.728491241,3804191,T,IEX,261.850000,100
2019-10-03 14:13:14.528442112,2019-10-03 14:13:14.528421613,3958149,T,IEX,261.660000,100
2019-10-03 14:13:26.941479936,2019-10-03 14:13:26.941460147,3979273,T,IEX,261.800000,100
2019-10-03 14:13:43.870085120,2019-10-03 14:13:43.870065631,4007624,T,IEX,261.850000,100
2019-10-03 14:14:30.493163008,2019-10-03 14:14:30.493141950,4096633,T,IEX,262.190000,100
2019-10-03 14:15:02.61765120,2019-10-03 14:15:02.61749312,4153373,T,IEX,262.100000,100
2019-10-03 14:15:04.975799040,2019-10-03 14:15:04.975781164,4160734,T,IEX,262.210000,100
2019-10-03 14:15:18.318818048,2019-10-03 14:15:18.318799578,4189695,T,IEX,262.250000,100
2019-10-03 14:15:19.8118016,2019-10-03 14:15:19.8100242,4191118,T,IEX,262.250000,100
2019-10-03 14:15:29.868343040,2019-10-03 14:15:29.868327689,4205967,T,IEX,262.210000,100
2019-10-03 14:16:06.833143040,2019-10-03 14:16:06.833122326,4260445,T,IEX,262.140000,100
2019-10-03 14:16:07.923841024,2019-10-03 14:16:07.923822234,4261928,T,IEX,262.150000,100
2019-10-03 14:17:03.810810880,2019-10-03 14:17:03.810791152,4342269,T,IEX,262.050000,100
2019-10-03 14:17:18.465213952,2019-10-03 14:17:18.465197270,4362160,T,IEX,262.080000,100
2019-10-03 14:21:10.11085056,2019-10-03 14:21:10.11063540,4780930,T,IEX,262.710000,35
2019-10-03 14:21:10.11164928,2019-10-03 14:21:10.11146760,4780933,T,IEX,262.710000,65
2019-10-03 14:22:56.777191936,2019-10-03 14:22:56.777171885,4962961,T,IEX,262.950000,8
2019-10-03 14:23:00.945315072,2019-10-03 14:23:00.945290942,4977874,T,IEX,262.840000,100
2019-10-03 14:26:00.988642048,2019-10-03 14:26:00.988623301,5259680,T,IEX,263.110000,100
2019-10-03 14:26:18.650343936,2019-10-03 14:26:18.650325806,5299976,T,IEX,263.580000,20
2019-10-03 14:26:19.669860096,2019-10-03 14:26:19.669841397,5308367,T,IEX,263.440000,100
2019-10-03 14:27:22.792765952,2019-10-03 14:27:22.792742308,5483928,T,IEX,263.630000,100
2019-10-03 14:28:02.769701120,2019-10-03 14:28:02.769680009,5632894,T,IEX,263.770000,200
2019-10-03 14:28:52.837318912,2019-10-03 14:28:52.837300536,5740042,T,IEX,263.560000,200
2019-10-03 14:29:00.322435072,2019-10-03 14:29:00.322417395,5752552,T,IEX,263.600000,100
2019-10-03 14:30:33.449921024,2019-10-03 14:30:33.449901907,5909297,T,IEX,263.540000,100
2019-10-03 14:32:16.133406976,2019-10-03 14:32:16.133385471,6096442,T,IEX,263.570000,100
2019-10-03 14:34:11.777867008,2019-10-03 14:34:11.777839551,6275029,T,IEX,263.550000,65
2019-10-03 14:34:58.479191040,2019-10-03 14:34:58.479173378,6346825,T,IEX,263.770000,100
2019-10-03 14:35:08.219664896,2019-10-03 14:35:08.219641700,6365780,T,IEX,263.670000,100
2019-10-03 14:35:36.999025920,2019-10-03 14:35:36.999007313,6410435,T,IEX,263.720000,100
2019-10-03 14:38:00.599442944,2019-10-03 14:38:00.599423576,6684604,T,IEX,263.940000,100
2019-10-03 14:38:23.378809088,2019-10-03 14:38:23.378789334,6728212,T,IEX,264.150000,100
2019-10-03 14:39:46.109201920,2019-10-03 14:39:46.109181193,6864822,T,IEX,264.050000,300
2019-10-03 14:39:46.119053056,2019-10-03 14:39:46.119034111,6864916,T,IEX,264.060000,300
2019-10-03 14:40:04.991480064,2019-10-03 14:40:04.991456953,6894303,T,IEX,263.880000,100
2019-10-03 14:40:10.473335040,2019-10-03 14:40:10.473316206,6906339,T,IEX,263.870000,100
2019-10-03 14:45:49.73340928,2019-10-03 14:45:49.73323692,7381008,T,IEX,263.690000,100
2019-10-03 14:46:07.699436032,2019-10-03 14:46:07.699417022,7408977,T,IEX,263.850000,100
2019-10-03 14:53:44.544039936,2019-10-03 14:53:44.544011427,8068241,T,IEX,263.140000,100
2019-10-03 14:56:17.435973888,2019-10-03 14:56:17.435954702,8254018,T,IEX,263.320000,100
2019-10-03 15:00:38.181726976,2019-10-03 15:00:38.181707802,8696727,T,IEX,264.040000,100
2019-10-03 15:02:06.126864896,2019-10-03 15:02:06.126843296,8848460,T,IEX,264.480000,20
2019-10-03 15:02:06.127398912,2019-10-03 15:02:06.127381155,8848485,T,IEX,264.480000,20
2019-10-03 15:02:06.129126912,2019-10-03 15:02:06.129107288,8848541,T,IEX,264.480000,27
2019-10-03 15:02:06.131589120,2019-10-03 15:02:06.131570045,8848613,T,IEX,264.480000,100
2019-10-03 15:02:06.145566976,2019-10-03 15:02:06.145548500,8849069,T,IEX,264.500000,20
2019-10-03 15:02:06.145649920,2019-10-03 15:02:06.145630783,8849074,T,IEX,264.500000,13
2019-10-03 15:02:15.33113088,2019-10-03 15:02:15.33092332,8883444,T,IEX,264.500000,100
2019-10-03 15:02:17.134731008,2019-10-03 15:02:17.134712380,8888044,T,IEX,264.510000,100
2019-10-03 15:06:18.651200000,2019-10-03 15:06:18.651167141,9324167,T,IEX,264.800000,100
2019-10-03 15:08:49.747524096,2019-10-03 15:08:49.747505558,9609188,T,IEX,265.190000,100
2019-10-03 15:09:05.622309888,2019-10-03 15:09:05.622287946,9642316,T,IEX,265.040000,100
2019-10-03 15:09:32.795116032,2019-10-03 15:09:32.795088624,9689699,T,IEX,265.040000,100
2019-10-03 15:09:58.794257920,2019-10-03 15:09:58.794237559,9743108,T,IEX,265.230000,100
2019-10-03 15:10:08.721249024,2019-10-03 15:10:08.721229587,9764261,T,IEX,265.120000,100
2019-10-03 15:10:08.892537088,2019-10-03 15:10:08.892518217,9769329,T,IEX,264.970000,53
2019-10-03 15:10:09.727186944,2019-10-03 15:10:09.727164893,9774353,T,IEX,265.030000,100
2019-10-03 15:11:37.14002944,2019-10-03 15:11:37.13986067,9937054,T,IEX,265.310000,100
2019-10-03 15:11:37.17722880,2019-10-03 15:11:37.17700179,9937171,T,IEX,265.310000,100
2019-10-03 15:11:49.156516096,2019-10-03 15:11:49.156499193,9960945,T,IEX,265.230000,100
2019-10-03 15:11:55.565085952,2019-10-03 15:11:55.565066538,9971228,T,IEX,265.140000,75
2019-10-03 15:11:55.565110016,2019-10-03 15:11:55.565092702,9971229,T,IEX,265.140000,100
2019-10-03 15:12:53.100954880,2019-10-03 15:12:53.100929613,10053532,T,IEX,265.120000,100
2019-10-03 15:12:53.101112064,2019-10-03 15:12:53.101087535,10053547,T,IEX,265.120000,100
2019-10-03 15:13:19.257605888,2019-10-03 15:13:19.257586234,10095647,T,IEX,265.180000,100
2019-10-03 15:13:19.257818112,2019-10-03 15:13:19.257798599,10095654,T,IEX,265.180000,100
2019-10-03 15:15:00.67399936,2019-10-03 15:15:00.67378654,10213600,T,IEX,265.230000,100
2019-10-03 15:17:48.731784960,2019-10-03 15:17:48.731766758,10472689,T,IEX,265.390000,100
2019-10-03 15:21:09.932493056,2019-10-03 15:21:09.932475799,10739573,T,IEX,265.380000,100
2019-10-03 15:26:27.339195904,2019-10-03 15:26:27.339172511,11071087,T,IEX,265.180000,100
2019-10-03 15:26:30.167284992,2019-10-03 15:26:30.167258405,11075267,T,IEX,265.140000,100
2019-10-03 15:31:10.852473088,2019-10-03 15:31:10.852453394,11329346,T,IEX,265.020000,100
2019-10-03 15:32:01.599728896,2019-10-03 15:32:01.599707779,11369589,T,IEX,265.020000,100
2019-10-03 15:32:09.521175040,2019-10-03 15:32:09.521156361,11376525,T,IEX,265.060000,100
2019-10-03 15:33:05.936027904,2019-10-03 15:33:05.936004984,11420512,T,IEX,264.910000,100
2019-10-03 15:33:08.844252928,2019-10-03 15:33:08.844229869,11424073,T,IEX,264.900000,100
2019-10-03 15:33:17.260814080,2019-10-03 15:33:17.260795746,11429037,T,IEX,264.890000,100
2019-10-03 15:46:39.947932928,2019-10-03 15:46:39.947915820,12126564,T,IEX,264.610000,100
2019-10-03 15:47:35.358289920,2019-10-03 15:47:35.358267998,12171706,T,IEX,264.580000,100
2019-10-03 15:49:00.225865984,2019-10-03 15:49:00.225845756,12247571,T,IEX,264.530000,100
2019-10-03 15:49:00.229714944,2019-10-03 15:49:00.229695282,12247687,T,IEX,264.530000,100
2019-10-03 15:50:31.843273984,2019-10-03 15:50:31.843253030,12326117,T,IEX,264.590000,100
2019-10-03 15:50:49.704944128,2019-10-03 15:50:49.704926857,12336909,T,IEX,264.590000,100
2019-10-03 15:51:12.318423040,2019-10-03 15:51:12.318406274,12354701,T,IEX,264.620000,100
2019-10-03 15:51:42.319697920,2019-10-03 15:51:42.319676308,12374937,T,IEX,264.630000,25
2019-10-03 15:52:47.449452032,2019-10-03 15:52:47.449431890,12420060,T,IEX,264.610000,100
2019-10-03 15:52:47.456083968,2019-10-03 15:52:47.456064218,12420064,T,IEX,264.610000,100
2019-10-03 15:52:47.467517952,2019-10-03 15:52:47.467496515,12420074,T,IEX,264.610000,100
2019-10-03 15:52:47.485221888,2019-10-03 15:52:47.485202916,12420082,T,IEX,264.610000,100
2019-10-03 15:52:47.508865024,2019-10-03 15:52:47.508843676,12420118,T,IEX,264.610000,100
2019-10-03 15:52:47.534947072,2019-10-03 15:52:47.534928305,12420146,T,IEX,264.610000,100
2019-10-03 15:52:47.544485120,2019-10-03 15:52:47.544463755,12420155,T,IEX,264.610000,100
2019-10-03 15:52:48.399360000,2019-10-03 15:52:48.399341311,12420498,T,IEX,264.610000,100
2019-10-03 15:52:59.998451968,2019-10-03 15:52:59.998432637,12425433,T,IEX,264.610000,100
2019-10-03 15:56:52.510053888,2019-10-03 15:56:52.510028763,12614341,T,IEX,264.580000,100
2019-10-03 16:01:34.988907008,2019-10-03 16:01:34.988888057,12836891,T,IEX,264.750000,100
2019-10-03 16:18:24.495256064,2019-10-03 16:18:24.495236436,13612597,T,IEX,264.820000,100
2019-10-03 16:23:22.448616960,2019-10-03 16:23:22.448599312,13822802,T,IEX,264.765000,135
2019-10-03 16:23:55.621232128,2019-10-03 16:23:55.621212222,13841274,T,IEX,264.835000,152
2019-10-03 16:24:22.453114880,2019-10-03 16:24:22.453093379,13854871,T,IEX,264.835000,20
2019-10-03 16:24:52.453590016,2019-10-03 16:24:52.453572850,13870905,T,IEX,264.905000,75
2019-10-03 16:28:06.340599040,2019-10-03 16:28:06.340583461,14026820,T,IEX,265.265000,10
2019-10-03 16:41:21.835440128,2019-10-03 16:41:21.835416135,14552477,T,IEX,265.650000,100
2019-10-03 16:41:22.4876032,2019-10-03 16:41:22.4857219,14552734,T,IEX,265.650000,100
2019-10-03 16:41:22.5031936,2019-10-03 16:41:22.5006242,14552741,T,IEX,265.650000,100
2019-10-03 16:41:22.218159104,2019-10-03 16:41:22.218136279,14553007,T,IEX,265.650000,100
2019-10-03 16:41:23.853080064,2019-10-03 16:41:23.853060138,14553897,T,IEX,265.650000,100
2019-10-03 16:41:23.959435008,2019-10-03 16:41:23.959416733,14554139,T,IEX,265.650000,100
2019-10-03 16:41:24.154711040,2019-10-03 16:41:24.154689486,14554258,T,IEX,265.650000,100
2019-10-03 16:41:24.160316928,2019-10-03 16:41:24.160297437,14554265,T,IEX,265.650000,100
2019-10-03 16:41:25.860528896,2019-10-03 16:41:25.860510097,14555072,T,IEX,265.650000,100
2019-10-03 16:41:25.861001984,2019-10-03 16:41:25.860982660,14555093,T,IEX,265.650000,100
2019-10-03 16:41:25.867025920,2019-10-03 16:41:25.867008580,14555228,T,IEX,265.650000,100
2019-10-03 16:41:26.7450112,2019-10-03 16:41:26.7432828,14555462,T,IEX,265.650000,100
2019-10-03 16:41:26.7574016,2019-10-03 16:41:26.7556230,14555464,T,IEX,265.650000,100
2019-10-03 16:41:26.17206016,2019-10-03 16:41:26.17185039,14555592,T,IEX,265.650000,100
2019-10-03 16:41:26.20581120,2019-10-03 16:41:26.20559757,14555610,T,IEX,265.655000,82
2019-10-03 16:41:26.20594944,2019-10-03 16:41:26.20570831,14555611,T,IEX,265.660000,118
2019-10-03 16:41:26.21637888,2019-10-03 16:41:26.21619362,14555646,T,IEX,265.655000,82
2019-10-03 16:41:26.31614976,2019-10-03 16:41:26.31596022,14555895,T,IEX,265.660000,100
2019-10-03 16:41:26.51568128,2019-10-03 16:41:26.51547944,14556035,T,IEX,265.650000,100
2019-10-03 16:41:26.222861056,2019-10-03 16:41:26.222839422,14556181,T,IEX,265.650000,100
2019-10-03 16:41:30.302157056,2019-10-03 16:41:30.302136754,14559216,T,IEX,265.660000,100
2019-10-03 16:42:07.799058944,2019-10-03 16:42:07.799036747,14576398,T,IEX,265.650000,100
2019-10-03 16:42:07.799234048,2019-10-03 16:42:07.799208897,14576402,T,IEX,265.650000,500
2019-10-03 16:48:21.103229952,2019-10-03 16:48:21.103210605,14787350,T,IEX,265.720000,100
2019-10-03 16:48:21.103525120,2019-10-03 16:48:21.103508119,14787352,T,IEX,265.720000,100
2019-10-03 16:48:21.125489920,2019-10-03 16:48:21.125473303,14787413,T,IEX,265.720000,100
2019-10-03 16:48:21.210152960,2019-10-03 16:48:21.210132507,14787461,T,IEX,265.720000,100
2019-10-03 16:48:21.251104000,2019-10-03 16:48:21.251085966,14787473,T,IEX,265.720000,100
2019-10-03 16:48:21.251111936,2019-10-03 16:48:21.251094414,14787474,T,IEX,265.720000,279
2019-10-03 16:48:21.345942016,2019-10-03 16:48:21.345921172,14787512,T,IEX,265.720000,100
2019-10-03 16:48:21.346448896,2019-10-03 16:48:21.346433166,14787515,T,IEX,265.720000,100
2019-10-03 16:48:21.459867904,2019-10-03 16:48:21.459847850,14787537,T,IEX,265.720000,100
2019-10-03 16:48:22.66583040,2019-10-03 16:48:22.66563097,14787864,T,IEX,265.720000,90
2019-10-03 16:48:22.66661120,2019-10-03 16:48:22.66642772,14787867,T,IEX,265.720000,100
2019-10-03 16:48:22.66772992,2019-10-03 16:48:22.66754365,14787869,T,IEX,265.720000,10
2019-10-03 16:48:22.313324032,2019-10-03 16:48:22.313308509,14787995,T,IEX,265.720000,100
2019-10-03 16:48:22.313338880,2019-10-03 16:48:22.313321493,14787996,T,IEX,265.720000,100
2019-10-03 16:48:23.121477120,2019-10-03 16:48:23.121459381,14788232,T,IEX,265.720000,100
2019-10-03 16:48:23.122507008,2019-10-03 16:48:23.122484335,14788247,T,IEX,265.720000,100
2019-10-03 16:48:24.549989888,2019-10-03 16:48:24.549969479,14788887,T,IEX,265.720000,100
2019-10-03 16:48:24.550007040,2019-10-03 16:48:24.549989243,14788889,T,IEX,265.720000,100
2019-10-03 16:48:31.33004032,2019-10-03 16:48:31.32983653,14792337,T,IEX,265.720000,100
2019-10-03 16:48:31.33022976,2019-10-03 16:48:31.33004610,14792338,T,IEX,265.720000,100
2019-10-03 16:48:31.94932992,2019-10-03 16:48:31.94915706,14792407,T,IEX,265.720000,100
2019-10-03 16:48:31.206633984,2019-10-03 16:48:31.206616897,14792495,T,IEX,265.720000,100
2019-10-03 16:48:31.218904064,2019-10-03 16:48:31.218884168,14792547,T,IEX,265.720000,100
2019-10-03 16:48:31.315874048,2019-10-03 16:48:31.315853220,14792638,T,IEX,265.720000,100
2019-10-03 16:48:31.511454976,2019-10-03 16:48:31.511438246,14792782,T,IEX,265.720000,100
2019-10-03 16:48:32.108476928,2019-10-03 16:48:32.108456440,14793013,T,IEX,265.720000,100
2019-10-03 16:48:32.171603968,2019-10-03 16:48:32.171583800,14793045,T,IEX,265.720000,100
2019-10-03 16:48:33.208004096,2019-10-03 16:48:33.207981103,14793477,T,IEX,265.720000,100
2019-10-03 16:48:33.344965120,2019-10-03 16:48:33.344946546,14793539,T,IEX,265.720000,100
2019-10-03 16:48:33.511400960,2019-10-03 16:48:33.511378954,14793722,T,IEX,265.720000,100
2019-10-03 16:48:33.515934976,2019-10-03 16:48:33.515916223,14793728,T,IEX,265.720000,82
2019-10-03 16:49:14.503983104,2019-10-03 16:49:14.503957136,14833542,T,IEX,265.810000,100
2019-10-03 16:56:56.36007936,2019-10-03 16:56:56.35984736,15124580,T,IEX,265.750000,100
2019-10-03 16:56:56.36036096,2019-10-03 16:56:56.36017165,15124581,T,IEX,265.760000,100
2019-10-03 17:01:04.242194944,2019-10-03 17:01:04.242175718,15296157,T,IEX,265.970000,100
2019-10-03 18:01:12.845003008,2019-10-03 18:01:12.844983821,17286353,T,IEX,266.290000,123
2019-10-03 18:03:12.855352064,2019-10-03 18:03:12.855331202,17361169,T,IEX,266.255000,20
2019-10-03 18:03:12.856487936,2019-10-03 18:03:12.856467496,17361170,T,IEX,266.260000,62
2019-10-03 18:33:33.918094080,2019-10-03 18:33:33.918061683,18292923,T,IEX,266.370000,100
2019-10-03 19:01:48.290041088,2019-10-03 19:01:48.290023506,19051389,T,IEX,265.970000,126
2019-10-03 19:01:48.290987008,2019-10-03 19:01:48.290969588,19051397,T,IEX,265.970000,155
2019-10-03 19:23:25.900801024,2019-10-03 19:23:25.900782111,19631321,T,IEX,266.030000,100
2019-10-03 19:42:58.468663040,2019-10-03 19:42:58.468645769,20278538,T,IEX,266.140000,43
2019-10-03 19:45:18.212776960,2019-10-03 19:45:18.212756184,20362545,T,IEX,266.030000,557
2019-10-03 19:45:18.213765120,2019-10-03 19:45:18.213745802,20362546,T,IEX,266.030000,100
2019-10-03 19:45:21.294025984,2019-10-03 19:45:21.294006955,20364503,T,IEX,266.060000,600
2019-10-03 19:45:21.294110976,2019-10-03 19:45:21.294085369,20364508,T,IEX,266.060000,500
2019-10-03 19:45:35.234309120,2019-10-03 19:45:35.234290993,20374192,T,IEX,266.050000,300
2019-10-03 19:45:45.362369024,2019-10-03 19:45:45.362353399,20382428,T,IEX,266.100000,100
2019-10-03 19:49:38.728549888,2019-10-03 19:49:38.728532121,20536346,T,IEX,265.760000,100
