2019-10-15 13:30:04.732773888,2019-10-15 13:30:04.732749029,102760,T,IEX,372.950000,200
2019-10-15 13:30:05.144931072,2019-10-15 13:30:05.144905369,103745,T,IEX,372.990000,100
2019-10-15 13:30:05.588999936,2019-10-15 13:30:05.588974790,104904,T,IEX,373.025000,100
2019-10-15 13:30:09.374232064,2019-10-15 13:30:09.374206822,113341,T,IEX,373.130000,100
2019-10-15 13:30:15.325864960,2019-10-15 13:30:15.325838678,122454,T,IEX,373.200000,102
2019-10-15 13:30:33.135776000,2019-10-15 13:30:33.135750422,145577,T,IEX,373.055000,100
2019-10-15 13:30:36.442041088,2019-10-15 13:30:36.442016527,149638,T,IEX,372.980000,100
2019-10-15 13:30:36.674085888,2019-10-15 13:30:36.674064273,149815,T,IEX,372.980000,100
2019-10-15 13:30:45.990089984,2019-10-15 13:30:45.990062271,160353,T,IEX,372.925000,300
2019-10-15 13:30:46.731682048,2019-10-15 13:30:46.731656319,161001,T,IEX,372.925000,98
2019-10-15 13:30:46.731736064,2019-10-15 13:30:46.731712766,161002,T,IEX,372.925000,202
2019-10-15 13:30:51.626694912,2019-10-15 13:30:51.626666988,165419,T,IEX,372.930000,400
2019-10-15 13:30:51.642129920,2019-10-15 13:30:51.642108247,165429,T,IEX,372.935000,700
2019-10-15 13:30:51.642179072,2019-10-15 13:30:51.642158493,165430,T,IEX,372.935000,300
2019-10-15 13:30:51.653809920,2019-10-15 13:30:51.653783817,165438,T,IEX,372.935000,100
2019-10-15 13:30:54.347044096,2019-10-15 13:30:54.347016928,168035,T,IEX,372.930000,100
2019-10-15 13:30:54.475888128,2019-10-15 13:30:54.475859946,168119,T,IEX,372.925000,200
2019-10-15 13:30:55.685517056,2019-10-15 13:30:55.685495850,169121,T,IEX,372.925000,200
2019-10-15 13:31:00.367447040,2019-10-15 13:31:00.367425759,175407,T,IEX,372.855000,100
2019-10-15 13:31:01.447732992,2019-10-15 13:31:01.447705156,177084,T,IEX,372.855000,100
2019-10-15 13:31:03.130177024,2019-10-15 13:31:03.130152632,179945,T,IEX,372.870000,100
2019-10-15 13:31:03.767296000,2019-10-15 13:31:03.767268461,180790,T,IEX,372.845000,100
2019-10-15 13:31:10.499394048,2019-10-15 13:31:10.499367752,189208,T,IEX,372.900000,100
2019-10-15 13:31:17.560476928,2019-10-15 13:31:17.560448911,196968,T,IEX,372.880000,100
2019-10-15 13:31:17.617384960,2019-10-15 13:31:17.617358736,196990,T,IEX,372.875000,100
2019-10-15 13:31:45.18925056,2019-10-15 13:31:45.18902663,222111,T,IEX,373.165000,400
2019-10-15 13:32:10.280660992,2019-10-15 13:32:10.280639911,247033,T,IEX,373.145000,100
2019-10-15 13:32:34.15492096,2019-10-15 13:32:34.15470383,271175,T,IEX,372.780000,2
2019-10-15 13:34:28.498522880,2019-10-15 13:34:28.498504915,382898,T,IEX,372.210000,200
2019-10-15 13:34:28.498571008,2019-10-15 13:34:28.498554011,382899,T,IEX,372.300000,100
2019-10-15 13:34:28.498611968,2019-10-15 13:34:28.498596969,382900,T,IEX,372.310000,100
2019-10-15 13:34:28.498656000,2019-10-15 13:34:28.498640829,382901,T,IEX,372.360000,100
2019-10-15 13:34:28.498700032,2019-10-15 13:34:28.498684086,382902,T,IEX,372.360000,100
2019-10-15 13:34:41.924770048,2019-10-15 13:34:41.924750294,394454,T,IEX,372.200000,132
2019-10-15 13:34:50.932968960,2019-10-15 13:34:50.932951378,401756,T,IEX,372.200000,100
2019-10-15 13:34:56.70576896,2019-10-15 13:34:56.70558692,406249,T,IEX,372.200000,100
2019-10-15 13:35:09.582320896,2019-10-15 13:35:09.582304922,420671,T,IEX,372.700000,10
2019-10-15 13:35:36.196299008,2019-10-15 13:35:36.196277379,446037,T,IEX,372.170000,100
2019-10-15 13:35:36.196349952,2019-10-15 13:35:36.196332825,446038,T,IEX,372.170000,10268
2019-10-15 13:36:10.640950016,2019-10-15 13:36:10.640929021,476818,T,IEX,371.905000,200
2019-10-15 13:36:21.106722048,2019-10-15 13:36:21.106699716,488065,T,IEX,371.890000,100
2019-10-15 13:36:21.410639872,2019-10-15 13:36:21.410621762,488667,T,IEX,371.895000,100
2019-10-15 13:36:21.410682880,2019-10-15 13:36:21.410656933,488671,T,IEX,371.895000,100
2019-10-15 13:36:23.116406016,2019-10-15 13:36:23.116385999,491279,T,IEX,371.900000,100
2019-10-15 13:36:27.637379072,2019-10-15 13:36:27.637362836,495502,T,IEX,371.900000,100
2019-10-15 13:36:29.744445952,2019-10-15 13:36:29.744428376,497471,T,IEX,371.980000,100
2019-10-15 13:36:30.572326912,2019-10-15 13:36:30.572304647,498711,T,IEX,372.155000,100
2019-10-15 13:36:30.572377088,2019-10-15 13:36:30.572361317,498712,T,IEX,372.155000,100
2019-10-15 13:36:30.572428032,2019-10-15 13:36:30.572411626,498713,T,IEX,372.155000,100
2019-10-15 13:36:30.577001984,2019-10-15 13:36:30.576983383,498716,T,IEX,372.155000,2345
2019-10-15 13:36:35.289971968,2019-10-15 13:36:35.289953843,503428,T,IEX,372.135000,7
2019-10-15 13:36:38.127879936,2019-10-15 13:36:38.127861438,506383,T,IEX,371.980000,200
2019-10-15 13:36:40.117583872,2019-10-15 13:36:40.117567513,508411,T,IEX,371.730000,100
2019-10-15 13:36:40.117629952,2019-10-15 13:36:40.117613154,508413,T,IEX,371.680000,100
2019-10-15 13:36:48.720655104,2019-10-15 13:36:48.720638223,516927,T,IEX,371.950000,100
2019-10-15 13:36:50.679899904,2019-10-15 13:36:50.679882048,519014,T,IEX,372.170000,7
2019-10-15 13:37:26.44148992,2019-10-15 13:37:26.44130396,556889,T,IEX,371.680000,28
2019-10-15 13:37:26.44206080,2019-10-15 13:37:26.44190177,556890,T,IEX,371.760000,100
2019-10-15 13:37:33.256174080,2019-10-15 13:37:33.256154262,562830,T,IEX,371.610000,100
2019-10-15 13:37:33.266983936,2019-10-15 13:37:33.266966960,562850,T,IEX,371.610000,200
2019-10-15 13:37:33.621381888,2019-10-15 13:37:33.621364586,563148,T,IEX,371.850000,100
2019-10-15 13:37:35.892434944,2019-10-15 13:37:35.892419023,564619,T,IEX,371.795000,100
2019-10-15 13:37:38.791098112,2019-10-15 13:37:38.791076866,567006,T,IEX,371.840000,100
2019-10-15 13:37:39.195866112,2019-10-15 13:37:39.195844810,567430,T,IEX,371.840000,100
2019-10-15 13:37:42.905259008,2019-10-15 13:37:42.905238547,570278,T,IEX,371.860000,100
2019-10-15 13:37:44.414351104,2019-10-15 13:37:44.414335153,571813,T,IEX,371.980000,300
2019-10-15 13:37:56.892134912,2019-10-15 13:37:56.892114098,584086,T,IEX,371.850000,100
2019-10-15 13:38:06.487294976,2019-10-15 13:38:06.487274475,594618,T,IEX,371.805000,100
2019-10-15 13:38:11.683577088,2019-10-15 13:38:11.683559843,599778,T,IEX,371.800000,100
2019-10-15 13:38:13.38938880,2019-10-15 13:38:13.38923577,601076,T,IEX,371.810000,28
2019-10-15 13:38:13.40569088,2019-10-15 13:38:13.40548600,601077,T,IEX,371.900000,22
2019-10-15 13:38:16.322278912,2019-10-15 13:38:16.322262482,603765,T,IEX,371.950000,100
2019-10-15 13:38:20.469959936,2019-10-15 13:38:20.469937838,607750,T,IEX,371.955000,103
2019-10-15 13:38:47.446703104,2019-10-15 13:38:47.446685487,629473,T,IEX,372.250000,50
2019-10-15 13:39:40.652574976,2019-10-15 13:39:40.652555050,670118,T,IEX,372.120000,50
2019-10-15 13:39:43.854411008,2019-10-15 13:39:43.854393147,673103,T,IEX,371.890000,100
2019-10-15 13:39:50.609067008,2019-10-15 13:39:50.609047223,677835,T,IEX,371.900000,100
2019-10-15 13:39:57.141766912,2019-10-15 13:39:57.141747279,682280,T,IEX,371.895000,100
2019-10-15 13:40:04.392801024,2019-10-15 13:40:04.392779775,688937,T,IEX,371.910000,100
2019-10-15 13:40:06.400585984,2019-10-15 13:40:06.400564434,690647,T,IEX,371.870000,1
2019-10-15 13:40:11.736699904,2019-10-15 13:40:11.736679706,695455,T,IEX,371.910000,100
2019-10-15 13:40:16.54044928,2019-10-15 13:40:16.54022131,698264,T,IEX,372.000000,42
2019-10-15 13:40:19.172286976,2019-10-15 13:40:19.172269219,700353,T,IEX,371.920000,100
2019-10-15 13:40:19.542816000,2019-10-15 13:40:19.542799147,700576,T,IEX,372.180000,100
2019-10-15 13:40:23.223706880,2019-10-15 13:40:23.223686124,703893,T,IEX,372.240000,1
2019-10-15 13:40:25.969110016,2019-10-15 13:40:25.969092379,706897,T,IEX,372.100000,1
2019-10-15 13:40:27.399320064,2019-10-15 13:40:27.399300139,708685,T,IEX,371.980000,100
2019-10-15 13:40:29.592705024,2019-10-15 13:40:29.592684331,711229,T,IEX,371.975000,200
2019-10-15 13:40:29.592794880,2019-10-15 13:40:29.592778570,711230,T,IEX,371.930000,1
2019-10-15 13:40:35.226642944,2019-10-15 13:40:35.226622136,715282,T,IEX,371.930000,100
2019-10-15 13:40:42.402736896,2019-10-15 13:40:42.402718205,720168,T,IEX,371.940000,100
2019-10-15 13:40:49.594349056,2019-10-15 13:40:49.594329005,725655,T,IEX,371.940000,100
2019-10-15 13:40:56.874138880,2019-10-15 13:40:56.874118916,730773,T,IEX,371.945000,100
2019-10-15 13:41:04.187608064,2019-10-15 13:41:04.187591972,736515,T,IEX,371.950000,100
2019-10-15 13:41:23.233410048,2019-10-15 13:41:23.233394356,751875,T,IEX,371.960000,116
2019-10-15 13:41:27.330426880,2019-10-15 13:41:27.330407374,755457,T,IEX,371.965000,100
2019-10-15 13:41:27.800164096,2019-10-15 13:41:27.800145015,755790,T,IEX,371.940000,1
2019-10-15 13:41:27.801331968,2019-10-15 13:41:27.801313573,755791,T,IEX,371.960000,100
2019-10-15 13:41:28.245875968,2019-10-15 13:41:28.245859948,756003,T,IEX,372.200000,2
2019-10-15 13:41:29.326832128,2019-10-15 13:41:29.326814402,757216,T,IEX,372.120000,100
2019-10-15 13:41:30.622844928,2019-10-15 13:41:30.622824587,758514,T,IEX,372.120000,100
2019-10-15 13:41:31.329142016,2019-10-15 13:41:31.329121817,758846,T,IEX,372.120000,100
2019-10-15 13:41:33.963048960,2019-10-15 13:41:33.963031493,760846,T,IEX,372.120000,1
2019-10-15 13:41:34.334048000,2019-10-15 13:41:34.334030165,761088,T,IEX,372.070000,1
2019-10-15 13:41:47.202230016,2019-10-15 13:41:47.202208531,771453,T,IEX,371.955000,1
2019-10-15 13:41:54.228173056,2019-10-15 13:41:54.228150384,775621,T,IEX,371.950000,100
2019-10-15 13:41:59.458353920,2019-10-15 13:41:59.458333687,780174,T,IEX,371.935000,1
2019-10-15 13:42:19.79030016,2019-10-15 13:42:19.79012082,795777,T,IEX,371.905000,1
2019-10-15 13:42:19.313824000,2019-10-15 13:42:19.313806367,796016,T,IEX,371.905000,100
2019-10-15 13:42:22.983683072,2019-10-15 13:42:22.983666647,801252,T,IEX,371.895000,100
2019-10-15 13:42:23.345651968,2019-10-15 13:42:23.345632115,801707,T,IEX,371.895000,100
2019-10-15 13:42:23.345701120,2019-10-15 13:42:23.345683717,801708,T,IEX,371.895000,1
2019-10-15 13:42:24.484055040,2019-10-15 13:42:24.484036830,802889,T,IEX,371.895000,100
2019-10-15 13:42:25.664783104,2019-10-15 13:42:25.664762166,803827,T,IEX,371.880000,1
2019-10-15 13:42:25.664868096,2019-10-15 13:42:25.664851851,803828,T,IEX,371.890000,200
2019-10-15 13:42:26.215768064,2019-10-15 13:42:26.215748416,804269,T,IEX,371.895000,100
2019-10-15 13:42:27.457298944,2019-10-15 13:42:27.457278280,805583,T,IEX,371.930000,100
2019-10-15 13:42:27.457357056,2019-10-15 13:42:27.457340522,805584,T,IEX,371.930000,1
2019-10-15 13:42:33.537730048,2019-10-15 13:42:33.537707697,810716,T,IEX,371.925000,1
2019-10-15 13:42:41.689637888,2019-10-15 13:42:41.689620942,816910,T,IEX,371.900000,100
2019-10-15 13:43:03.664849920,2019-10-15 13:43:03.664828642,834693,T,IEX,371.915000,100
2019-10-15 13:43:15.933863936,2019-10-15 13:43:15.933842697,844872,T,IEX,372.005000,1
2019-10-15 13:43:50.787424000,2019-10-15 13:43:50.787403168,872273,T,IEX,372.200000,100
2019-10-15 13:43:50.791879936,2019-10-15 13:43:50.791860834,872289,T,IEX,372.200000,100
2019-10-15 13:43:50.808623104,2019-10-15 13:43:50.808602437,872309,T,IEX,372.250000,100
2019-10-15 13:44:44.943821056,2019-10-15 13:44:44.943801474,917716,T,IEX,371.990000,170
2019-10-15 13:44:47.114288896,2019-10-15 13:44:47.114268989,919006,T,IEX,371.995000,100
2019-10-15 13:44:54.266945024,2019-10-15 13:44:54.266923810,923765,T,IEX,371.995000,100
2019-10-15 13:45:32.32762880,2019-10-15 13:45:32.32745919,965185,T,IEX,372.305000,100
2019-10-15 13:45:32.34514944,2019-10-15 13:45:32.34498519,965188,T,IEX,372.305000,100
2019-10-15 13:45:33.676409088,2019-10-15 13:45:33.676386070,967119,T,IEX,372.380000,100
2019-10-15 13:45:35.940934912,2019-10-15 13:45:35.940914465,968917,T,IEX,372.375000,100
2019-10-15 13:45:36.21718016,2019-10-15 13:45:36.21701406,969002,T,IEX,372.375000,100
2019-10-15 13:45:40.440549120,2019-10-15 13:45:40.440531364,973793,T,IEX,372.390000,100
2019-10-15 13:45:40.596787968,2019-10-15 13:45:40.596767023,973860,T,IEX,372.390000,400
2019-10-15 13:45:41.532779008,2019-10-15 13:45:41.532757835,974617,T,IEX,372.395000,100
2019-10-15 13:45:45.524993024,2019-10-15 13:45:45.524975434,977143,T,IEX,372.400000,100
2019-10-15 13:45:54.85790976,2019-10-15 13:45:54.85770021,985119,T,IEX,372.405000,100
2019-10-15 13:45:58.490187008,2019-10-15 13:45:58.490168747,988597,T,IEX,372.305000,300
2019-10-15 13:45:58.514802944,2019-10-15 13:45:58.514783723,988622,T,IEX,372.345000,100
2019-10-15 13:45:58.516640000,2019-10-15 13:45:58.516620126,988623,T,IEX,372.345000,100
2019-10-15 13:45:58.518386944,2019-10-15 13:45:58.518368716,988624,T,IEX,372.345000,100
2019-10-15 13:45:59.877298944,2019-10-15 13:45:59.877281433,989975,T,IEX,372.295000,100
2019-10-15 13:47:47.642497024,2019-10-15 13:47:47.642475991,1081171,T,IEX,371.975000,100
2019-10-15 13:48:39.271333888,2019-10-15 13:48:39.271314682,1126248,T,IEX,372.300000,100
2019-10-15 13:49:38.373775872,2019-10-15 13:49:38.373755721,1173645,T,IEX,371.965000,100
2019-10-15 13:49:38.613309952,2019-10-15 13:49:38.613288547,1173879,T,IEX,371.960000,103
2019-10-15 13:49:41.37242112,2019-10-15 13:49:41.37223372,1175990,T,IEX,371.955000,100
2019-10-15 13:49:43.661744128,2019-10-15 13:49:43.661722438,1178239,T,IEX,371.955000,100
2019-10-15 13:49:50.852827904,2019-10-15 13:49:50.852808083,1183206,T,IEX,371.915000,100
2019-10-15 13:50:50.283846912,2019-10-15 13:50:50.283828565,1231992,T,IEX,371.900000,3
2019-10-15 13:50:50.283875072,2019-10-15 13:50:50.283856629,1231993,T,IEX,371.900000,2
2019-10-15 13:51:02.547249920,2019-10-15 13:51:02.547232913,1240965,T,IEX,371.825000,5
2019-10-15 13:51:44.323019008,2019-10-15 13:51:44.322999340,1276786,T,IEX,371.660000,8
2019-10-15 13:51:58.65649920,2019-10-15 13:51:58.65630297,1287899,T,IEX,371.495000,2
2019-10-15 13:52:43.837074944,2019-10-15 13:52:43.837056240,1321204,T,IEX,371.440000,100
2019-10-15 13:52:43.838362880,2019-10-15 13:52:43.838345060,1321205,T,IEX,371.440000,100
2019-10-15 13:52:44.641218048,2019-10-15 13:52:44.641203340,1321716,T,IEX,371.440000,100
2019-10-15 13:52:47.22289920,2019-10-15 13:52:47.22270324,1323963,T,IEX,371.440000,100
2019-10-15 13:53:07.607406080,2019-10-15 13:53:07.607378895,1341132,T,IEX,371.475000,2
2019-10-15 13:53:07.607421952,2019-10-15 13:53:07.607392518,1341135,T,IEX,371.475000,198
2019-10-15 13:53:20.294445056,2019-10-15 13:53:20.294427075,1352342,T,IEX,371.450000,1
2019-10-15 13:53:24.152451072,2019-10-15 13:53:24.152430713,1356012,T,IEX,371.405000,100
2019-10-15 13:53:26.609564928,2019-10-15 13:53:26.609544361,1357720,T,IEX,371.410000,400
2019-10-15 13:53:29.451945984,2019-10-15 13:53:29.451928136,1359225,T,IEX,371.385000,100
2019-10-15 13:53:29.522883072,2019-10-15 13:53:29.522861651,1359290,T,IEX,371.380000,2
2019-10-15 13:53:29.522904064,2019-10-15 13:53:29.522887767,1359291,T,IEX,371.380000,98
2019-10-15 13:53:29.970533888,2019-10-15 13:53:29.970511076,1359578,T,IEX,371.385000,2
2019-10-15 13:53:31.800264960,2019-10-15 13:53:31.800244745,1360606,T,IEX,371.385000,98
2019-10-15 13:53:33.232050944,2019-10-15 13:53:33.232027061,1361686,T,IEX,371.385000,100
2019-10-15 13:53:39.714468096,2019-10-15 13:53:39.714450455,1366314,T,IEX,371.375000,100
2019-10-15 13:53:41.15991040,2019-10-15 13:53:41.15969628,1367187,T,IEX,371.375000,3
2019-10-15 13:53:41.662490880,2019-10-15 13:53:41.662470583,1367636,T,IEX,371.375000,1
2019-10-15 13:53:43.218319104,2019-10-15 13:53:43.218295510,1368583,T,IEX,371.375000,1
2019-10-15 13:53:48.43905024,2019-10-15 13:53:48.43886255,1370902,T,IEX,371.375000,1
2019-10-15 13:53:48.80251904,2019-10-15 13:53:48.80231431,1370911,T,IEX,371.375000,100
2019-10-15 13:53:48.141562880,2019-10-15 13:53:48.141542842,1370945,T,IEX,371.375000,2
2019-10-15 13:53:51.204284928,2019-10-15 13:53:51.204269529,1372638,T,IEX,371.375000,100
2019-10-15 13:53:58.334724096,2019-10-15 13:53:58.334701683,1377743,T,IEX,371.375000,100
2019-10-15 13:54:07.960282112,2019-10-15 13:54:07.960265673,1385046,T,IEX,371.370000,100
2019-10-15 13:54:11.317093888,2019-10-15 13:54:11.317077786,1387348,T,IEX,371.375000,100
2019-10-15 13:54:13.991759872,2019-10-15 13:54:13.991740271,1389421,T,IEX,371.375000,100
2019-10-15 13:54:13.993409024,2019-10-15 13:54:13.993390132,1389422,T,IEX,371.375000,100
2019-10-15 13:54:19.918416896,2019-10-15 13:54:19.918395102,1394432,T,IEX,371.415000,100
2019-10-15 13:54:23.667261952,2019-10-15 13:54:23.667244254,1397091,T,IEX,371.415000,200
2019-10-15 13:54:23.821814016,2019-10-15 13:54:23.821796546,1397151,T,IEX,371.480000,100
2019-10-15 13:54:29.734372096,2019-10-15 13:54:29.734353880,1400871,T,IEX,371.470000,74
2019-10-15 13:54:33.733846016,2019-10-15 13:54:33.733826646,1402979,T,IEX,371.470000,1
2019-10-15 13:54:33.915120896,2019-10-15 13:54:33.915102335,1403057,T,IEX,371.470000,100
2019-10-15 13:54:33.975267072,2019-10-15 13:54:33.975250597,1403070,T,IEX,371.470000,2
2019-10-15 13:54:37.668627968,2019-10-15 13:54:37.668607020,1405514,T,IEX,371.470000,2
2019-10-15 13:54:40.289948928,2019-10-15 13:54:40.289926445,1407000,T,IEX,371.470000,200
2019-10-15 13:54:42.408102912,2019-10-15 13:54:42.408083759,1408392,T,IEX,371.455000,200
2019-10-15 13:54:42.409760000,2019-10-15 13:54:42.409740890,1408396,T,IEX,371.455000,174
2019-10-15 13:54:42.409785088,2019-10-15 13:54:42.409767997,1408397,T,IEX,371.455000,195
2019-10-15 13:54:42.411354112,2019-10-15 13:54:42.411332223,1408399,T,IEX,371.455000,300
2019-10-15 13:54:42.412648960,2019-10-15 13:54:42.412632460,1408400,T,IEX,371.455000,300
2019-10-15 13:54:42.412718080,2019-10-15 13:54:42.412701502,1408401,T,IEX,371.455000,100
2019-10-15 13:54:42.418693888,2019-10-15 13:54:42.418678549,1408417,T,IEX,371.455000,231
2019-10-15 13:54:43.706525952,2019-10-15 13:54:43.706508068,1408901,T,IEX,371.455000,100
2019-10-15 13:54:44.908322048,2019-10-15 13:54:44.908305218,1409832,T,IEX,371.355000,100
2019-10-15 13:54:45.267886080,2019-10-15 13:54:45.267866277,1410284,T,IEX,371.285000,100
2019-10-15 13:54:59.607750912,2019-10-15 13:54:59.607733452,1421406,T,IEX,371.065000,100
2019-10-15 13:55:08.450757120,2019-10-15 13:55:08.450738721,1428366,T,IEX,370.900000,100
2019-10-15 13:55:34.639081984,2019-10-15 13:55:34.639063700,1448271,T,IEX,370.645000,100
2019-10-15 13:55:35.423138048,2019-10-15 13:55:35.423116915,1449012,T,IEX,370.645000,400
2019-10-15 13:55:36.164451072,2019-10-15 13:55:36.164431091,1449662,T,IEX,370.645000,100
2019-10-15 13:55:38.709811968,2019-10-15 13:55:38.709790780,1451531,T,IEX,370.645000,20
2019-10-15 13:55:39.589085952,2019-10-15 13:55:39.589068798,1452372,T,IEX,370.645000,400
2019-10-15 13:55:40.37744128,2019-10-15 13:55:40.37724516,1452791,T,IEX,370.645000,100
2019-10-15 13:55:40.719715072,2019-10-15 13:55:40.719402900,1453448,T,IEX,370.645000,100
2019-10-15 13:55:42.271294976,2019-10-15 13:55:42.271274873,1454626,T,IEX,370.645000,200
2019-10-15 13:55:42.271894016,2019-10-15 13:55:42.271875600,1454627,T,IEX,370.645000,100
2019-10-15 13:55:42.273295104,2019-10-15 13:55:42.273276296,1454629,T,IEX,370.645000,200
2019-10-15 13:55:43.213979904,2019-10-15 13:55:43.213959428,1455507,T,IEX,370.635000,200
2019-10-15 13:55:53.30017024,2019-10-15 13:55:53.29995869,1463154,T,IEX,370.700000,100
2019-10-15 13:55:54.35308032,2019-10-15 13:55:54.35288316,1463861,T,IEX,370.800000,100
2019-10-15 13:55:54.35333888,2019-10-15 13:55:54.35317832,1463862,T,IEX,370.800000,300
2019-10-15 13:55:54.44683008,2019-10-15 13:55:54.44667123,1463873,T,IEX,370.800000,100
2019-10-15 13:55:54.59081984,2019-10-15 13:55:54.59065005,1463888,T,IEX,370.800000,100
2019-10-15 13:55:54.65285888,2019-10-15 13:55:54.65267314,1463891,T,IEX,370.800000,100
2019-10-15 13:55:55.498412032,2019-10-15 13:55:55.498392422,1464855,T,IEX,370.795000,100
2019-10-15 13:55:55.542246912,2019-10-15 13:55:55.542231258,1464890,T,IEX,370.795000,100
2019-10-15 13:55:56.432614912,2019-10-15 13:55:56.432595537,1465537,T,IEX,370.795000,100
2019-10-15 13:55:58.760978944,2019-10-15 13:55:58.760959022,1467562,T,IEX,370.795000,73
2019-10-15 13:55:59.442504960,2019-10-15 13:55:59.442486657,1467929,T,IEX,370.795000,2
2019-10-15 13:55:59.774961920,2019-10-15 13:55:59.774944329,1468097,T,IEX,370.795000,100
2019-10-15 13:55:59.879069952,2019-10-15 13:55:59.879052150,1468148,T,IEX,370.795000,1
2019-10-15 13:56:01.485895936,2019-10-15 13:56:01.485875210,1469267,T,IEX,370.795000,100
2019-10-15 13:56:02.184075008,2019-10-15 13:56:02.184056427,1469581,T,IEX,370.795000,4
2019-10-15 13:56:02.842864128,2019-10-15 13:56:02.842843413,1470087,T,IEX,370.790000,50
2019-10-15 13:56:02.842918912,2019-10-15 13:56:02.842901752,1470088,T,IEX,370.790000,50
2019-10-15 13:56:02.843158016,2019-10-15 13:56:02.843141909,1470090,T,IEX,370.775000,29
2019-10-15 13:56:02.843248896,2019-10-15 13:56:02.843234269,1470091,T,IEX,370.775000,85
2019-10-15 13:56:02.843814912,2019-10-15 13:56:02.843797451,1470093,T,IEX,370.745000,75
2019-10-15 13:56:02.844078080,2019-10-15 13:56:02.844061808,1470094,T,IEX,370.745000,100
2019-10-15 13:56:02.844125952,2019-10-15 13:56:02.844109449,1470095,T,IEX,370.745000,75
2019-10-15 13:56:02.845239040,2019-10-15 13:56:02.845220155,1470096,T,IEX,370.745000,75
2019-10-15 13:56:02.848054016,2019-10-15 13:56:02.848033395,1470097,T,IEX,370.745000,29
2019-10-15 13:56:04.956026112,2019-10-15 13:56:04.956007916,1471572,T,IEX,370.690000,52
2019-10-15 13:56:06.470135040,2019-10-15 13:56:06.470115559,1472864,T,IEX,370.690000,100
2019-10-15 13:56:06.471795968,2019-10-15 13:56:06.471775768,1472865,T,IEX,370.690000,100
2019-10-15 13:56:06.472185088,2019-10-15 13:56:06.472168935,1472866,T,IEX,370.690000,100
2019-10-15 13:56:06.473347072,2019-10-15 13:56:06.473328563,1472867,T,IEX,370.690000,100
2019-10-15 13:56:06.576871936,2019-10-15 13:56:06.576852114,1472938,T,IEX,370.690000,100
2019-10-15 13:56:06.726309888,2019-10-15 13:56:06.726294449,1473100,T,IEX,370.690000,40
2019-10-15 13:56:07.658553088,2019-10-15 13:56:07.658533679,1474642,T,IEX,370.690000,100
2019-10-15 13:56:08.428359936,2019-10-15 13:56:08.428343998,1475177,T,IEX,370.655000,200
2019-10-15 13:56:08.580633088,2019-10-15 13:56:08.580617623,1475521,T,IEX,370.655000,100
2019-10-15 13:56:09.352840960,2019-10-15 13:56:09.352821835,1476011,T,IEX,370.660000,300
2019-10-15 13:56:11.235516928,2019-10-15 13:56:11.235500839,1477422,T,IEX,370.655000,100
2019-10-15 13:56:11.236538112,2019-10-15 13:56:11.236521316,1477424,T,IEX,370.655000,100
2019-10-15 13:56:11.237657088,2019-10-15 13:56:11.237637566,1477425,T,IEX,370.655000,49
2019-10-15 13:56:11.241953024,2019-10-15 13:56:11.241932301,1477426,T,IEX,370.590000,1
2019-10-15 13:56:24.311201024,2019-10-15 13:56:24.311182538,1490615,T,IEX,370.550000,100
2019-10-15 13:57:53.258631936,2019-10-15 13:57:53.258610047,1548369,T,IEX,370.650000,100
2019-10-15 14:00:02.321344000,2019-10-15 14:00:02.321326929,1639260,T,IEX,370.880000,100
2019-10-15 14:00:23.886287104,2019-10-15 14:00:23.886266426,1655678,T,IEX,370.980000,3
2019-10-15 14:00:23.953528064,2019-10-15 14:00:23.953508661,1655711,T,IEX,370.890000,1
2019-10-15 14:00:23.953545984,2019-10-15 14:00:23.953528919,1655712,T,IEX,370.890000,1
2019-10-15 14:00:51.737634048,2019-10-15 14:00:51.737613432,1676058,T,IEX,370.890000,100
2019-10-15 14:00:54.565204992,2019-10-15 14:00:54.565185959,1677826,T,IEX,370.895000,100
2019-10-15 14:01:23.492656128,2019-10-15 14:01:23.492639918,1699392,T,IEX,370.900000,100
2019-10-15 14:01:37.30149120,2019-10-15 14:01:37.30130308,1709054,T,IEX,370.880000,100
2019-10-15 14:01:39.75636992,2019-10-15 14:01:39.75619047,1711265,T,IEX,370.865000,100
2019-10-15 14:02:23.836538112,2019-10-15 14:02:23.836521157,1758017,T,IEX,371.045000,100
2019-10-15 14:02:23.837566976,2019-10-15 14:02:23.837548178,1758019,T,IEX,371.045000,27
2019-10-15 14:02:44.240252928,2019-10-15 14:02:44.240229541,1779055,T,IEX,371.070000,100
2019-10-15 14:04:08.115032064,2019-10-15 14:04:08.115013938,1837117,T,IEX,371.190000,1
2019-10-15 14:04:08.115057920,2019-10-15 14:04:08.115039797,1837118,T,IEX,371.190000,1
2019-10-15 14:04:42.371499008,2019-10-15 14:04:42.371478337,1860335,T,IEX,371.245000,100
2019-10-15 14:04:43.476262912,2019-10-15 14:04:43.476247306,1861527,T,IEX,371.250000,100
2019-10-15 14:05:29.498029056,2019-10-15 14:05:29.498010603,1896576,T,IEX,371.095000,100
2019-10-15 14:05:32.495831040,2019-10-15 14:05:32.495813091,1898609,T,IEX,370.980000,1
2019-10-15 14:05:32.495848960,2019-10-15 14:05:32.495833377,1898610,T,IEX,370.980000,199
2019-10-15 14:05:33.232220928,2019-10-15 14:05:33.232203849,1899268,T,IEX,370.980000,100
2019-10-15 14:05:34.743645952,2019-10-15 14:05:34.743630037,1900640,T,IEX,370.995000,100
2019-10-15 14:05:48.762401024,2019-10-15 14:05:48.762382375,1909864,T,IEX,371.025000,100
2019-10-15 14:05:50.310377984,2019-10-15 14:05:50.310358896,1912723,T,IEX,371.060000,200
2019-10-15 14:06:08.893783040,2019-10-15 14:06:08.893764729,1924566,T,IEX,371.130000,100
2019-10-15 14:06:16.602178048,2019-10-15 14:06:16.602160181,1930612,T,IEX,371.130000,100
2019-10-15 14:06:29.596410112,2019-10-15 14:06:29.596389007,1938591,T,IEX,371.170000,100
2019-10-15 14:06:29.606746112,2019-10-15 14:06:29.606726453,1938635,T,IEX,371.350000,100
2019-10-15 14:06:47.494562048,2019-10-15 14:06:47.494542596,1951398,T,IEX,371.335000,100
2019-10-15 14:07:32.973501952,2019-10-15 14:07:32.973481882,1978855,T,IEX,371.430000,100
2019-10-15 14:09:49.530630912,2019-10-15 14:09:49.530613193,2061702,T,IEX,371.680000,5
2019-10-15 14:10:04.533668096,2019-10-15 14:10:04.533647137,2074714,T,IEX,371.605000,100
2019-10-15 14:10:24.304432896,2019-10-15 14:10:24.304416421,2093092,T,IEX,371.430000,1
2019-10-15 14:10:24.406917888,2019-10-15 14:10:24.406899966,2093155,T,IEX,371.430000,1
2019-10-15 14:11:42.2315008,2019-10-15 14:11:42.2293406,2155852,T,IEX,371.225000,2
2019-10-15 14:11:42.2337024,2019-10-15 14:11:42.2319592,2155853,T,IEX,371.225000,2
2019-10-15 14:11:51.3855872,2019-10-15 14:11:51.3835138,2162918,T,IEX,371.255000,1
2019-10-15 14:12:04.336271104,2019-10-15 14:12:04.336253357,2172437,T,IEX,371.320000,1
2019-10-15 14:12:36.361637888,2019-10-15 14:12:36.361619188,2199096,T,IEX,371.340000,2
2019-10-15 14:12:39.554299904,2019-10-15 14:12:39.554283703,2200685,T,IEX,371.340000,1
2019-10-15 14:12:46.281611008,2019-10-15 14:12:46.281592662,2204686,T,IEX,371.280000,2
2019-10-15 14:12:49.308361984,2019-10-15 14:12:49.308342129,2207387,T,IEX,371.235000,200
2019-10-15 14:12:49.313305088,2019-10-15 14:12:49.313284373,2207523,T,IEX,371.235000,1
2019-10-15 14:13:30.263983104,2019-10-15 14:13:30.263964825,2238460,T,IEX,371.660000,2
2019-10-15 14:13:31.448290048,2019-10-15 14:13:31.448268858,2241773,T,IEX,371.715000,3
2019-10-15 14:14:04.19077888,2019-10-15 14:14:04.19057647,2264718,T,IEX,371.645000,1
2019-10-15 14:14:38.23290112,2019-10-15 14:14:38.23269964,2292604,T,IEX,371.580000,1
2019-10-15 14:14:53.843020032,2019-10-15 14:14:53.842998846,2301705,T,IEX,371.660000,100
2019-10-15 14:15:00.657105920,2019-10-15 14:15:00.657084944,2307523,T,IEX,371.745000,2
2019-10-15 14:15:00.665067008,2019-10-15 14:15:00.665046372,2307528,T,IEX,371.745000,1
2019-10-15 14:15:07.240320000,2019-10-15 14:15:07.240300726,2314146,T,IEX,371.860000,23
2019-10-15 14:15:29.647774976,2019-10-15 14:15:29.647756419,2329056,T,IEX,371.800000,15
2019-10-15 14:15:49.630533120,2019-10-15 14:15:49.630517279,2345471,T,IEX,371.860000,8
2019-10-15 14:16:06.591766016,2019-10-15 14:16:06.591748109,2358682,T,IEX,371.800000,8
2019-10-15 14:16:40.555813120,2019-10-15 14:16:40.555792328,2381159,T,IEX,371.600000,3
2019-10-15 14:17:47.242544128,2019-10-15 14:17:47.242523521,2421872,T,IEX,371.395000,100
2019-10-15 14:18:47.132493056,2019-10-15 14:18:47.132471057,2462976,T,IEX,371.640000,100
2019-10-15 14:18:47.132514048,2019-10-15 14:18:47.132497720,2462977,T,IEX,371.650000,200
2019-10-15 14:18:47.132531968,2019-10-15 14:18:47.132515359,2462978,T,IEX,371.650000,200
2019-10-15 14:18:47.132553984,2019-10-15 14:18:47.132535779,2462979,T,IEX,371.690000,13
2019-10-15 14:18:47.132564992,2019-10-15 14:18:47.132548867,2462980,T,IEX,371.720000,93
2019-10-15 14:18:48.610721024,2019-10-15 14:18:48.610700122,2464109,T,IEX,371.770000,100
2019-10-15 14:18:56.855386880,2019-10-15 14:18:56.855364656,2469456,T,IEX,371.805000,100
2019-10-15 14:18:56.947143936,2019-10-15 14:18:56.947126404,2469516,T,IEX,371.805000,7
2019-10-15 14:19:55.907649024,2019-10-15 14:19:55.907633137,2512517,T,IEX,371.845000,100
2019-10-15 14:19:55.907668992,2019-10-15 14:19:55.907651720,2512518,T,IEX,371.845000,100
2019-10-15 14:20:15.316698880,2019-10-15 14:20:15.316682783,2526974,T,IEX,371.840000,100
2019-10-15 14:20:15.874157056,2019-10-15 14:20:15.874135679,2527652,T,IEX,371.790000,60
2019-10-15 14:20:15.874262016,2019-10-15 14:20:15.874245560,2527654,T,IEX,371.790000,40
2019-10-15 14:20:15.949199872,2019-10-15 14:20:15.949185163,2527723,T,IEX,371.845000,100
2019-10-15 14:20:16.834168064,2019-10-15 14:20:16.834146990,2528272,T,IEX,371.820000,63
2019-10-15 14:20:17.890921984,2019-10-15 14:20:17.890902401,2528719,T,IEX,371.815000,10
2019-10-15 14:22:16.968179968,2019-10-15 14:22:16.968159870,2597735,T,IEX,371.700000,100
2019-10-15 14:23:47.924058112,2019-10-15 14:23:47.924037500,2657428,T,IEX,371.850000,200
2019-10-15 14:25:08.271437056,2019-10-15 14:25:08.271418295,2707495,T,IEX,371.800000,100
2019-10-15 14:25:45.641455104,2019-10-15 14:25:45.641438196,2733482,T,IEX,371.815000,1
2019-10-15 14:26:13.891501056,2019-10-15 14:26:13.891480891,2755173,T,IEX,371.860000,100
2019-10-15 14:27:51.873622016,2019-10-15 14:27:51.873606137,2893632,T,IEX,371.965000,49
2019-10-15 14:27:56.714400000,2019-10-15 14:27:56.714378206,2900945,T,IEX,372.040000,100
2019-10-15 14:29:45.739196928,2019-10-15 14:29:45.739179333,3056949,T,IEX,372.080000,100
2019-10-15 14:29:45.748335104,2019-10-15 14:29:45.748318131,3056978,T,IEX,372.150000,100
2019-10-15 14:29:45.750013952,2019-10-15 14:29:45.749995093,3056983,T,IEX,372.150000,100
2019-10-15 14:29:45.751451904,2019-10-15 14:29:45.751435171,3056986,T,IEX,372.150000,200
2019-10-15 14:31:12.997675008,2019-10-15 14:31:12.997657012,3175288,T,IEX,372.060000,100
2019-10-15 14:31:13.778822912,2019-10-15 14:31:13.778801456,3176103,T,IEX,372.070000,100
2019-10-15 14:31:29.529427968,2019-10-15 14:31:29.529407019,3194077,T,IEX,372.055000,200
2019-10-15 14:32:01.671542016,2019-10-15 14:32:01.671524383,3234214,T,IEX,371.925000,100
2019-10-15 14:32:03.205744128,2019-10-15 14:32:03.205725949,3237069,T,IEX,371.960000,100
2019-10-15 14:32:18.344204032,2019-10-15 14:32:18.344182548,3253600,T,IEX,372.090000,200
2019-10-15 14:32:22.927291904,2019-10-15 14:32:22.927275774,3263083,T,IEX,372.205000,36
2019-10-15 14:33:31.743282944,2019-10-15 14:33:31.743261660,3346007,T,IEX,372.075000,117
2019-10-15 14:35:38.488971008,2019-10-15 14:35:38.488949022,3462413,T,IEX,372.240000,180
2019-10-15 14:35:53.760819968,2019-10-15 14:35:53.760797430,3485650,T,IEX,372.180000,8
2019-10-15 14:35:53.760832000,2019-10-15 14:35:53.760815920,3485651,T,IEX,372.180000,13
2019-10-15 14:36:06.760004096,2019-10-15 14:36:06.759984850,3506873,T,IEX,372.095000,3
2019-10-15 14:36:06.760015872,2019-10-15 14:36:06.759998824,3506874,T,IEX,372.095000,9
2019-10-15 14:37:06.815396096,2019-10-15 14:37:06.815376737,3579029,T,IEX,371.950000,100
2019-10-15 14:37:42.912371968,2019-10-15 14:37:42.912351971,3608938,T,IEX,372.005000,100
2019-10-15 14:38:09.404312064,2019-10-15 14:38:09.404292187,3637272,T,IEX,372.120000,100
2019-10-15 14:39:49.689453056,2019-10-15 14:39:49.689435231,3746023,T,IEX,372.020000,100
2019-10-15 14:39:59.301597952,2019-10-15 14:39:59.301580522,3757803,T,IEX,371.965000,100
2019-10-15 14:40:46.156829952,2019-10-15 14:40:46.156811271,3815275,T,IEX,372.200000,2
2019-10-15 14:42:09.130546944,2019-10-15 14:42:09.130525430,3925745,T,IEX,372.170000,100
2019-10-15 14:42:50.859420928,2019-10-15 14:42:50.859404876,3972065,T,IEX,372.160000,100
2019-10-15 14:43:30.780520960,2019-10-15 14:43:30.780498201,4007562,T,IEX,372.100000,2
2019-10-15 14:43:52.98927104,2019-10-15 14:43:52.98908782,4028328,T,IEX,372.040000,100
2019-10-15 14:44:34.842807040,2019-10-15 14:44:34.842785213,4075454,T,IEX,372.070000,100
2019-10-15 14:46:10.340811008,2019-10-15 14:46:10.340792796,4172613,T,IEX,372.035000,2
2019-10-15 14:46:13.658395904,2019-10-15 14:46:13.658375805,4176459,T,IEX,372.080000,100
2019-10-15 14:46:49.224678912,2019-10-15 14:46:49.224659951,4207665,T,IEX,372.020000,2
2019-10-15 14:47:55.254710016,2019-10-15 14:47:55.254691624,4259297,T,IEX,371.920000,21
2019-10-15 14:48:23.483337984,2019-10-15 14:48:23.483316412,4280143,T,IEX,372.060000,100
2019-10-15 14:48:25.245582080,2019-10-15 14:48:25.245560442,4281807,T,IEX,372.050000,100
2019-10-15 14:48:42.378310912,2019-10-15 14:48:42.378290669,4294386,T,IEX,372.070000,100
2019-10-15 14:48:53.991204096,2019-10-15 14:48:53.991183609,4304041,T,IEX,371.980000,100
2019-10-15 14:49:40.714747904,2019-10-15 14:49:40.714725967,4342521,T,IEX,371.910000,1
2019-10-15 14:49:40.714763008,2019-10-15 14:49:40.714745839,4342522,T,IEX,371.900000,2
2019-10-15 14:51:06.988566016,2019-10-15 14:51:06.988550227,4406952,T,IEX,371.750000,1
2019-10-15 14:51:23.145216000,2019-10-15 14:51:23.145196642,4422525,T,IEX,371.690000,100
2019-10-15 14:51:35.145324032,2019-10-15 14:51:35.145306892,4433800,T,IEX,371.690000,1
2019-10-15 14:51:35.145344000,2019-10-15 14:51:35.145326379,4433801,T,IEX,371.690000,1
2019-10-15 14:52:24.663822080,2019-10-15 14:52:24.663800029,4471931,T,IEX,371.785000,6
2019-10-15 14:53:42.566959104,2019-10-15 14:53:42.566942122,4535245,T,IEX,371.950000,25
2019-10-15 14:53:42.597553920,2019-10-15 14:53:42.597535234,4535276,T,IEX,371.950000,100
2019-10-15 14:53:42.597859072,2019-10-15 14:53:42.597839756,4535283,T,IEX,371.950000,75
2019-10-15 14:54:09.300043008,2019-10-15 14:54:09.300025803,4555949,T,IEX,371.960000,100
2019-10-15 14:54:24.755592960,2019-10-15 14:54:24.755573055,4568048,T,IEX,372.070000,6
2019-10-15 14:54:40.42618112,2019-10-15 14:54:40.42595079,4577657,T,IEX,372.080000,100
2019-10-15 14:54:57.101257984,2019-10-15 14:54:57.101239708,4594844,T,IEX,372.095000,100
2019-10-15 14:55:03.169992960,2019-10-15 14:55:03.169975618,4603644,T,IEX,372.040000,1
2019-10-15 14:55:14.35011072,2019-10-15 14:55:14.34993900,4614483,T,IEX,372.135000,100
2019-10-15 14:55:34.381198080,2019-10-15 14:55:34.381180184,4632173,T,IEX,372.165000,1
2019-10-15 14:56:07.887895040,2019-10-15 14:56:07.887872700,4660976,T,IEX,372.250000,100
2019-10-15 14:56:07.888984064,2019-10-15 14:56:07.888963404,4660977,T,IEX,372.250000,100
2019-10-15 14:56:07.889966080,2019-10-15 14:56:07.889946901,4660978,T,IEX,372.250000,400
2019-10-15 14:56:10.377147904,2019-10-15 14:56:10.377128197,4663449,T,IEX,372.220000,2
2019-10-15 14:56:16.993851904,2019-10-15 14:56:16.993831729,4670134,T,IEX,372.325000,2
2019-10-15 14:56:40.685083904,2019-10-15 14:56:40.685065068,4687844,T,IEX,372.210000,100
2019-10-15 14:57:11.959064064,2019-10-15 14:57:11.959045815,4713247,T,IEX,372.345000,1
2019-10-15 14:57:19.357790976,2019-10-15 14:57:19.357770173,4719880,T,IEX,372.380000,2
2019-10-15 14:57:19.357808128,2019-10-15 14:57:19.357790029,4719881,T,IEX,372.390000,2
2019-10-15 14:57:25.203393024,2019-10-15 14:57:25.203370133,4723058,T,IEX,372.365000,127
2019-10-15 14:57:36.158161920,2019-10-15 14:57:36.158145628,4730845,T,IEX,372.515000,100
2019-10-15 14:57:48.104365056,2019-10-15 14:57:48.104344250,4743517,T,IEX,372.725000,2
2019-10-15 14:57:53.346782976,2019-10-15 14:57:53.346763456,4748259,T,IEX,372.760000,200
2019-10-15 14:58:00.6919936,2019-10-15 14:58:00.6899565,4755014,T,IEX,372.795000,1
2019-10-15 14:58:31.983439872,2019-10-15 14:58:31.983421610,4779235,T,IEX,372.760000,100
2019-10-15 14:58:31.984698112,2019-10-15 14:58:31.984677544,4779239,T,IEX,372.690000,95
2019-10-15 14:58:31.984824064,2019-10-15 14:58:31.984806509,4779241,T,IEX,372.690000,5
2019-10-15 14:58:32.6156032,2019-10-15 14:58:32.6136573,4779262,T,IEX,372.600000,100
2019-10-15 14:58:32.6166016,2019-10-15 14:58:32.6144908,4779263,T,IEX,372.600000,100
2019-10-15 14:58:32.15630080,2019-10-15 14:58:32.15612204,4779271,T,IEX,372.560000,100
2019-10-15 14:58:32.15643904,2019-10-15 14:58:32.15625513,4779272,T,IEX,372.560000,100
2019-10-15 14:58:32.15655936,2019-10-15 14:58:32.15639102,4779273,T,IEX,372.560000,100
2019-10-15 14:58:32.15664128,2019-10-15 14:58:32.15647648,4779274,T,IEX,372.560000,100
2019-10-15 14:58:32.15684096,2019-10-15 14:58:32.15667323,4779275,T,IEX,372.560000,100
2019-10-15 14:58:53.506523904,2019-10-15 14:58:53.506503668,4796287,T,IEX,372.780000,200
2019-10-15 14:58:53.506539008,2019-10-15 14:58:53.506521829,4796288,T,IEX,372.810000,50
2019-10-15 14:58:53.506555904,2019-10-15 14:58:53.506539534,4796289,T,IEX,372.820000,100
2019-10-15 14:58:53.506567936,2019-10-15 14:58:53.506551878,4796290,T,IEX,372.820000,100
2019-10-15 14:58:53.506587904,2019-10-15 14:58:53.506571405,4796291,T,IEX,372.820000,450
2019-10-15 14:59:30.318348032,2019-10-15 14:59:30.318331745,4827473,T,IEX,372.825000,100
2019-10-15 14:59:48.323424000,2019-10-15 14:59:48.323408447,4845114,T,IEX,372.900000,111
2019-10-15 14:59:57.49818112,2019-10-15 14:59:57.49798527,4852747,T,IEX,372.910000,100
2019-10-15 14:59:58.357559040,2019-10-15 14:59:58.357536635,4855227,T,IEX,372.920000,400
2019-10-15 14:59:59.7585024,2019-10-15 14:59:59.7555817,4856038,T,IEX,372.980000,39
2019-10-15 15:00:00.276530944,2019-10-15 15:00:00.276510285,4858447,T,IEX,372.980000,10
2019-10-15 15:00:00.429373952,2019-10-15 15:00:00.429355731,4858790,T,IEX,372.920000,100
2019-10-15 15:00:16.982240000,2019-10-15 15:00:16.982212162,4876573,T,IEX,372.930000,100
2019-10-15 15:00:17.44564992,2019-10-15 15:00:17.44546004,4876664,T,IEX,372.930000,6
2019-10-15 15:00:22.895657984,2019-10-15 15:00:22.895638137,4885132,T,IEX,372.830000,100
2019-10-15 15:00:23.717445120,2019-10-15 15:00:23.717429243,4886253,T,IEX,372.800000,100
2019-10-15 15:01:38.138923008,2019-10-15 15:01:38.138900230,4956916,T,IEX,373.015000,71
2019-10-15 15:02:04.325675008,2019-10-15 15:02:04.325654808,4978915,T,IEX,373.055000,200
2019-10-15 15:02:25.119353088,2019-10-15 15:02:25.119321943,5001674,T,IEX,372.870000,6
2019-10-15 15:02:28.599557120,2019-10-15 15:02:28.599540117,5004439,T,IEX,372.890000,100
2019-10-15 15:02:28.599576064,2019-10-15 15:02:28.599559390,5004440,T,IEX,372.880000,100
2019-10-15 15:02:29.460756992,2019-10-15 15:02:29.460736296,5005007,T,IEX,372.810000,100
2019-10-15 15:02:45.175555072,2019-10-15 15:02:45.175538499,5025129,T,IEX,372.880000,100
2019-10-15 15:02:45.175750912,2019-10-15 15:02:45.175733810,5025130,T,IEX,372.890000,100
2019-10-15 15:03:04.335269120,2019-10-15 15:03:04.335250698,5043872,T,IEX,372.890000,100
2019-10-15 15:03:25.670121984,2019-10-15 15:03:25.670104932,5065980,T,IEX,372.830000,100
2019-10-15 15:03:58.252346112,2019-10-15 15:03:58.252327206,5095419,T,IEX,372.920000,200
2019-10-15 15:04:10.755060992,2019-10-15 15:04:10.755042729,5106234,T,IEX,372.765000,3
2019-10-15 15:04:10.755078912,2019-10-15 15:04:10.755062001,5106235,T,IEX,372.765000,2
2019-10-15 15:04:10.755088896,2019-10-15 15:04:10.755071562,5106236,T,IEX,372.765000,1
2019-10-15 15:04:10.755102976,2019-10-15 15:04:10.755086291,5106237,T,IEX,372.765000,3
2019-10-15 15:04:10.755117056,2019-10-15 15:04:10.755099442,5106238,T,IEX,372.765000,10
2019-10-15 15:04:10.755130880,2019-10-15 15:04:10.755114863,5106239,T,IEX,372.765000,4
2019-10-15 15:04:10.776716032,2019-10-15 15:04:10.776697149,5106254,T,IEX,372.730000,4
2019-10-15 15:05:55.36968960,2019-10-15 15:05:55.36947279,5199435,T,IEX,372.525000,1
2019-10-15 15:06:04.263813888,2019-10-15 15:06:04.263795191,5205210,T,IEX,372.450000,100
2019-10-15 15:06:12.991172096,2019-10-15 15:06:12.991152509,5210882,T,IEX,372.450000,100
2019-10-15 15:06:24.398981120,2019-10-15 15:06:24.398963178,5220301,T,IEX,372.450000,100
2019-10-15 15:07:24.617522944,2019-10-15 15:07:24.617507023,5276132,T,IEX,372.900000,3
2019-10-15 15:07:51.577189120,2019-10-15 15:07:51.577170769,5294621,T,IEX,373.015000,100
2019-10-15 15:08:25.356990976,2019-10-15 15:08:25.356969877,5316241,T,IEX,372.950000,2
2019-10-15 15:08:25.357001984,2019-10-15 15:08:25.356984917,5316242,T,IEX,372.950000,1
2019-10-15 15:08:25.357019904,2019-10-15 15:08:25.357003022,5316243,T,IEX,372.950000,1
2019-10-15 15:08:25.860999936,2019-10-15 15:08:25.860978737,5316587,T,IEX,372.915000,100
2019-10-15 15:08:53.558294016,2019-10-15 15:08:53.558274968,5336553,T,IEX,372.950000,1
2019-10-15 15:08:59.927177984,2019-10-15 15:08:59.927160176,5342088,T,IEX,372.890000,4
2019-10-15 15:08:59.927196928,2019-10-15 15:08:59.927180298,5342089,T,IEX,372.890000,100
2019-10-15 15:08:59.935736064,2019-10-15 15:08:59.935718001,5342125,T,IEX,372.830000,12
2019-10-15 15:08:59.935748096,2019-10-15 15:08:59.935731184,5342126,T,IEX,372.830000,100
2019-10-15 15:09:00.239623936,2019-10-15 15:09:00.239608346,5342533,T,IEX,372.830000,100
2019-10-15 15:09:03.798589952,2019-10-15 15:09:03.798571443,5345563,T,IEX,372.830000,20
2019-10-15 15:09:19.845720064,2019-10-15 15:09:19.845699982,5356938,T,IEX,372.830000,100
2019-10-15 15:09:26.239493888,2019-10-15 15:09:26.239477496,5361148,T,IEX,372.735000,100
2019-10-15 15:09:28.953996032,2019-10-15 15:09:28.953979228,5363151,T,IEX,372.680000,100
2019-10-15 15:09:29.44579072,2019-10-15 15:09:29.44561791,5363609,T,IEX,372.680000,200
2019-10-15 15:09:33.7865088,2019-10-15 15:09:33.7846756,5367387,T,IEX,372.680000,100
2019-10-15 15:09:36.141274112,2019-10-15 15:09:36.141255815,5369674,T,IEX,372.680000,100
2019-10-15 15:09:42.7646976,2019-10-15 15:09:42.7629635,5374684,T,IEX,372.680000,100
2019-10-15 15:09:49.16064000,2019-10-15 15:09:49.16044908,5379459,T,IEX,372.710000,100
2019-10-15 15:10:16.562362112,2019-10-15 15:10:16.562346755,5404370,T,IEX,372.655000,100
2019-10-15 15:10:16.745548032,2019-10-15 15:10:16.745526368,5404480,T,IEX,372.600000,100
2019-10-15 15:11:20.242405888,2019-10-15 15:11:20.242383068,5449631,T,IEX,372.565000,34
2019-10-15 15:11:25.473292032,2019-10-15 15:11:25.473275411,5455430,T,IEX,372.530000,300
2019-10-15 15:11:38.963646976,2019-10-15 15:11:38.963626408,5464718,T,IEX,372.550000,29
2019-10-15 15:11:38.964018944,2019-10-15 15:11:38.963999211,5464735,T,IEX,372.560000,25
2019-10-15 15:11:45.89593088,2019-10-15 15:11:45.89573186,5468016,T,IEX,372.400000,100
2019-10-15 15:11:45.90639104,2019-10-15 15:11:45.90618596,5468017,T,IEX,372.400000,100
2019-10-15 15:11:45.92148992,2019-10-15 15:11:45.92132518,5468019,T,IEX,372.400000,100
2019-10-15 15:11:45.858917888,2019-10-15 15:11:45.858899584,5468652,T,IEX,372.420000,100
2019-10-15 15:11:55.253158912,2019-10-15 15:11:55.253137413,5474882,T,IEX,372.445000,100
2019-10-15 15:12:06.589283072,2019-10-15 15:12:06.589261430,5481998,T,IEX,372.450000,40
2019-10-15 15:12:12.428649984,2019-10-15 15:12:12.428629452,5486981,T,IEX,372.485000,6
2019-10-15 15:12:17.423319040,2019-10-15 15:12:17.423298648,5490360,T,IEX,372.475000,6
2019-10-15 15:12:21.11436032,2019-10-15 15:12:21.11414409,5493187,T,IEX,372.350000,22
2019-10-15 15:12:21.244435968,2019-10-15 15:12:21.244420253,5493331,T,IEX,372.375000,100
2019-10-15 15:12:21.244453888,2019-10-15 15:12:21.244435684,5493332,T,IEX,372.375000,100
2019-10-15 15:12:21.802283008,2019-10-15 15:12:21.802264965,5494186,T,IEX,372.340000,100
2019-10-15 15:12:21.802330880,2019-10-15 15:12:21.802314021,5494187,T,IEX,372.340000,100
2019-10-15 15:12:47.1328896,2019-10-15 15:12:47.1310056,5513881,T,IEX,372.280000,100
2019-10-15 15:12:53.780139008,2019-10-15 15:12:53.780120750,5519011,T,IEX,372.180000,100
2019-10-15 15:13:11.8318976,2019-10-15 15:13:11.8299116,5530745,T,IEX,372.020000,100
2019-10-15 15:13:20.7064064,2019-10-15 15:13:20.7045323,5536255,T,IEX,372.070000,20
2019-10-15 15:13:20.169078016,2019-10-15 15:13:20.169060962,5536623,T,IEX,372.065000,29
2019-10-15 15:13:20.169355008,2019-10-15 15:13:20.169338241,5536627,T,IEX,372.065000,29
2019-10-15 15:13:24.809306112,2019-10-15 15:13:24.809285825,5539230,T,IEX,372.000000,100
2019-10-15 15:13:24.824570880,2019-10-15 15:13:24.824550606,5539234,T,IEX,372.005000,1
2019-10-15 15:13:27.614053120,2019-10-15 15:13:27.614034874,5540841,T,IEX,371.870000,100
2019-10-15 15:13:29.722672128,2019-10-15 15:13:29.722648507,5542126,T,IEX,371.935000,100
2019-10-15 15:13:29.750749952,2019-10-15 15:13:29.750729181,5542134,T,IEX,371.870000,100
2019-10-15 15:13:30.876232960,2019-10-15 15:13:30.876212100,5542722,T,IEX,371.860000,100
2019-10-15 15:13:33.356152064,2019-10-15 15:13:33.356132537,5544050,T,IEX,371.870000,100
2019-10-15 15:13:46.278414080,2019-10-15 15:13:46.278393569,5553747,T,IEX,371.890000,100
2019-10-15 15:14:03.348314112,2019-10-15 15:14:03.348294738,5565128,T,IEX,372.045000,1
2019-10-15 15:14:04.239386880,2019-10-15 15:14:04.239368058,5566742,T,IEX,372.070000,1
2019-10-15 15:14:23.461442048,2019-10-15 15:14:23.461421122,5589017,T,IEX,371.995000,2
2019-10-15 15:14:23.461465088,2019-10-15 15:14:23.461446571,5589018,T,IEX,371.995000,1
2019-10-15 15:14:25.92782080,2019-10-15 15:14:25.92759060,5590659,T,IEX,371.950000,100
2019-10-15 15:14:34.437937920,2019-10-15 15:14:34.437919557,5600022,T,IEX,371.980000,1
2019-10-15 15:14:34.488350976,2019-10-15 15:14:34.488328751,5600128,T,IEX,371.985000,29
2019-10-15 15:14:34.489637120,2019-10-15 15:14:34.489615684,5600184,T,IEX,371.985000,29
2019-10-15 15:14:37.495015936,2019-10-15 15:14:37.494996122,5602729,T,IEX,371.980000,30
2019-10-15 15:14:49.565362944,2019-10-15 15:14:49.565344390,5613750,T,IEX,371.995000,2
2019-10-15 15:15:03.110137088,2019-10-15 15:15:03.110119712,5623886,T,IEX,372.040000,2
2019-10-15 15:15:53.84441088,2019-10-15 15:15:53.84417643,5667122,T,IEX,372.075000,25
2019-10-15 15:15:56.84502016,2019-10-15 15:15:56.84477262,5669671,T,IEX,372.060000,20
2019-10-15 15:16:12.173391104,2019-10-15 15:16:12.173371014,5681238,T,IEX,372.000000,100
2019-10-15 15:16:12.173406976,2019-10-15 15:16:12.173389611,5681239,T,IEX,372.000000,100
2019-10-15 15:16:51.504396032,2019-10-15 15:16:51.504377813,5706024,T,IEX,372.000000,25
2019-10-15 15:17:20.303369984,2019-10-15 15:17:20.303351530,5728904,T,IEX,371.920000,100
2019-10-15 15:19:35.846843904,2019-10-15 15:19:35.846827191,5835490,T,IEX,372.060000,3
2019-10-15 15:20:29.685335040,2019-10-15 15:20:29.685316294,5871098,T,IEX,372.120000,100
2019-10-15 15:21:04.712688128,2019-10-15 15:21:04.712668138,5909481,T,IEX,371.940000,5
2019-10-15 15:21:06.92375040,2019-10-15 15:21:06.92359337,5913091,T,IEX,371.955000,100
2019-10-15 15:21:06.92403968,2019-10-15 15:21:06.92387746,5913092,T,IEX,371.955000,100
2019-10-15 15:22:28.287521024,2019-10-15 15:22:28.287498332,6011219,T,IEX,371.840000,100
2019-10-15 15:22:28.287526912,2019-10-15 15:22:28.287507282,6011220,T,IEX,371.840000,100
2019-10-15 15:22:30.198124032,2019-10-15 15:22:30.198104470,6012488,T,IEX,371.840000,100
2019-10-15 15:22:52.255536896,2019-10-15 15:22:52.255518035,6030396,T,IEX,371.940000,100
2019-10-15 15:23:08.641917952,2019-10-15 15:23:08.641898902,6041918,T,IEX,372.035000,100
2019-10-15 15:23:57.624792064,2019-10-15 15:23:57.624772381,6078611,T,IEX,371.890000,3
2019-10-15 15:23:58.158961920,2019-10-15 15:23:58.158942481,6079053,T,IEX,371.880000,71
2019-10-15 15:24:06.696361984,2019-10-15 15:24:06.696343850,6084271,T,IEX,371.800000,100
2019-10-15 15:24:22.660813056,2019-10-15 15:24:22.660793529,6095450,T,IEX,371.940000,2
2019-10-15 15:25:14.520728064,2019-10-15 15:25:14.520706217,6132021,T,IEX,371.930000,100
2019-10-15 15:25:14.520815104,2019-10-15 15:25:14.520796522,6132024,T,IEX,371.930000,100
2019-10-15 15:25:14.521007104,2019-10-15 15:25:14.520988519,6132031,T,IEX,371.930000,100
2019-10-15 15:25:37.420493056,2019-10-15 15:25:37.420470188,6148423,T,IEX,372.000000,100
2019-10-15 15:25:40.355149056,2019-10-15 15:25:40.355128147,6152154,T,IEX,371.810000,100
2019-10-15 15:25:52.295080960,2019-10-15 15:25:52.295061955,6160562,T,IEX,371.940000,3
2019-10-15 15:25:52.301844992,2019-10-15 15:25:52.301825977,6160670,T,IEX,372.000000,100
2019-10-15 15:26:59.722714112,2019-10-15 15:26:59.722690931,6202226,T,IEX,371.900000,3
2019-10-15 15:27:23.793673984,2019-10-15 15:27:23.793654673,6217029,T,IEX,371.985000,3
2019-10-15 15:27:26.548734976,2019-10-15 15:27:26.548717029,6219603,T,IEX,371.990000,200
2019-10-15 15:28:37.504700928,2019-10-15 15:28:37.504684004,6261037,T,IEX,372.105000,3
2019-10-15 15:28:37.504719872,2019-10-15 15:28:37.504703186,6261038,T,IEX,372.105000,1
2019-10-15 15:29:55.721008896,2019-10-15 15:29:55.720898519,6314546,T,IEX,372.075000,100
2019-10-15 15:29:56.735209984,2019-10-15 15:29:56.735193521,6317742,T,IEX,372.075000,100
2019-10-15 15:29:57.527255040,2019-10-15 15:29:57.527235030,6319912,T,IEX,372.085000,100
2019-10-15 15:29:58.322950912,2019-10-15 15:29:58.322932449,6320840,T,IEX,372.080000,100
2019-10-15 15:29:58.519299072,2019-10-15 15:29:58.519277474,6321049,T,IEX,372.140000,60
2019-10-15 15:30:05.489870080,2019-10-15 15:30:05.489851710,6329908,T,IEX,372.100000,100
2019-10-15 15:30:07.53325056,2019-10-15 15:30:07.53306159,6331557,T,IEX,372.020000,1
2019-10-15 15:31:01.809228032,2019-10-15 15:31:01.809207550,6370165,T,IEX,372.060000,3
2019-10-15 15:31:52.863770880,2019-10-15 15:31:52.863750439,6396587,T,IEX,372.230000,200
2019-10-15 15:33:58.699397888,2019-10-15 15:33:58.699377365,6458125,T,IEX,372.020000,20
2019-10-15 15:34:02.553082880,2019-10-15 15:34:02.553060327,6462430,T,IEX,372.000000,100
2019-10-15 15:34:44.322675968,2019-10-15 15:34:44.322657053,6488160,T,IEX,372.030000,300
2019-10-15 15:34:46.782171904,2019-10-15 15:34:46.782150778,6489949,T,IEX,372.070000,500
2019-10-15 15:34:46.782196992,2019-10-15 15:34:46.782179226,6489950,T,IEX,372.090000,600
2019-10-15 15:34:46.785382912,2019-10-15 15:34:46.785362137,6489951,T,IEX,372.070000,500
2019-10-15 15:34:46.786393088,2019-10-15 15:34:46.786375180,6489952,T,IEX,372.070000,456
2019-10-15 15:34:47.787170048,2019-10-15 15:34:47.787151053,6490399,T,IEX,372.045000,100
2019-10-15 15:34:47.872375040,2019-10-15 15:34:47.872352974,6490636,T,IEX,372.090000,300
2019-10-15 15:34:47.873378048,2019-10-15 15:34:47.873360686,6490643,T,IEX,372.090000,1700
2019-10-15 15:34:55.654189056,2019-10-15 15:34:55.654168941,6494447,T,IEX,372.075000,100
2019-10-15 15:35:09.979450880,2019-10-15 15:35:09.979430693,6508639,T,IEX,372.000000,50
2019-10-15 15:35:17.654625024,2019-10-15 15:35:17.654605765,6515001,T,IEX,372.130000,2
2019-10-15 15:35:17.654644992,2019-10-15 15:35:17.654627027,6515002,T,IEX,372.130000,3
2019-10-15 15:35:20.9325056,2019-10-15 15:35:20.9305542,6521753,T,IEX,372.165000,200
2019-10-15 15:36:28.113344000,2019-10-15 15:36:28.113324439,6577986,T,IEX,371.900000,9
2019-10-15 15:36:33.570014976,2019-10-15 15:36:33.569994154,6583635,T,IEX,371.875000,8
2019-10-15 15:36:49.806307072,2019-10-15 15:36:49.806283807,6593466,T,IEX,371.805000,100
2019-10-15 15:36:49.806316032,2019-10-15 15:36:49.806299327,6593467,T,IEX,371.805000,100
2019-10-15 15:39:01.82618112,2019-10-15 15:39:01.82598163,6680564,T,IEX,371.600000,100
2019-10-15 15:39:19.155049984,2019-10-15 15:39:19.155027292,6692195,T,IEX,371.640000,27
2019-10-15 15:39:27.32384000,2019-10-15 15:39:27.32366260,6698002,T,IEX,371.620000,100
2019-10-15 15:39:27.776581888,2019-10-15 15:39:27.776562031,6698705,T,IEX,371.610000,100
2019-10-15 15:40:24.273011968,2019-10-15 15:40:24.272992457,6736571,T,IEX,371.795000,3
2019-10-15 15:40:27.699704064,2019-10-15 15:40:27.699683458,6738340,T,IEX,371.770000,6
2019-10-15 15:42:05.961888000,2019-10-15 15:42:05.961870635,6786203,T,IEX,371.890000,100
2019-10-15 15:42:07.412384000,2019-10-15 15:42:07.412359984,6787119,T,IEX,371.810000,99
2019-10-15 15:42:07.412397056,2019-10-15 15:42:07.412377360,6787120,T,IEX,371.810000,1
2019-10-15 15:42:07.415116032,2019-10-15 15:42:07.415095963,6787196,T,IEX,371.800000,5
2019-10-15 15:42:24.865612032,2019-10-15 15:42:24.865591072,6795230,T,IEX,371.820000,3
2019-10-15 15:42:27.767528960,2019-10-15 15:42:27.767508267,6796279,T,IEX,371.720000,100
2019-10-15 15:42:27.768602112,2019-10-15 15:42:27.768581369,6796280,T,IEX,371.720000,100
2019-10-15 15:43:08.740602880,2019-10-15 15:43:08.740582569,6812618,T,IEX,371.725000,3
2019-10-15 15:43:08.742448128,2019-10-15 15:43:08.742427660,6812619,T,IEX,371.690000,4
2019-10-15 15:44:20.197059072,2019-10-15 15:44:20.197037640,6847812,T,IEX,371.740000,3
2019-10-15 15:44:31.858707968,2019-10-15 15:44:31.858686909,6852624,T,IEX,371.620000,100
2019-10-15 15:44:31.861676032,2019-10-15 15:44:31.861658776,6852626,T,IEX,371.600000,100
2019-10-15 15:44:31.864434944,2019-10-15 15:44:31.864413278,6852632,T,IEX,371.600000,200
2019-10-15 15:44:31.872046080,2019-10-15 15:44:31.872028295,6852648,T,IEX,371.600000,100
2019-10-15 15:44:31.874401024,2019-10-15 15:44:31.874383814,6852669,T,IEX,371.540000,100
2019-10-15 15:44:32.106033920,2019-10-15 15:44:32.106013744,6852890,T,IEX,371.530000,100
2019-10-15 15:44:32.106041088,2019-10-15 15:44:32.106023574,6852891,T,IEX,371.530000,100
2019-10-15 15:44:54.91141888,2019-10-15 15:44:54.91120771,6863378,T,IEX,371.500000,200
2019-10-15 15:44:54.91319040,2019-10-15 15:44:54.91304195,6863379,T,IEX,371.495000,200
2019-10-15 15:46:29.692289024,2019-10-15 15:46:29.692268373,6911085,T,IEX,371.500000,27
2019-10-15 15:47:07.465267968,2019-10-15 15:47:07.465245545,6932671,T,IEX,371.550000,2
2019-10-15 15:47:18.224002048,2019-10-15 15:47:18.223983952,6938183,T,IEX,371.700000,1
2019-10-15 15:47:21.869533952,2019-10-15 15:47:21.869514426,6939778,T,IEX,371.635000,1
2019-10-15 15:47:25.809164032,2019-10-15 15:47:25.809147016,6941199,T,IEX,371.640000,1
2019-10-15 15:47:25.818966016,2019-10-15 15:47:25.818946108,6941206,T,IEX,371.580000,1
2019-10-15 15:49:04.236115968,2019-10-15 15:49:04.236096151,6984973,T,IEX,371.755000,1
2019-10-15 15:49:04.243592960,2019-10-15 15:49:04.243576732,6984979,T,IEX,371.755000,1
2019-10-15 15:49:14.394379008,2019-10-15 15:49:14.394358702,6991352,T,IEX,371.835000,1
2019-10-15 15:49:16.743280896,2019-10-15 15:49:16.743264199,6992723,T,IEX,371.845000,1
2019-10-15 15:49:19.524978944,2019-10-15 15:49:19.524959634,6994442,T,IEX,371.795000,1
2019-10-15 15:49:25.869575936,2019-10-15 15:49:25.869557112,6999543,T,IEX,371.740000,1
2019-10-15 15:49:40.289193984,2019-10-15 15:49:40.289174866,7006831,T,IEX,371.800000,103
2019-10-15 15:50:48.762810880,2019-10-15 15:50:48.762790828,7041462,T,IEX,371.990000,1
2019-10-15 15:50:48.830192896,2019-10-15 15:50:48.830172696,7041487,T,IEX,371.985000,6
2019-10-15 15:50:55.15386112,2019-10-15 15:50:55.15366271,7045107,T,IEX,371.955000,1
2019-10-15 15:51:25.954622976,2019-10-15 15:51:25.954606832,7058581,T,IEX,371.940000,1
2019-10-15 15:51:29.688903936,2019-10-15 15:51:29.688882857,7059796,T,IEX,371.915000,1
2019-10-15 15:51:38.572946944,2019-10-15 15:51:38.572922801,7063375,T,IEX,371.910000,1
2019-10-15 15:52:26.316683008,2019-10-15 15:52:26.316667041,7083027,T,IEX,371.920000,100
2019-10-15 15:52:59.904258048,2019-10-15 15:52:59.904233389,7098046,T,IEX,371.950000,6
2019-10-15 15:54:11.644752896,2019-10-15 15:54:11.644732470,7129699,T,IEX,371.975000,100
2019-10-15 15:54:22.800284928,2019-10-15 15:54:22.800264177,7135346,T,IEX,372.035000,2
2019-10-15 15:54:26.90217984,2019-10-15 15:54:26.90196725,7136505,T,IEX,372.040000,6
2019-10-15 15:54:36.34331904,2019-10-15 15:54:36.34315164,7139939,T,IEX,371.960000,10
2019-10-15 15:54:57.219191040,2019-10-15 15:54:57.219169892,7149617,T,IEX,371.980000,2
2019-10-15 15:55:09.754262016,2019-10-15 15:55:09.754234563,7158328,T,IEX,371.950000,7
2019-10-15 15:55:21.267289088,2019-10-15 15:55:21.267270946,7165927,T,IEX,371.830000,100
2019-10-15 15:56:13.445905920,2019-10-15 15:56:13.445882765,7190252,T,IEX,372.050000,92
2019-10-15 15:57:26.191571968,2019-10-15 15:57:26.191550511,7227028,T,IEX,372.180000,1
2019-10-15 15:57:26.234688000,2019-10-15 15:57:26.234671649,7227093,T,IEX,372.130000,100
2019-10-15 15:57:28.221125120,2019-10-15 15:57:28.221054887,7228534,T,IEX,372.140000,1
2019-10-15 15:58:00.666085120,2019-10-15 15:58:00.666065270,7242398,T,IEX,372.090000,1
2019-10-15 16:00:00.848512000,2019-10-15 16:00:00.848490154,7294753,T,IEX,372.210000,2
2019-10-15 16:00:03.185971968,2019-10-15 16:00:03.185954667,7296751,T,IEX,372.160000,1
2019-10-15 16:00:25.619824896,2019-10-15 16:00:25.619803198,7308488,T,IEX,372.220000,100
2019-10-15 16:00:26.357630976,2019-10-15 16:00:26.357612197,7308840,T,IEX,372.180000,65
2019-10-15 16:00:26.357648896,2019-10-15 16:00:26.357632157,7308841,T,IEX,372.180000,3
2019-10-15 16:00:32.758834944,2019-10-15 16:00:32.758815333,7310907,T,IEX,372.150000,2
2019-10-15 16:00:32.859612928,2019-10-15 16:00:32.859596222,7310934,T,IEX,372.105000,100
2019-10-15 16:00:32.859668992,2019-10-15 16:00:32.859651244,7310935,T,IEX,372.105000,100
2019-10-15 16:00:32.878637056,2019-10-15 16:00:32.878615616,7310949,T,IEX,372.100000,100
2019-10-15 16:00:32.957490944,2019-10-15 16:00:32.957470128,7310975,T,IEX,372.020000,100
2019-10-15 16:00:33.67735040,2019-10-15 16:00:33.67712848,7311038,T,IEX,372.040000,100
2019-10-15 16:00:33.160321024,2019-10-15 16:00:33.160304655,7311079,T,IEX,372.000000,1
2019-10-15 16:00:33.167630080,2019-10-15 16:00:33.167608744,7311087,T,IEX,372.000000,1
2019-10-15 16:00:33.261961984,2019-10-15 16:00:33.261943832,7311166,T,IEX,371.920000,1
2019-10-15 16:01:15.775770112,2019-10-15 16:01:15.775748962,7330175,T,IEX,371.975000,1
2019-10-15 16:01:42.704869120,2019-10-15 16:01:42.704851078,7341204,T,IEX,371.835000,1
2019-10-15 16:02:26.464717056,2019-10-15 16:02:26.464692157,7363406,T,IEX,371.955000,1
2019-10-15 16:03:26.497396992,2019-10-15 16:03:26.497375285,7391261,T,IEX,372.175000,1
2019-10-15 16:04:01.800239104,2019-10-15 16:04:01.800219336,7405268,T,IEX,372.310000,100
2019-10-15 16:04:01.800252928,2019-10-15 16:04:01.800236562,7405269,T,IEX,372.310000,100
2019-10-15 16:04:11.605495040,2019-10-15 16:04:11.605472690,7410552,T,IEX,372.250000,6
2019-10-15 16:04:13.608599040,2019-10-15 16:04:13.608581021,7411113,T,IEX,372.250000,4
2019-10-15 16:04:13.618475008,2019-10-15 16:04:13.618455771,7411125,T,IEX,372.250000,1
2019-10-15 16:04:26.494088960,2019-10-15 16:04:26.494068335,7416905,T,IEX,372.390000,100
2019-10-15 16:04:26.494099968,2019-10-15 16:04:26.494081344,7416906,T,IEX,372.400000,100
2019-10-15 16:04:26.494117888,2019-10-15 16:04:26.494101213,7416907,T,IEX,372.450000,400
2019-10-15 16:04:26.494131968,2019-10-15 16:04:26.494115436,7416908,T,IEX,372.450000,100
2019-10-15 16:04:26.544529920,2019-10-15 16:04:26.544515257,7416942,T,IEX,372.440000,1
2019-10-15 16:04:26.928619008,2019-10-15 16:04:26.928598239,7417094,T,IEX,372.390000,3
2019-10-15 16:04:29.446995968,2019-10-15 16:04:29.446977222,7418236,T,IEX,372.300000,100
2019-10-15 16:04:29.447005952,2019-10-15 16:04:29.446989772,7418237,T,IEX,372.300000,100
2019-10-15 16:04:34.115742976,2019-10-15 16:04:34.115721907,7420523,T,IEX,372.325000,1
2019-10-15 16:04:35.65743872,2019-10-15 16:04:35.65725671,7421049,T,IEX,372.325000,3
2019-10-15 16:05:08.544805888,2019-10-15 16:05:08.544786036,7434809,T,IEX,372.525000,1
2019-10-15 16:05:08.573348096,2019-10-15 16:05:08.573329558,7434830,T,IEX,372.490000,44
2019-10-15 16:05:17.52320000,2019-10-15 16:05:17.52302285,7437844,T,IEX,372.430000,1
2019-10-15 16:05:17.61134080,2019-10-15 16:05:17.61112900,7437846,T,IEX,372.420000,2
2019-10-15 16:05:26.975785984,2019-10-15 16:05:26.975764676,7440978,T,IEX,372.280000,1
2019-10-15 16:06:26.857136896,2019-10-15 16:06:26.857119404,7462758,T,IEX,372.420000,1
2019-10-15 16:07:46.713893888,2019-10-15 16:07:46.713873660,7488588,T,IEX,372.485000,1
2019-10-15 16:07:55.647667968,2019-10-15 16:07:55.647647644,7491190,T,IEX,372.485000,2
2019-10-15 16:08:05.532478976,2019-10-15 16:08:05.532458615,7496830,T,IEX,372.410000,2
2019-10-15 16:08:17.683360000,2019-10-15 16:08:17.683339504,7502309,T,IEX,372.410000,1
2019-10-15 16:08:53.179741952,2019-10-15 16:08:53.179719175,7519220,T,IEX,372.445000,1
2019-10-15 16:09:42.639033088,2019-10-15 16:09:42.639013756,7538724,T,IEX,372.350000,1
2019-10-15 16:09:45.741048064,2019-10-15 16:09:45.741024075,7539869,T,IEX,372.340000,100
2019-10-15 16:09:51.575621888,2019-10-15 16:09:51.575602978,7541651,T,IEX,372.340000,1
2019-10-15 16:09:51.584737024,2019-10-15 16:09:51.584719671,7541653,T,IEX,372.330000,1
2019-10-15 16:09:53.490277120,2019-10-15 16:09:53.490256646,7542153,T,IEX,372.250000,100
2019-10-15 16:10:07.297742080,2019-10-15 16:10:07.297720644,7548434,T,IEX,372.340000,100
2019-10-15 16:10:08.894804992,2019-10-15 16:10:08.894786313,7549249,T,IEX,372.390000,1
2019-10-15 16:10:28.760456960,2019-10-15 16:10:28.760437035,7557348,T,IEX,372.330000,1
2019-10-15 16:10:32.906782976,2019-10-15 16:10:32.906763836,7560030,T,IEX,372.400000,1
2019-10-15 16:11:19.712081920,2019-10-15 16:11:19.712062822,7578578,T,IEX,372.405000,1
2019-10-15 16:11:39.298955008,2019-10-15 16:11:39.298933594,7587626,T,IEX,372.390000,1
2019-10-15 16:12:07.411836928,2019-10-15 16:12:07.411814317,7598844,T,IEX,372.500000,1
2019-10-15 16:12:07.424530944,2019-10-15 16:12:07.424509985,7598847,T,IEX,372.490000,1
2019-10-15 16:12:07.474187008,2019-10-15 16:12:07.474164791,7598858,T,IEX,372.490000,1
2019-10-15 16:12:07.886244096,2019-10-15 16:12:07.886222613,7599055,T,IEX,372.460000,100
2019-10-15 16:12:07.887283968,2019-10-15 16:12:07.887264092,7599056,T,IEX,372.460000,100
2019-10-15 16:12:07.896411904,2019-10-15 16:12:07.896391946,7599058,T,IEX,372.450000,100
2019-10-15 16:12:26.707685888,2019-10-15 16:12:26.707668926,7605341,T,IEX,372.390000,1
2019-10-15 16:12:26.987480064,2019-10-15 16:12:26.987463898,7605774,T,IEX,372.380000,100
2019-10-15 16:14:19.680333056,2019-10-15 16:14:19.680310598,7648220,T,IEX,372.460000,36
2019-10-15 16:14:19.680340992,2019-10-15 16:14:19.680323571,7648221,T,IEX,372.460000,1
2019-10-15 16:14:26.747794944,2019-10-15 16:14:26.747777678,7650535,T,IEX,372.440000,2
2019-10-15 16:14:54.312148992,2019-10-15 16:14:54.312126867,7662614,T,IEX,372.450000,1
2019-10-15 16:15:57.782447104,2019-10-15 16:15:57.782428110,7689371,T,IEX,372.500000,1
2019-10-15 16:16:10.30766080,2019-10-15 16:16:10.30737248,7693790,T,IEX,372.495000,2
2019-10-15 16:16:30.327386880,2019-10-15 16:16:30.327368105,7706284,T,IEX,372.550000,25
2019-10-15 16:16:30.384534016,2019-10-15 16:16:30.384514635,7706347,T,IEX,372.620000,1
2019-10-15 16:16:34.588738048,2019-10-15 16:16:34.588716474,7708834,T,IEX,372.575000,5
2019-10-15 16:16:40.4720896,2019-10-15 16:16:40.4703096,7711384,T,IEX,372.580000,1
2019-10-15 16:17:00.857651968,2019-10-15 16:17:00.857633664,7721262,T,IEX,372.630000,100
2019-10-15 16:17:10.314596096,2019-10-15 16:17:10.314575013,7725537,T,IEX,372.680000,1
2019-10-15 16:17:26.872481024,2019-10-15 16:17:26.872459834,7731444,T,IEX,372.635000,1
2019-10-15 16:18:26.785558016,2019-10-15 16:18:26.785537153,7761743,T,IEX,372.680000,1
2019-10-15 16:18:26.796884992,2019-10-15 16:18:26.796864782,7761747,T,IEX,372.695000,2
2019-10-15 16:18:38.927813120,2019-10-15 16:18:38.927795735,7767523,T,IEX,372.745000,1
2019-10-15 16:18:56.370433024,2019-10-15 16:18:56.370412102,7774864,T,IEX,372.740000,1
2019-10-15 16:19:19.256258048,2019-10-15 16:19:19.256242438,7783887,T,IEX,372.795000,1
2019-10-15 16:19:27.318063104,2019-10-15 16:19:27.318041378,7786166,T,IEX,372.765000,1
2019-10-15 16:20:04.532933888,2019-10-15 16:20:04.532915531,7801370,T,IEX,372.760000,1
2019-10-15 16:20:39.766821888,2019-10-15 16:20:39.766804024,7816135,T,IEX,372.730000,3
2019-10-15 16:20:59.795568128,2019-10-15 16:20:59.795547103,7823993,T,IEX,372.760000,200
2019-10-15 16:20:59.796827904,2019-10-15 16:20:59.796807745,7823995,T,IEX,372.755000,1
2019-10-15 16:20:59.826907904,2019-10-15 16:20:59.826886503,7824004,T,IEX,372.755000,1
2019-10-15 16:21:00.870883072,2019-10-15 16:21:00.870860638,7824687,T,IEX,372.700000,1
2019-10-15 16:21:01.395321088,2019-10-15 16:21:01.395305434,7825089,T,IEX,372.660000,100
2019-10-15 16:21:16.857008128,2019-10-15 16:21:16.856983912,7836419,T,IEX,372.695000,100
2019-10-15 16:21:27.966095104,2019-10-15 16:21:27.966074759,7842117,T,IEX,372.605000,1
2019-10-15 16:21:57.194437120,2019-10-15 16:21:57.194418979,7855397,T,IEX,372.740000,8
2019-10-15 16:22:26.999417088,2019-10-15 16:22:26.999400184,7869711,T,IEX,372.675000,1
2019-10-15 16:22:46.541840896,2019-10-15 16:22:46.541822424,7878690,T,IEX,372.830000,80
2019-10-15 16:22:46.637029888,2019-10-15 16:22:46.637010004,7878713,T,IEX,372.840000,1
2019-10-15 16:22:46.645007104,2019-10-15 16:22:46.644989315,7878717,T,IEX,372.840000,3
2019-10-15 16:22:56.976848896,2019-10-15 16:22:56.976828761,7882983,T,IEX,372.845000,1
2019-10-15 16:23:20.499335936,2019-10-15 16:23:20.499314864,7890238,T,IEX,372.850000,1
2019-10-15 16:23:27.51181056,2019-10-15 16:23:27.51163151,7892952,T,IEX,372.855000,1
2019-10-15 16:23:43.116785920,2019-10-15 16:23:43.116764600,7898062,T,IEX,372.820000,1
2019-10-15 16:23:44.460073984,2019-10-15 16:23:44.460055696,7898779,T,IEX,372.820000,1
2019-10-15 16:24:16.12476928,2019-10-15 16:24:16.12458428,7913118,T,IEX,372.770000,1
2019-10-15 16:24:25.989558016,2019-10-15 16:24:25.989542184,7917706,T,IEX,372.775000,200
2019-10-15 16:24:26.44039936,2019-10-15 16:24:26.44020676,7917719,T,IEX,372.710000,1
2019-10-15 16:24:26.51417088,2019-10-15 16:24:26.51398043,7917720,T,IEX,372.680000,1
2019-10-15 16:24:27.373494016,2019-10-15 16:24:27.373473319,7918165,T,IEX,372.660000,100
2019-10-15 16:24:27.373501952,2019-10-15 16:24:27.373482158,7918166,T,IEX,372.660000,100
2019-10-15 16:24:27.466659072,2019-10-15 16:24:27.466639714,7918199,T,IEX,372.660000,1
2019-10-15 16:24:30.834302976,2019-10-15 16:24:30.834281613,7919984,T,IEX,372.650000,1
2019-10-15 16:24:31.446841088,2019-10-15 16:24:31.446819588,7920215,T,IEX,372.650000,18
2019-10-15 16:25:02.558599936,2019-10-15 16:25:02.558579401,7931582,T,IEX,372.810000,1
2019-10-15 16:25:12.644699904,2019-10-15 16:25:12.644682015,7936907,T,IEX,372.795000,100
2019-10-15 16:25:27.215067904,2019-10-15 16:25:27.215046601,7943277,T,IEX,372.805000,1
2019-10-15 16:25:27.215084032,2019-10-15 16:25:27.215066205,7943278,T,IEX,372.805000,35
2019-10-15 16:26:21.266729984,2019-10-15 16:26:21.266707882,7965293,T,IEX,372.780000,4
2019-10-15 16:26:26.281458944,2019-10-15 16:26:26.281439210,7967394,T,IEX,372.765000,2
2019-10-15 16:26:33.376229120,2019-10-15 16:26:33.376208128,7969831,T,IEX,372.750000,1
2019-10-15 16:28:16.455962112,2019-10-15 16:28:16.455942123,8018997,T,IEX,372.705000,50
2019-10-15 16:29:01.710478080,2019-10-15 16:29:01.710457864,8044079,T,IEX,372.655000,1
2019-10-15 16:29:01.710490880,2019-10-15 16:29:01.710473310,8044080,T,IEX,372.655000,199
2019-10-15 16:35:20.983731968,2019-10-15 16:35:20.983713726,8197105,T,IEX,372.430000,100
2019-10-15 16:35:20.986546944,2019-10-15 16:35:20.986525432,8197107,T,IEX,372.440000,100
2019-10-15 16:36:53.290379008,2019-10-15 16:36:53.290357766,8226367,T,IEX,372.490000,1
2019-10-15 16:38:13.197872896,2019-10-15 16:38:13.197853445,8251545,T,IEX,372.490000,200
2019-10-15 16:38:15.991995904,2019-10-15 16:38:15.991972931,8252917,T,IEX,372.550000,100
2019-10-15 16:38:57.716688896,2019-10-15 16:38:57.716667253,8265395,T,IEX,372.590000,200
2019-10-15 16:39:29.71792128,2019-10-15 16:39:29.71770731,8275088,T,IEX,372.550000,1
2019-10-15 16:39:42.115432960,2019-10-15 16:39:42.115415703,8278332,T,IEX,372.420000,2
2019-10-15 16:39:58.678980096,2019-10-15 16:39:58.678962435,8285209,T,IEX,372.440000,100
2019-10-15 16:40:07.622590976,2019-10-15 16:40:07.622570348,8289846,T,IEX,372.410000,100
2019-10-15 16:40:47.470065920,2019-10-15 16:40:47.470040524,8301004,T,IEX,372.370000,1
2019-10-15 16:42:25.803557888,2019-10-15 16:42:25.803539348,8341465,T,IEX,372.280000,1
2019-10-15 16:43:48.878203904,2019-10-15 16:43:48.878185840,8368910,T,IEX,372.275000,1
2019-10-15 16:47:43.178148096,2019-10-15 16:47:43.178129117,8449370,T,IEX,371.970000,1
2019-10-15 16:47:52.618767104,2019-10-15 16:47:52.618745148,8452145,T,IEX,371.950000,91
2019-10-15 16:47:52.618809088,2019-10-15 16:47:52.618792212,8452147,T,IEX,371.950000,100
2019-10-15 16:47:52.619234048,2019-10-15 16:47:52.619217297,8452149,T,IEX,371.950000,9
2019-10-15 16:51:52.467482880,2019-10-15 16:51:52.467462354,8525833,T,IEX,372.210000,13
2019-10-15 16:51:52.468635904,2019-10-15 16:51:52.468618319,8525836,T,IEX,372.210000,7
2019-10-15 16:51:59.194662912,2019-10-15 16:51:59.194642522,8527955,T,IEX,372.210000,180
2019-10-15 16:52:34.4300032,2019-10-15 16:52:34.4281277,8539078,T,IEX,372.245000,200
2019-10-15 16:52:56.669936896,2019-10-15 16:52:56.669914627,8547771,T,IEX,372.280000,1
2019-10-15 16:55:21.794699008,2019-10-15 16:55:21.794683280,8604110,T,IEX,372.375000,1
2019-10-15 16:55:26.820887040,2019-10-15 16:55:26.820869624,8606711,T,IEX,372.390000,100
2019-10-15 16:55:26.822248960,2019-10-15 16:55:26.822228753,8606750,T,IEX,372.380000,100
2019-10-15 16:55:43.51868928,2019-10-15 16:55:43.51848947,8613692,T,IEX,372.430000,2
2019-10-15 16:59:19.945047040,2019-10-15 16:59:19.945029045,8693688,T,IEX,372.290000,100
2019-10-15 17:02:11.181956096,2019-10-15 17:02:11.181935010,8763641,T,IEX,372.220000,2
2019-10-15 17:02:54.928857088,2019-10-15 17:02:54.928835926,8779153,T,IEX,372.080000,100
2019-10-15 17:03:43.994373888,2019-10-15 17:03:43.994355446,8795276,T,IEX,372.050000,100
2019-10-15 17:04:05.880060928,2019-10-15 17:04:05.880039897,8802705,T,IEX,372.160000,4
2019-10-15 17:05:29.253377024,2019-10-15 17:05:29.253356658,8827722,T,IEX,372.125000,100
2019-10-15 17:05:30.309509120,2019-10-15 17:05:30.309487087,8827913,T,IEX,372.125000,100
2019-10-15 17:07:43.226480896,2019-10-15 17:07:43.226465519,8870564,T,IEX,372.100000,1
2019-10-15 17:11:01.963340032,2019-10-15 17:11:01.963318234,8941794,T,IEX,372.065000,100
2019-10-15 17:11:03.975757056,2019-10-15 17:11:03.975734704,8942713,T,IEX,372.010000,100
2019-10-15 17:11:56.571439104,2019-10-15 17:11:56.571416903,8960066,T,IEX,371.860000,2
2019-10-15 17:12:43.437285888,2019-10-15 17:12:43.437262832,8972843,T,IEX,371.860000,100
2019-10-15 17:12:43.437367040,2019-10-15 17:12:43.437349691,8972845,T,IEX,371.860000,100
2019-10-15 17:12:43.437387008,2019-10-15 17:12:43.437369187,8972846,T,IEX,371.860000,98
2019-10-15 17:13:01.879506944,2019-10-15 17:13:01.879486584,8979089,T,IEX,371.890000,100
2019-10-15 17:13:30.533254912,2019-10-15 17:13:30.533233981,8987560,T,IEX,372.030000,75
2019-10-15 17:14:21.288796928,2019-10-15 17:14:21.288778879,9005403,T,IEX,371.960000,1
2019-10-15 17:19:08.962279936,2019-10-15 17:19:08.962258496,9092898,T,IEX,371.995000,2
2019-10-15 17:20:11.559036928,2019-10-15 17:20:11.559017551,9108660,T,IEX,372.170000,100
2019-10-15 17:20:21.348569088,2019-10-15 17:20:21.348548447,9113398,T,IEX,372.150000,100
2019-10-15 17:20:22.949934080,2019-10-15 17:20:22.949914659,9114109,T,IEX,372.125000,1
2019-10-15 17:20:29.735062016,2019-10-15 17:20:29.735036942,9115971,T,IEX,372.130000,100
2019-10-15 17:20:43.556292096,2019-10-15 17:20:43.556271776,9122887,T,IEX,372.215000,14
2019-10-15 17:21:05.601166080,2019-10-15 17:21:05.601143891,9129951,T,IEX,372.170000,4
2019-10-15 17:25:04.472652032,2019-10-15 17:25:04.472634228,9220392,T,IEX,371.770000,73
2019-10-15 17:25:04.472896000,2019-10-15 17:25:04.472877900,9220406,T,IEX,371.770000,27
2019-10-15 17:25:11.286616064,2019-10-15 17:25:11.286595215,9224197,T,IEX,371.740000,100
2019-10-15 17:25:11.300455936,2019-10-15 17:25:11.300437012,9224204,T,IEX,371.680000,54
2019-10-15 17:27:26.109972992,2019-10-15 17:27:26.109955206,9277517,T,IEX,371.940000,125
2019-10-15 17:38:21.551153920,2019-10-15 17:38:21.551132219,9495973,T,IEX,371.900000,100
2019-10-15 17:39:54.375947008,2019-10-15 17:39:54.375926377,9527153,T,IEX,371.930000,100
2019-10-15 17:40:44.947068928,2019-10-15 17:40:44.947047140,9547462,T,IEX,371.780000,186
2019-10-15 17:42:43.907499008,2019-10-15 17:42:43.907482745,9590058,T,IEX,371.670000,2
2019-10-15 17:43:03.208089088,2019-10-15 17:43:03.208071510,9596166,T,IEX,371.665000,98
2019-10-15 17:43:08.329310976,2019-10-15 17:43:08.329291628,9597661,T,IEX,371.625000,4
2019-10-15 17:43:25.5573888,2019-10-15 17:43:25.5555095,9602378,T,IEX,371.625000,2
2019-10-15 17:43:36.81840896,2019-10-15 17:43:36.81820265,9605185,T,IEX,371.585000,36
2019-10-15 17:44:55.73584128,2019-10-15 17:44:55.73562860,9625641,T,IEX,371.575000,10
2019-10-15 17:44:58.156688896,2019-10-15 17:44:58.156672883,9626505,T,IEX,371.565000,90
2019-10-15 17:44:58.374187008,2019-10-15 17:44:58.374164132,9626608,T,IEX,371.565000,10
2019-10-15 17:45:16.190529024,2019-10-15 17:45:16.190508138,9634748,T,IEX,371.565000,100
2019-10-15 17:45:21.875528960,2019-10-15 17:45:21.875505396,9636432,T,IEX,371.565000,100
2019-10-15 17:45:28.787332096,2019-10-15 17:45:28.787310065,9638385,T,IEX,371.565000,100
2019-10-15 17:45:45.132813056,2019-10-15 17:45:45.132790676,9644365,T,IEX,371.545000,100
2019-10-15 17:45:55.711258112,2019-10-15 17:45:55.711229711,9654491,T,IEX,371.540000,32
2019-10-15 17:47:06.542117120,2019-10-15 17:47:06.542098375,9682150,T,IEX,371.540000,29
2019-10-15 17:47:29.792800000,2019-10-15 17:47:29.792778410,9689786,T,IEX,371.560000,21
2019-10-15 17:47:44.197401088,2019-10-15 17:47:44.197383948,9694104,T,IEX,371.540000,25
2019-10-15 17:47:44.199196928,2019-10-15 17:47:44.199179325,9694107,T,IEX,371.540000,29
2019-10-15 17:47:44.200901120,2019-10-15 17:47:44.200879476,9694108,T,IEX,371.540000,29
2019-10-15 17:47:44.202607104,2019-10-15 17:47:44.202588922,9694111,T,IEX,371.540000,29
2019-10-15 17:49:19.196584960,2019-10-15 17:49:19.196566487,9722137,T,IEX,371.540000,59
2019-10-15 17:49:44.203264000,2019-10-15 17:49:44.203244712,9728816,T,IEX,371.540000,50
2019-10-15 17:49:44.303254016,2019-10-15 17:49:44.303234706,9728874,T,IEX,371.500000,100
2019-10-15 17:50:58.191060992,2019-10-15 17:50:58.191043444,9754904,T,IEX,371.495000,200
2019-10-15 17:50:58.191079936,2019-10-15 17:50:58.191063238,9754905,T,IEX,371.550000,100
2019-10-15 17:50:58.191094016,2019-10-15 17:50:58.191076536,9754906,T,IEX,371.550000,100
2019-10-15 17:50:58.191109120,2019-10-15 17:50:58.191092619,9754907,T,IEX,371.560000,100
2019-10-15 17:50:58.191128064,2019-10-15 17:50:58.191110709,9754908,T,IEX,371.580000,400
2019-10-15 17:54:39.675194112,2019-10-15 17:54:39.675174959,9831491,T,IEX,371.540000,100
2019-10-15 17:54:43.12072960,2019-10-15 17:54:43.12053305,9832590,T,IEX,371.620000,100
2019-10-15 17:57:44.981680128,2019-10-15 17:57:44.981659183,9900646,T,IEX,371.300000,5
2019-10-15 17:59:28.814660096,2019-10-15 17:59:28.814638226,9932601,T,IEX,371.305000,200
2019-10-15 17:59:28.831325952,2019-10-15 17:59:28.831309651,9932621,T,IEX,371.305000,100
2019-10-15 17:59:44.779682048,2019-10-15 17:59:44.779660293,9938692,T,IEX,371.310000,100
2019-10-15 18:00:47.539324928,2019-10-15 18:00:47.539302343,9964449,T,IEX,371.290000,100
2019-10-15 18:04:03.493426944,2019-10-15 18:04:03.493406372,10035420,T,IEX,371.440000,100
2019-10-15 18:04:39.423291904,2019-10-15 18:04:39.423273851,10047216,T,IEX,371.450000,100
2019-10-15 18:04:44.933615104,2019-10-15 18:04:44.933594820,10048928,T,IEX,371.450000,100
2019-10-15 18:05:41.344988928,2019-10-15 18:05:41.344967394,10082478,T,IEX,371.450000,100
2019-10-15 18:08:28.89350912,2019-10-15 18:08:28.89329727,10143648,T,IEX,371.580000,100
2019-10-15 18:08:29.596740096,2019-10-15 18:08:29.596721878,10144066,T,IEX,371.635000,100
2019-10-15 18:10:18.341143040,2019-10-15 18:10:18.341123573,10177591,T,IEX,371.910000,100
2019-10-15 18:10:18.341154048,2019-10-15 18:10:18.341136280,10177592,T,IEX,371.930000,100
2019-10-15 18:10:18.341174016,2019-10-15 18:10:18.341155990,10177593,T,IEX,371.950000,100
2019-10-15 18:10:18.341189888,2019-10-15 18:10:18.341172613,10177594,T,IEX,371.950000,100
2019-10-15 18:10:32.159704064,2019-10-15 18:10:32.159683462,10181292,T,IEX,372.020000,100
2019-10-15 18:11:31.924702976,2019-10-15 18:11:31.924679631,10202195,T,IEX,372.085000,200
2019-10-15 18:11:34.929134080,2019-10-15 18:11:34.929115164,10202874,T,IEX,372.025000,1
2019-10-15 18:11:37.645818112,2019-10-15 18:11:37.645798393,10204047,T,IEX,371.950000,100
2019-10-15 18:12:39.246462976,2019-10-15 18:12:39.246437666,10225159,T,IEX,372.000000,100
2019-10-15 18:18:36.195905024,2019-10-15 18:18:36.195883461,10337033,T,IEX,371.705000,100
2019-10-15 18:18:43.401609984,2019-10-15 18:18:43.401593040,10342844,T,IEX,371.805000,100
2019-10-15 18:27:04.390071040,2019-10-15 18:27:04.390049577,10507714,T,IEX,371.780000,100
2019-10-15 18:30:31.374512896,2019-10-15 18:30:31.374493787,10588456,T,IEX,371.450000,200
2019-10-15 18:34:44.191761920,2019-10-15 18:34:44.191739901,10685923,T,IEX,371.570000,200
2019-10-15 18:35:26.716466944,2019-10-15 18:35:26.716450211,10700185,T,IEX,371.570000,6
2019-10-15 18:35:26.717003008,2019-10-15 18:35:26.716986841,10700187,T,IEX,371.510000,35
2019-10-15 18:36:48.557957120,2019-10-15 18:36:48.557938965,10725419,T,IEX,371.620000,100
2019-10-15 18:36:58.707609088,2019-10-15 18:36:58.707591794,10728461,T,IEX,371.615000,100
2019-10-15 18:36:59.710042112,2019-10-15 18:36:59.710022121,10728674,T,IEX,371.620000,100
2019-10-15 18:37:00.708759040,2019-10-15 18:37:00.708741786,10729069,T,IEX,371.620000,100
2019-10-15 18:37:01.710053120,2019-10-15 18:37:01.710034160,10729469,T,IEX,371.615000,100
2019-10-15 18:37:02.709400064,2019-10-15 18:37:02.709378344,10729959,T,IEX,371.615000,100
2019-10-15 18:37:03.707715072,2019-10-15 18:37:03.707694358,10730232,T,IEX,371.615000,100
2019-10-15 18:37:04.707248896,2019-10-15 18:37:04.707231631,10730520,T,IEX,371.615000,100
2019-10-15 18:37:05.707674112,2019-10-15 18:37:05.707656826,10730691,T,IEX,371.615000,100
2019-10-15 18:37:10.913938944,2019-10-15 18:37:10.913917529,10733630,T,IEX,371.640000,118
2019-10-15 18:37:20.347607040,2019-10-15 18:37:20.347586648,10736338,T,IEX,371.640000,100
2019-10-15 18:37:20.349651968,2019-10-15 18:37:20.349632905,10736340,T,IEX,371.640000,100
2019-10-15 18:37:38.976580096,2019-10-15 18:37:38.976555653,10741074,T,IEX,371.585000,100
2019-10-15 18:37:38.977501952,2019-10-15 18:37:38.977482188,10741075,T,IEX,371.585000,100
2019-10-15 18:37:38.978468096,2019-10-15 18:37:38.978448722,10741076,T,IEX,371.585000,100
2019-10-15 18:37:53.288591872,2019-10-15 18:37:53.288570019,10745895,T,IEX,371.570000,100
2019-10-15 18:38:04.462284032,2019-10-15 18:38:04.462268014,10749449,T,IEX,371.500000,100
2019-10-15 18:38:09.654362880,2019-10-15 18:38:09.654340013,10751627,T,IEX,371.540000,94
2019-10-15 18:39:26.777920000,2019-10-15 18:39:26.777900422,10777486,T,IEX,371.480000,95
2019-10-15 18:40:17.437905920,2019-10-15 18:40:17.437886926,10796919,T,IEX,371.530000,40
2019-10-15 18:40:28.32077056,2019-10-15 18:40:28.32056375,10800334,T,IEX,371.500000,66
2019-10-15 18:41:05.454958080,2019-10-15 18:41:05.454935487,10813044,T,IEX,371.440000,92
2019-10-15 18:41:05.455105024,2019-10-15 18:41:05.455086493,10813046,T,IEX,371.440000,8
2019-10-15 18:41:48.324734976,2019-10-15 18:41:48.324714689,10825734,T,IEX,371.580000,100
2019-10-15 18:42:45.575418880,2019-10-15 18:42:45.575401291,10853222,T,IEX,371.550000,100
2019-10-15 18:45:07.467802880,2019-10-15 18:45:07.467782531,10895244,T,IEX,371.665000,1
2019-10-15 18:45:51.589042944,2019-10-15 18:45:51.589020924,10913143,T,IEX,371.550000,10
2019-10-15 18:48:27.113466880,2019-10-15 18:48:27.113444981,10967901,T,IEX,371.455000,100
2019-10-15 18:48:37.233766912,2019-10-15 18:48:37.233746210,10970810,T,IEX,371.445000,100
2019-10-15 18:48:40.321720064,2019-10-15 18:48:40.321700985,10972348,T,IEX,371.455000,100
2019-10-15 18:53:48.884315904,2019-10-15 18:53:48.884296733,11080630,T,IEX,371.455000,100
2019-10-15 18:54:03.119664128,2019-10-15 18:54:03.119647656,11085261,T,IEX,371.530000,100
2019-10-15 18:56:32.168317952,2019-10-15 18:56:32.168298569,11138755,T,IEX,371.465000,1
2019-10-15 19:06:00.505698048,2019-10-15 19:06:00.505680052,11382298,T,IEX,371.315000,2
2019-10-15 19:09:17.515448064,2019-10-15 19:09:17.515429852,11448767,T,IEX,371.205000,19
2019-10-15 19:09:18.897592064,2019-10-15 19:09:18.897576003,11449375,T,IEX,371.180000,1
2019-10-15 19:09:39.220143104,2019-10-15 19:09:39.220122150,11457352,T,IEX,371.180000,100
2019-10-15 19:09:40.989230080,2019-10-15 19:09:40.989213447,11457853,T,IEX,371.160000,1
2019-10-15 19:11:01.735713024,2019-10-15 19:11:01.735690219,11487234,T,IEX,371.075000,16
2019-10-15 19:11:28.520561920,2019-10-15 19:11:28.520540087,11493846,T,IEX,371.080000,100
2019-10-15 19:11:52.558461952,2019-10-15 19:11:52.558446091,11501326,T,IEX,371.035000,100
2019-10-15 19:12:35.520807936,2019-10-15 19:12:35.520787133,11518149,T,IEX,371.080000,90
2019-10-15 19:12:47.392359936,2019-10-15 19:12:47.392339656,11522231,T,IEX,371.080000,10
2019-10-15 19:15:00.11926016,2019-10-15 19:15:00.11906915,11564222,T,IEX,371.140000,29
2019-10-15 19:15:44.387030016,2019-10-15 19:15:44.387008032,11588823,T,IEX,371.200000,100
2019-10-15 19:16:26.241186048,2019-10-15 19:16:26.241166464,11603578,T,IEX,371.280000,100
2019-10-15 19:17:47.548871936,2019-10-15 19:17:47.548856704,11635598,T,IEX,371.330000,100
2019-10-15 19:17:47.557967872,2019-10-15 19:17:47.557951225,11635602,T,IEX,371.340000,15
2019-10-15 19:20:31.144659968,2019-10-15 19:20:31.144641258,11688662,T,IEX,371.180000,100
2019-10-15 19:20:31.144775936,2019-10-15 19:20:31.144753663,11688669,T,IEX,371.210000,32
2019-10-15 19:20:31.144924928,2019-10-15 19:20:31.144905348,11688679,T,IEX,371.210000,68
2019-10-15 19:21:39.611077120,2019-10-15 19:21:39.611055272,11713330,T,IEX,371.205000,100
2019-10-15 19:25:34.102929920,2019-10-15 19:25:34.102908428,11797536,T,IEX,371.020000,100
2019-10-15 19:25:34.683640064,2019-10-15 19:25:34.683621509,11797786,T,IEX,371.030000,200
2019-10-15 19:25:34.684686080,2019-10-15 19:25:34.684664843,11797787,T,IEX,371.030000,200
2019-10-15 19:25:34.685485056,2019-10-15 19:25:34.685467468,11797791,T,IEX,371.030000,100
2019-10-15 19:25:37.784611072,2019-10-15 19:25:37.784594540,11798812,T,IEX,371.035000,2
2019-10-15 19:26:58.724616960,2019-10-15 19:26:58.724600621,11836292,T,IEX,371.000000,5
2019-10-15 19:26:58.724636928,2019-10-15 19:26:58.724620609,11836293,T,IEX,371.000000,95
2019-10-15 19:27:48.106447104,2019-10-15 19:27:48.106430995,11855670,T,IEX,371.035000,100
2019-10-15 19:31:22.253999104,2019-10-15 19:31:22.253975610,11952790,T,IEX,371.080000,100
2019-10-15 19:32:49.126191104,2019-10-15 19:32:49.126172381,11999677,T,IEX,371.035000,100
2019-10-15 19:32:49.127225088,2019-10-15 19:32:49.127206904,11999685,T,IEX,371.035000,100
2019-10-15 19:32:49.133509888,2019-10-15 19:32:49.133489325,11999702,T,IEX,371.035000,200
2019-10-15 19:32:51.288487936,2019-10-15 19:32:51.288470676,12000769,T,IEX,371.035000,2
2019-10-15 19:33:32.828879872,2019-10-15 19:33:32.828858497,12023721,T,IEX,371.140000,100
2019-10-15 19:33:32.828889088,2019-10-15 19:33:32.828871661,12023722,T,IEX,371.170000,5
2019-10-15 19:33:32.842982912,2019-10-15 19:33:32.842964615,12023749,T,IEX,371.120000,100
2019-10-15 19:33:32.854432000,2019-10-15 19:33:32.854416674,12023766,T,IEX,371.120000,20
2019-10-15 19:33:41.255141888,2019-10-15 19:33:41.255124585,12031167,T,IEX,371.220000,70
2019-10-15 19:33:48.684339968,2019-10-15 19:33:48.684318751,12035766,T,IEX,371.130000,100
2019-10-15 19:33:50.211860992,2019-10-15 19:33:50.211838321,12036626,T,IEX,371.100000,100
2019-10-15 19:38:03.399973888,2019-10-15 19:38:03.399953668,12171062,T,IEX,371.220000,100
2019-10-15 19:40:19.537342976,2019-10-15 19:40:19.537320159,12237320,T,IEX,371.035000,300
2019-10-15 19:40:19.541541888,2019-10-15 19:40:19.541522479,12237324,T,IEX,371.050000,500
2019-10-15 19:40:23.648171008,2019-10-15 19:40:23.648154757,12239446,T,IEX,371.065000,1
2019-10-15 19:40:47.808029952,2019-10-15 19:40:47.808008152,12250508,T,IEX,371.070000,100
2019-10-15 19:41:17.779348992,2019-10-15 19:41:17.779329740,12266652,T,IEX,371.060000,100
2019-10-15 19:42:23.358644992,2019-10-15 19:42:23.358622745,12298689,T,IEX,370.990000,200
2019-10-15 19:42:26.106654976,2019-10-15 19:42:26.106633939,12299869,T,IEX,370.930000,10
2019-10-15 19:44:59.769797888,2019-10-15 19:44:59.769781959,12381841,T,IEX,370.740000,200
2019-10-15 19:46:48.519021056,2019-10-15 19:46:48.519003018,12453323,T,IEX,370.775000,2
2019-10-15 19:47:29.155708928,2019-10-15 19:47:29.155687475,12478231,T,IEX,370.840000,63
2019-10-15 19:50:00.4142080,2019-10-15 19:50:00.4122875,12583977,T,IEX,370.755000,100
2019-10-15 19:50:42.490171904,2019-10-15 19:50:42.490150053,12622306,T,IEX,370.850000,148
2019-10-15 19:50:48.637356032,2019-10-15 19:50:48.637333723,12625631,T,IEX,370.850000,100
2019-10-15 19:50:48.637617920,2019-10-15 19:50:48.637601891,12625632,T,IEX,370.850000,200
2019-10-15 19:51:59.7985920,2019-10-15 19:51:59.7967893,12668957,T,IEX,370.945000,11
2019-10-15 19:52:33.4560896,2019-10-15 19:52:33.4542688,12694998,T,IEX,370.870000,75
2019-10-15 19:52:33.20957952,2019-10-15 19:52:33.20938266,12695117,T,IEX,370.870000,25
2019-10-15 19:52:56.934894080,2019-10-15 19:52:56.934875738,12711798,T,IEX,370.870000,100
2019-10-15 19:53:07.810842112,2019-10-15 19:53:07.810823694,12718949,T,IEX,370.880000,100
2019-10-15 19:53:20.240199936,2019-10-15 19:53:20.240181999,12728461,T,IEX,370.870000,100
2019-10-15 19:53:23.494829056,2019-10-15 19:53:23.494808709,12730545,T,IEX,370.870000,6
2019-10-15 19:53:36.563536896,2019-10-15 19:53:36.563497257,12738135,T,IEX,370.970000,100
2019-10-15 19:53:43.94387968,2019-10-15 19:53:43.94371175,12746751,T,IEX,370.935000,100
2019-10-15 19:53:48.197957888,2019-10-15 19:53:48.197938051,12751050,T,IEX,370.890000,2
2019-10-15 19:54:12.204047872,2019-10-15 19:54:12.204026476,12768589,T,IEX,370.890000,2
2019-10-15 19:54:23.507020032,2019-10-15 19:54:23.507001471,12777705,T,IEX,370.905000,200
2019-10-15 19:54:23.507032064,2019-10-15 19:54:23.507014481,12777706,T,IEX,370.905000,285
2019-10-15 19:54:23.508820992,2019-10-15 19:54:23.508801684,12777708,T,IEX,370.905000,300
2019-10-15 19:54:33.986921984,2019-10-15 19:54:33.986903453,12787793,T,IEX,370.900000,107
2019-10-15 19:55:03.326543104,2019-10-15 19:55:03.326523588,12829711,T,IEX,371.120000,100
2019-10-15 19:55:08.283927040,2019-10-15 19:55:08.283905610,12840851,T,IEX,371.010000,2
2019-10-15 19:55:24.70236928,2019-10-15 19:55:24.70219348,12862572,T,IEX,371.030000,20
2019-10-15 19:55:32.200852992,2019-10-15 19:55:32.200832767,12872277,T,IEX,371.060000,21
2019-10-15 19:55:46.837804032,2019-10-15 19:55:46.837785201,12887813,T,IEX,371.040000,2
2019-10-15 19:55:46.837821952,2019-10-15 19:55:46.837804862,12887814,T,IEX,371.040000,100
2019-10-15 19:55:46.837841920,2019-10-15 19:55:46.837825435,12887815,T,IEX,371.040000,94
2019-10-15 19:56:06.680506880,2019-10-15 19:56:06.680491513,12907631,T,IEX,371.170000,11
2019-10-15 19:56:17.616922112,2019-10-15 19:56:17.616894694,12918927,T,IEX,371.160000,100
2019-10-15 19:56:38.124884992,2019-10-15 19:56:38.124867646,12938921,T,IEX,371.135000,7
2019-10-15 19:56:51.899350016,2019-10-15 19:56:51.899330687,12952319,T,IEX,371.040000,200
2019-10-15 19:56:52.257201920,2019-10-15 19:56:52.257180328,12952598,T,IEX,371.035000,200
2019-10-15 19:57:12.444199936,2019-10-15 19:57:12.444181215,12978181,T,IEX,371.050000,8
2019-10-15 19:57:14.714337024,2019-10-15 19:57:14.714319809,12981251,T,IEX,371.070000,57
2019-10-15 19:57:20.187362048,2019-10-15 19:57:20.187340436,12985712,T,IEX,371.105000,100
2019-10-15 19:57:23.49617920,2019-10-15 19:57:23.49597316,12988051,T,IEX,371.120000,39
2019-10-15 19:57:46.980324096,2019-10-15 19:57:46.980304573,13012983,T,IEX,371.150000,158
2019-10-15 19:58:21.261614080,2019-10-15 19:58:21.261593934,13055494,T,IEX,371.100000,100
2019-10-15 19:58:25.662344960,2019-10-15 19:58:25.662325133,13061150,T,IEX,371.135000,100
2019-10-15 19:58:34.456837120,2019-10-15 19:58:34.456816130,13074421,T,IEX,371.190000,1
2019-10-15 19:58:39.170291968,2019-10-15 19:58:39.170275627,13079538,T,IEX,371.150000,73
2019-10-15 19:58:43.346575104,2019-10-15 19:58:43.346550828,13084682,T,IEX,371.170000,100
2019-10-15 19:58:46.973088000,2019-10-15 19:58:46.972975914,13088382,T,IEX,371.170000,100
2019-10-15 19:59:00.284379904,2019-10-15 19:59:00.284363339,13110716,T,IEX,371.100000,100
2019-10-15 19:59:18.348785920,2019-10-15 19:59:18.348763968,13144038,T,IEX,370.915000,100
2019-10-15 19:59:25.597562880,2019-10-15 19:59:25.597547257,13155052,T,IEX,370.885000,14
2019-10-15 19:59:26.766411008,2019-10-15 19:59:26.766389586,13156811,T,IEX,370.880000,20
2019-10-15 19:59:29.606803968,2019-10-15 19:59:29.606783634,13160581,T,IEX,370.880000,30
2019-10-15 19:59:30.450844928,2019-10-15 19:59:30.450826997,13167660,T,IEX,370.920000,100
2019-10-15 19:59:34.993761024,2019-10-15 19:59:34.993718112,13195121,T,IEX,370.950000,100
2019-10-15 19:59:36.34742016,2019-10-15 19:59:36.34714947,13203446,T,IEX,370.940000,1
2019-10-15 19:59:38.265857024,2019-10-15 19:59:38.265838265,13214060,T,IEX,370.900000,33
2019-10-15 19:59:43.488658944,2019-10-15 19:59:43.488640339,13241471,T,IEX,371.010000,100
2019-10-15 19:59:44.973009920,2019-10-15 19:59:44.972852028,13250620,T,IEX,370.950000,100
2019-10-15 19:59:45.11778048,2019-10-15 19:59:45.11759062,13251227,T,IEX,370.950000,100
2019-10-15 19:59:50.227048960,2019-10-15 19:59:50.227030449,13281304,T,IEX,371.010000,14
2019-10-15 19:59:53.788465920,2019-10-15 19:59:53.788439930,13300204,T,IEX,371.000000,100
2019-10-15 19:59:53.788483072,2019-10-15 19:59:53.788454445,13300206,T,IEX,371.000000,100
2019-10-15 19:59:57.41720064,2019-10-15 19:59:57.41702822,13329030,T,IEX,371.020000,200
2019-10-15 19:59:57.396329984,2019-10-15 19:59:57.396312933,13332675,T,IEX,371.060000,12
2019-10-15 19:59:58.450714880,2019-10-15 19:59:58.450696910,13344538,T,IEX,371.020000,100
