2019-10-17 13:30:34.195354880,2019-10-17 13:30:34.195326217,167212,T,IEX,117.250000,1
2019-10-17 13:30:34.295727104,2019-10-17 13:30:34.295702458,167314,T,IEX,117.260000,99
2019-10-17 13:31:00.737815040,2019-10-17 13:31:00.737788881,200064,T,IEX,117.210000,1
2019-10-17 13:31:00.737863936,2019-10-17 13:31:00.737842715,200066,T,IEX,117.160000,100
2019-10-17 13:31:00.737914880,2019-10-17 13:31:00.737893557,200067,T,IEX,117.160000,100
2019-10-17 13:31:07.978372096,2019-10-17 13:31:07.978351403,210259,T,IEX,117.120000,2
2019-10-17 13:31:07.978425088,2019-10-17 13:31:07.978403758,210260,T,IEX,117.120000,1
2019-10-17 13:31:26.686551040,2019-10-17 13:31:26.686528071,230527,T,IEX,117.170000,100
2019-10-17 13:32:51.390089984,2019-10-17 13:32:51.390066018,323653,T,IEX,117.160000,100
2019-10-17 13:33:28.700162048,2019-10-17 13:33:28.700141482,377275,T,IEX,117.530000,100
2019-10-17 13:33:28.701233920,2019-10-17 13:33:28.701214750,377278,T,IEX,117.530000,100
2019-10-17 13:33:38.158707968,2019-10-17 13:33:38.158689060,390641,T,IEX,117.480000,1
2019-10-17 13:33:47.678289920,2019-10-17 13:33:47.678268412,402462,T,IEX,117.360000,100
2019-10-17 13:34:30.352770048,2019-10-17 13:34:30.352751684,461617,T,IEX,117.470000,100
2019-10-17 13:35:18.549790976,2019-10-17 13:35:18.549770540,517837,T,IEX,117.270000,100
2019-10-17 13:35:18.551006976,2019-10-17 13:35:18.550986905,517838,T,IEX,117.270000,100
2019-10-17 13:36:02.294895104,2019-10-17 13:36:02.294875029,586047,T,IEX,117.330000,100
2019-10-17 13:36:02.294940928,2019-10-17 13:36:02.294924494,586048,T,IEX,117.330000,100
2019-10-17 13:36:22.711376896,2019-10-17 13:36:22.711358066,620049,T,IEX,117.190000,100
2019-10-17 13:36:29.807907072,2019-10-17 13:36:29.807886087,628196,T,IEX,117.245000,200
2019-10-17 13:36:30.220210944,2019-10-17 13:36:30.220191385,628548,T,IEX,117.245000,200
2019-10-17 13:36:59.779440896,2019-10-17 13:36:59.779424844,661230,T,IEX,117.215000,100
2019-10-17 13:37:14.492684032,2019-10-17 13:37:14.492662558,677288,T,IEX,117.255000,100
2019-10-17 13:39:09.107229952,2019-10-17 13:39:09.107214309,801505,T,IEX,117.200000,2
2019-10-17 13:39:22.93575936,2019-10-17 13:39:22.93557749,815162,T,IEX,117.210000,100
2019-10-17 13:39:28.7406080,2019-10-17 13:39:28.7384685,822432,T,IEX,117.200000,100
2019-10-17 13:39:28.59072000,2019-10-17 13:39:28.59054872,822512,T,IEX,117.190000,300
2019-10-17 13:39:37.392214016,2019-10-17 13:39:37.392192571,832514,T,IEX,117.180000,100
2019-10-17 13:39:37.393792000,2019-10-17 13:39:37.393773390,832523,T,IEX,117.180000,100
2019-10-17 13:39:40.222507008,2019-10-17 13:39:40.222488131,835231,T,IEX,117.180000,96
2019-10-17 13:39:40.222598912,2019-10-17 13:39:40.222582816,835234,T,IEX,117.180000,204
2019-10-17 13:39:57.134081024,2019-10-17 13:39:57.134063519,849847,T,IEX,117.230000,100
2019-10-17 13:40:16.347011072,2019-10-17 13:40:16.346995088,870083,T,IEX,117.235000,3
2019-10-17 13:40:59.227809024,2019-10-17 13:40:59.227788214,908421,T,IEX,117.225000,100
2019-10-17 13:41:25.240833024,2019-10-17 13:41:25.240812249,933560,T,IEX,117.240000,100
2019-10-17 13:42:10.788139008,2019-10-17 13:42:10.788120850,978531,T,IEX,117.300000,71
2019-10-17 13:42:11.394412032,2019-10-17 13:42:11.394395406,979181,T,IEX,117.320000,100
2019-10-17 13:42:15.584485120,2019-10-17 13:42:15.584468604,982892,T,IEX,117.300000,229
2019-10-17 13:43:21.154936064,2019-10-17 13:43:21.154917300,1044633,T,IEX,117.240000,10
2019-10-17 13:43:46.570244096,2019-10-17 13:43:46.570225032,1064490,T,IEX,117.240000,100
2019-10-17 13:44:36.569105920,2019-10-17 13:44:36.569084621,1102910,T,IEX,117.215000,1
2019-10-17 13:46:17.447857920,2019-10-17 13:46:17.447838241,1209077,T,IEX,117.245000,100
2019-10-17 13:46:17.447888896,2019-10-17 13:46:17.447872753,1209078,T,IEX,117.245000,200
2019-10-17 13:47:47.319737088,2019-10-17 13:47:47.319715504,1297373,T,IEX,117.260000,100
2019-10-17 13:47:53.807772928,2019-10-17 13:47:53.807751066,1302884,T,IEX,117.250000,200
2019-10-17 13:47:53.810438912,2019-10-17 13:47:53.810420214,1302891,T,IEX,117.260000,5
2019-10-17 13:47:56.91373056,2019-10-17 13:47:56.91354038,1305248,T,IEX,117.250000,300
2019-10-17 13:47:56.93249024,2019-10-17 13:47:56.93229469,1305250,T,IEX,117.250000,700
2019-10-17 13:47:56.93273088,2019-10-17 13:47:56.93256515,1305251,T,IEX,117.250000,200
2019-10-17 13:47:56.95150080,2019-10-17 13:47:56.95129755,1305253,T,IEX,117.250000,200
2019-10-17 13:48:00.270568960,2019-10-17 13:48:00.270549843,1309261,T,IEX,117.260000,195
2019-10-17 13:49:40.960704000,2019-10-17 13:49:40.960685378,1408615,T,IEX,117.205000,1
2019-10-17 13:49:57.227058944,2019-10-17 13:49:57.227038326,1421701,T,IEX,117.150000,100
2019-10-17 13:50:34.712141056,2019-10-17 13:50:34.712124174,1463110,T,IEX,117.175000,100
2019-10-17 13:50:51.430205952,2019-10-17 13:50:51.430184157,1478598,T,IEX,117.120000,300
2019-10-17 13:51:09.956481024,2019-10-17 13:51:09.956454841,1498480,T,IEX,117.130000,100
2019-10-17 13:54:14.610723072,2019-10-17 13:54:14.610705036,1663048,T,IEX,117.115000,100
2019-10-17 13:54:26.877665024,2019-10-17 13:54:26.877649346,1672965,T,IEX,117.130000,100
2019-10-17 13:54:53.645251072,2019-10-17 13:54:53.645233207,1693721,T,IEX,117.145000,2
2019-10-17 13:54:58.794875904,2019-10-17 13:54:58.794856266,1697963,T,IEX,117.150000,100
2019-10-17 13:55:23.240958976,2019-10-17 13:55:23.240938883,1721754,T,IEX,117.180000,100
2019-10-17 13:55:45.917160960,2019-10-17 13:55:45.917139978,1743449,T,IEX,117.130000,1
2019-10-17 13:55:45.917177088,2019-10-17 13:55:45.917160599,1743450,T,IEX,117.130000,13
2019-10-17 13:58:44.745046016,2019-10-17 13:58:44.745025068,1888598,T,IEX,117.200000,100
2019-10-17 13:58:49.611467008,2019-10-17 13:58:49.611449776,1892747,T,IEX,117.200000,26
2019-10-17 13:58:49.611480064,2019-10-17 13:58:49.611463924,1892748,T,IEX,117.200000,100
2019-10-17 13:59:05.748548096,2019-10-17 13:59:05.748531505,1907724,T,IEX,117.190000,100
2019-10-17 13:59:49.81486080,2019-10-17 13:59:49.81468742,1945211,T,IEX,117.200000,100
2019-10-17 13:59:50.186085888,2019-10-17 13:59:50.186067677,1946190,T,IEX,117.200000,2
2019-10-17 14:01:04.364442880,2019-10-17 14:01:04.364424237,2019354,T,IEX,117.170000,100
2019-10-17 14:01:32.818042880,2019-10-17 14:01:32.818023490,2050368,T,IEX,117.190000,400
2019-10-17 14:02:02.846676992,2019-10-17 14:02:02.846660715,2077268,T,IEX,117.130000,100
2019-10-17 14:02:02.848805888,2019-10-17 14:02:02.848785562,2077269,T,IEX,117.130000,100
2019-10-17 14:02:11.510599936,2019-10-17 14:02:11.510582482,2085397,T,IEX,117.160000,320
2019-10-17 14:02:56.540916992,2019-10-17 14:02:56.540898875,2125967,T,IEX,117.110000,300
2019-10-17 14:03:31.340657920,2019-10-17 14:03:31.340638368,2157750,T,IEX,117.090000,100
2019-10-17 14:03:41.183017984,2019-10-17 14:03:41.182995289,2164904,T,IEX,117.110000,100
2019-10-17 14:04:36.770004992,2019-10-17 14:04:36.769985056,2206652,T,IEX,117.060000,100
2019-10-17 14:04:36.772185088,2019-10-17 14:04:36.772167010,2206655,T,IEX,117.060000,100
2019-10-17 14:04:54.870939904,2019-10-17 14:04:54.870920114,2221232,T,IEX,117.070000,2
2019-10-17 14:05:08.801200128,2019-10-17 14:05:08.801181846,2233520,T,IEX,117.080000,46
2019-10-17 14:05:25.703613952,2019-10-17 14:05:25.703598737,2248071,T,IEX,117.050000,100
2019-10-17 14:06:37.175814912,2019-10-17 14:06:37.175796902,2310042,T,IEX,117.120000,16
2019-10-17 14:07:30.626595072,2019-10-17 14:07:30.626574096,2355575,T,IEX,117.145000,1
2019-10-17 14:08:08.878125056,2019-10-17 14:08:08.878106920,2382952,T,IEX,117.090000,1
2019-10-17 14:09:15.210308096,2019-10-17 14:09:15.210288857,2436548,T,IEX,117.040000,4
2019-10-17 14:10:12.417081088,2019-10-17 14:10:12.417062173,2484880,T,IEX,117.050000,100
2019-10-17 14:10:18.667188992,2019-10-17 14:10:18.667170635,2489598,T,IEX,117.050000,100
2019-10-17 14:11:48.368350976,2019-10-17 14:11:48.368334247,2554946,T,IEX,117.000000,44
2019-10-17 14:11:48.368978944,2019-10-17 14:11:48.368960389,2554957,T,IEX,117.000000,100
2019-10-17 14:11:48.369100032,2019-10-17 14:11:48.369082488,2554963,T,IEX,117.000000,56
2019-10-17 14:12:06.764546048,2019-10-17 14:12:06.764529548,2569429,T,IEX,117.000000,100
2019-10-17 14:12:11.356352000,2019-10-17 14:12:11.356335827,2572530,T,IEX,117.010000,100
2019-10-17 14:12:36.135395072,2019-10-17 14:12:36.135378012,2591214,T,IEX,117.030000,100
2019-10-17 14:12:36.549338880,2019-10-17 14:12:36.549317825,2591401,T,IEX,117.030000,100
2019-10-17 14:12:36.684698112,2019-10-17 14:12:36.684680782,2591434,T,IEX,117.030000,100
2019-10-17 14:12:37.107055104,2019-10-17 14:12:37.107037791,2591545,T,IEX,117.030000,100
2019-10-17 14:12:37.158650112,2019-10-17 14:12:37.158631340,2591621,T,IEX,117.030000,100
2019-10-17 14:12:43.1287936,2019-10-17 14:12:43.1270377,2595996,T,IEX,117.020000,100
2019-10-17 14:12:55.391271936,2019-10-17 14:12:55.391250617,2604370,T,IEX,117.020000,9
2019-10-17 14:13:44.947523072,2019-10-17 14:13:44.947504896,2640610,T,IEX,117.010000,1
2019-10-17 14:14:10.130522880,2019-10-17 14:14:10.130502475,2657297,T,IEX,117.035000,1
2019-10-17 14:14:11.610010112,2019-10-17 14:14:11.609990294,2658217,T,IEX,117.035000,1
2019-10-17 14:14:11.616657920,2019-10-17 14:14:11.616640102,2658219,T,IEX,117.040000,2
2019-10-17 14:14:24.436823040,2019-10-17 14:14:24.436804805,2669346,T,IEX,117.085000,1
2019-10-17 14:14:24.436836096,2019-10-17 14:14:24.436820050,2669347,T,IEX,117.085000,2
2019-10-17 14:14:31.208103936,2019-10-17 14:14:31.208086719,2675907,T,IEX,117.055000,3
2019-10-17 14:14:39.591408128,2019-10-17 14:14:39.591387833,2685320,T,IEX,117.040000,100
2019-10-17 14:14:39.610192896,2019-10-17 14:14:39.610172866,2685341,T,IEX,117.040000,200
2019-10-17 14:14:42.285536000,2019-10-17 14:14:42.285518937,2687918,T,IEX,117.020000,1
2019-10-17 14:14:49.48438016,2019-10-17 14:14:49.48419151,2695278,T,IEX,117.040000,100
2019-10-17 14:15:56.210733056,2019-10-17 14:15:56.210715214,2743707,T,IEX,117.015000,200
2019-10-17 14:16:57.879632896,2019-10-17 14:16:57.879612066,2796549,T,IEX,117.070000,100
2019-10-17 14:16:57.880379904,2019-10-17 14:16:57.880361458,2796551,T,IEX,117.070000,1
2019-10-17 14:17:10.44770048,2019-10-17 14:17:10.44750216,2807441,T,IEX,117.040000,100
2019-10-17 14:17:22.842792960,2019-10-17 14:17:22.842775402,2817421,T,IEX,117.050000,100
2019-10-17 14:17:25.318916096,2019-10-17 14:17:25.318894209,2820828,T,IEX,117.050000,100
2019-10-17 14:17:30.479767040,2019-10-17 14:17:30.479748931,2825804,T,IEX,117.040000,100
2019-10-17 14:17:30.486791936,2019-10-17 14:17:30.486772634,2825807,T,IEX,117.030000,100
2019-10-17 14:17:47.78200064,2019-10-17 14:17:47.78175217,2839811,T,IEX,117.000000,100
2019-10-17 14:18:54.339729920,2019-10-17 14:18:54.339709988,2885324,T,IEX,117.050000,6
2019-10-17 14:19:12.433395968,2019-10-17 14:19:12.433374657,2896863,T,IEX,117.050000,1
2019-10-17 14:19:12.723019008,2019-10-17 14:19:12.723001163,2897017,T,IEX,117.060000,1
2019-10-17 14:19:29.670277120,2019-10-17 14:19:29.670256469,2910642,T,IEX,117.020000,2
2019-10-17 14:19:42.692208896,2019-10-17 14:19:42.692186466,2922370,T,IEX,117.035000,3
2019-10-17 14:19:42.692222976,2019-10-17 14:19:42.692206499,2922371,T,IEX,117.035000,1
2019-10-17 14:20:04.17487104,2019-10-17 14:20:04.17468849,2936416,T,IEX,117.050000,2
2019-10-17 14:20:06.416482048,2019-10-17 14:20:06.416453091,2938650,T,IEX,117.050000,1
2019-10-17 14:20:07.616463104,2019-10-17 14:20:07.616447070,2940332,T,IEX,117.060000,1
2019-10-17 14:20:09.16509952,2019-10-17 14:20:09.16491978,2942820,T,IEX,117.060000,1
2019-10-17 14:20:10.43051008,2019-10-17 14:20:10.43031024,2944207,T,IEX,117.060000,1
2019-10-17 14:20:11.718276096,2019-10-17 14:20:11.718255871,2946152,T,IEX,117.055000,20
2019-10-17 14:20:31.248456960,2019-10-17 14:20:31.248440892,2960426,T,IEX,117.045000,1
2019-10-17 14:20:31.251800064,2019-10-17 14:20:31.251780967,2960432,T,IEX,117.060000,99
2019-10-17 14:20:36.87116032,2019-10-17 14:20:36.87099479,2965639,T,IEX,117.060000,1
2019-10-17 14:20:38.651549952,2019-10-17 14:20:38.651535723,2968543,T,IEX,117.070000,100
2019-10-17 14:20:47.305993984,2019-10-17 14:20:47.305975494,2974773,T,IEX,117.060000,75
2019-10-17 14:20:48.782521088,2019-10-17 14:20:48.782505359,2976966,T,IEX,117.035000,1
2019-10-17 14:20:49.844013056,2019-10-17 14:20:49.843993988,2978562,T,IEX,117.025000,5
2019-10-17 14:20:53.737404928,2019-10-17 14:20:53.737387094,2981899,T,IEX,117.030000,75
2019-10-17 14:21:41.157095936,2019-10-17 14:21:41.157074253,3018980,T,IEX,117.080000,100
2019-10-17 14:21:46.572180992,2019-10-17 14:21:46.572159712,3023113,T,IEX,117.090000,100
2019-10-17 14:21:46.572595968,2019-10-17 14:21:46.572579509,3023129,T,IEX,117.080000,1
2019-10-17 14:21:47.439784960,2019-10-17 14:21:47.439765422,3024830,T,IEX,117.095000,5
2019-10-17 14:22:12.532446976,2019-10-17 14:22:12.532425877,3041881,T,IEX,117.110000,100
2019-10-17 14:22:15.439218944,2019-10-17 14:22:15.439199327,3043927,T,IEX,117.100000,2
2019-10-17 14:22:33.273353984,2019-10-17 14:22:33.273334130,3055226,T,IEX,117.110000,100
2019-10-17 14:22:33.273484032,2019-10-17 14:22:33.273465908,3055232,T,IEX,117.110000,1
2019-10-17 14:22:33.439329024,2019-10-17 14:22:33.439310420,3055468,T,IEX,117.105000,2
2019-10-17 14:22:46.143777024,2019-10-17 14:22:46.143759758,3062227,T,IEX,117.120000,100
2019-10-17 14:22:53.328619008,2019-10-17 14:22:53.328595215,3067035,T,IEX,117.120000,100
2019-10-17 14:22:54.835409920,2019-10-17 14:22:54.835393316,3067912,T,IEX,117.125000,1
2019-10-17 14:22:55.152990976,2019-10-17 14:22:55.152971901,3068156,T,IEX,117.125000,3
2019-10-17 14:23:21.985243904,2019-10-17 14:23:21.985225867,3087657,T,IEX,117.105000,1
2019-10-17 14:23:22.899510016,2019-10-17 14:23:22.899489620,3088265,T,IEX,117.095000,3
2019-10-17 14:23:45.622324992,2019-10-17 14:23:45.622304593,3102389,T,IEX,117.105000,1
2019-10-17 14:23:50.342060032,2019-10-17 14:23:50.342041133,3105832,T,IEX,117.110000,3
2019-10-17 14:23:50.350981888,2019-10-17 14:23:50.350964776,3105872,T,IEX,117.105000,1
2019-10-17 14:23:55.174365952,2019-10-17 14:23:55.174349005,3109836,T,IEX,117.095000,1
2019-10-17 14:23:55.726408960,2019-10-17 14:23:55.726388660,3110147,T,IEX,117.095000,100
2019-10-17 14:24:23.400466944,2019-10-17 14:24:23.400448966,3131072,T,IEX,117.110000,100
2019-10-17 14:25:17.396837888,2019-10-17 14:25:17.396819554,3178241,T,IEX,117.095000,3
2019-10-17 14:25:18.535244032,2019-10-17 14:25:18.535228660,3179142,T,IEX,117.105000,2
2019-10-17 14:25:19.671400960,2019-10-17 14:25:19.671383742,3180130,T,IEX,117.105000,1
2019-10-17 14:25:21.842612992,2019-10-17 14:25:21.842590286,3181299,T,IEX,117.115000,1
2019-10-17 14:25:25.228256000,2019-10-17 14:25:25.228235767,3183076,T,IEX,117.095000,1
2019-10-17 14:25:45.266936064,2019-10-17 14:25:45.266919849,3199280,T,IEX,117.070000,1
2019-10-17 14:25:45.295272960,2019-10-17 14:25:45.295257205,3199322,T,IEX,117.070000,1
2019-10-17 14:25:54.314521088,2019-10-17 14:25:54.314501221,3204381,T,IEX,117.070000,100
2019-10-17 14:25:54.350480896,2019-10-17 14:25:54.350456102,3204399,T,IEX,117.060000,1
2019-10-17 14:25:54.387138048,2019-10-17 14:25:54.387117425,3204411,T,IEX,117.050000,1
2019-10-17 14:25:54.982883072,2019-10-17 14:25:54.982861891,3205112,T,IEX,117.045000,1
2019-10-17 14:25:55.565135104,2019-10-17 14:25:55.565115809,3205696,T,IEX,117.040000,1
2019-10-17 14:26:00.368815104,2019-10-17 14:26:00.368794663,3210013,T,IEX,117.080000,1
2019-10-17 14:26:02.162405888,2019-10-17 14:26:02.162386788,3211291,T,IEX,117.080000,1
2019-10-17 14:26:39.802373120,2019-10-17 14:26:39.802352272,3239364,T,IEX,117.085000,2
2019-10-17 14:26:47.680136960,2019-10-17 14:26:47.680118300,3244315,T,IEX,117.090000,2
2019-10-17 14:26:48.242082048,2019-10-17 14:26:48.242062714,3244858,T,IEX,117.085000,1
2019-10-17 14:26:57.482690048,2019-10-17 14:26:57.482671091,3250062,T,IEX,117.090000,1
2019-10-17 14:26:57.821758976,2019-10-17 14:26:57.821740687,3250713,T,IEX,117.110000,1
2019-10-17 14:27:31.69025024,2019-10-17 14:27:31.69006967,3278820,T,IEX,117.120000,1
2019-10-17 14:27:32.468982016,2019-10-17 14:27:32.468959465,3279749,T,IEX,117.120000,3
2019-10-17 14:27:45.741623040,2019-10-17 14:27:45.741606088,3292051,T,IEX,117.105000,1
2019-10-17 14:27:47.530377984,2019-10-17 14:27:47.530357687,3293374,T,IEX,117.105000,1
2019-10-17 14:27:49.359529984,2019-10-17 14:27:49.359513683,3296801,T,IEX,117.105000,1
2019-10-17 14:27:49.368641024,2019-10-17 14:27:49.368623801,3296864,T,IEX,117.105000,1
2019-10-17 14:27:54.204211968,2019-10-17 14:27:54.204195129,3303813,T,IEX,117.140000,1
2019-10-17 14:27:57.238060032,2019-10-17 14:27:57.238036115,3307167,T,IEX,117.155000,1
2019-10-17 14:28:05.665634048,2019-10-17 14:28:05.665616099,3314540,T,IEX,117.170000,1
2019-10-17 14:28:15.733110016,2019-10-17 14:28:15.733091005,3323479,T,IEX,117.195000,1
2019-10-17 14:28:17.772179968,2019-10-17 14:28:17.772161337,3324879,T,IEX,117.185000,1
2019-10-17 14:28:20.602470912,2019-10-17 14:28:20.602449532,3327422,T,IEX,117.175000,1
2019-10-17 14:28:31.676984064,2019-10-17 14:28:31.676964094,3337824,T,IEX,117.180000,1
2019-10-17 14:28:33.620048896,2019-10-17 14:28:33.620030122,3339593,T,IEX,117.200000,30
2019-10-17 14:28:44.711197952,2019-10-17 14:28:44.711180283,3349500,T,IEX,117.190000,100
2019-10-17 14:28:55.468273920,2019-10-17 14:28:55.468254085,3357361,T,IEX,117.180000,1
2019-10-17 14:29:05.786618112,2019-10-17 14:29:05.786597160,3372061,T,IEX,117.170000,100
2019-10-17 14:30:54.626766080,2019-10-17 14:30:54.626744822,3459255,T,IEX,117.265000,137
2019-10-17 14:30:54.657298944,2019-10-17 14:30:54.657279577,3459309,T,IEX,117.260000,1
2019-10-17 14:31:10.778856960,2019-10-17 14:31:10.778839822,3472034,T,IEX,117.240000,100
2019-10-17 14:33:30.47547904,2019-10-17 14:33:30.47530416,3577574,T,IEX,117.290000,100
2019-10-17 14:33:44.958631936,2019-10-17 14:33:44.958616009,3587120,T,IEX,117.310000,100
2019-10-17 14:34:21.11110912,2019-10-17 14:34:21.11094854,3614970,T,IEX,117.300000,5
2019-10-17 14:34:22.251863040,2019-10-17 14:34:22.251843257,3615592,T,IEX,117.295000,100
2019-10-17 14:34:22.450919936,2019-10-17 14:34:22.450899647,3615752,T,IEX,117.290000,100
2019-10-17 14:34:22.946512896,2019-10-17 14:34:22.946497012,3616017,T,IEX,117.285000,100
2019-10-17 14:34:55.650057984,2019-10-17 14:34:55.650038572,3640508,T,IEX,117.305000,24
2019-10-17 14:35:00.519547904,2019-10-17 14:35:00.519530902,3645338,T,IEX,117.305000,100
2019-10-17 14:35:01.60589056,2019-10-17 14:35:01.60570417,3646885,T,IEX,117.295000,41
2019-10-17 14:35:49.992989952,2019-10-17 14:35:49.992970022,3711743,T,IEX,117.340000,50
2019-10-17 14:35:57.457679872,2019-10-17 14:35:57.457658712,3719858,T,IEX,117.350000,100
2019-10-17 14:36:32.989989120,2019-10-17 14:36:32.989969753,3752884,T,IEX,117.390000,100
2019-10-17 14:37:35.875006976,2019-10-17 14:37:35.874989030,3807950,T,IEX,117.405000,331
2019-10-17 14:37:51.375042048,2019-10-17 14:37:51.375019086,3818720,T,IEX,117.440000,1
2019-10-17 14:38:37.55187968,2019-10-17 14:38:37.55164069,3860166,T,IEX,117.430000,4
2019-10-17 14:39:16.47897088,2019-10-17 14:39:16.47876113,3889685,T,IEX,117.425000,1
2019-10-17 14:39:20.369585920,2019-10-17 14:39:20.369562592,3892709,T,IEX,117.445000,4
2019-10-17 14:39:53.474777088,2019-10-17 14:39:53.474755844,3911464,T,IEX,117.465000,100
2019-10-17 14:41:34.681967104,2019-10-17 14:41:34.681944644,3978320,T,IEX,117.480000,50
2019-10-17 14:42:11.440237056,2019-10-17 14:42:11.440216168,3999581,T,IEX,117.525000,100
2019-10-17 14:43:46.770374912,2019-10-17 14:43:46.770353980,4061862,T,IEX,117.535000,100
2019-10-17 14:44:27.174306048,2019-10-17 14:44:27.174285792,4086703,T,IEX,117.545000,6
2019-10-17 14:45:06.998601984,2019-10-17 14:45:06.998586294,4113348,T,IEX,117.540000,100
2019-10-17 14:45:13.698985984,2019-10-17 14:45:13.698967919,4117237,T,IEX,117.550000,100
2019-10-17 14:45:18.93528064,2019-10-17 14:45:18.93509372,4119965,T,IEX,117.570000,100
2019-10-17 14:45:41.658697984,2019-10-17 14:45:41.658676478,4134026,T,IEX,117.595000,4
2019-10-17 14:45:57.791228928,2019-10-17 14:45:57.791208774,4150266,T,IEX,117.585000,100
2019-10-17 14:46:04.667717888,2019-10-17 14:46:04.667700062,4156189,T,IEX,117.570000,100
2019-10-17 14:46:25.330118912,2019-10-17 14:46:25.330096636,4178859,T,IEX,117.570000,100
2019-10-17 14:46:52.54215936,2019-10-17 14:46:52.54196023,4200335,T,IEX,117.570000,100
2019-10-17 14:47:24.407712000,2019-10-17 14:47:24.407693410,4225342,T,IEX,117.590000,125
2019-10-17 14:47:40.862244096,2019-10-17 14:47:40.862222242,4235389,T,IEX,117.570000,100
2019-10-17 14:47:40.862259968,2019-10-17 14:47:40.862242157,4235390,T,IEX,117.570000,1000
2019-10-17 14:47:40.956564992,2019-10-17 14:47:40.956546654,4235442,T,IEX,117.620000,100
2019-10-17 14:47:41.4317952,2019-10-17 14:47:41.4301232,4235472,T,IEX,117.640000,100
2019-10-17 14:50:00.579020032,2019-10-17 14:50:00.579002302,4370186,T,IEX,117.530000,3
2019-10-17 14:53:46.145078016,2019-10-17 14:53:46.145056258,4548790,T,IEX,117.490000,7
2019-10-17 14:54:09.567958016,2019-10-17 14:54:09.567940051,4565448,T,IEX,117.465000,100
2019-10-17 14:55:00.859906048,2019-10-17 14:55:00.859885682,4600269,T,IEX,117.400000,100
2019-10-17 14:55:06.892732928,2019-10-17 14:55:06.892714481,4605595,T,IEX,117.400000,100
2019-10-17 14:58:09.222064128,2019-10-17 14:58:09.222044294,4733365,T,IEX,117.405000,100
2019-10-17 14:59:16.890642944,2019-10-17 14:59:16.890624622,4778097,T,IEX,117.300000,100
2019-10-17 14:59:17.525777920,2019-10-17 14:59:17.525759742,4778968,T,IEX,117.280000,100
2019-10-17 14:59:17.528293120,2019-10-17 14:59:17.528277103,4778971,T,IEX,117.280000,100
2019-10-17 14:59:17.531233024,2019-10-17 14:59:17.531212777,4778972,T,IEX,117.280000,400
2019-10-17 14:59:55.458198016,2019-10-17 14:59:55.458180003,4811984,T,IEX,117.350000,6
2019-10-17 14:59:59.213176064,2019-10-17 14:59:59.213155253,4814166,T,IEX,117.340000,7
2019-10-17 15:00:09.419525888,2019-10-17 15:00:09.419506457,4839454,T,IEX,117.270000,100
2019-10-17 15:00:19.64614912,2019-10-17 15:00:19.64597538,4880963,T,IEX,117.240000,405
2019-10-17 15:00:20.162759936,2019-10-17 15:00:20.162740893,4884032,T,IEX,117.250000,100
2019-10-17 15:00:29.568377088,2019-10-17 15:00:29.568360985,4903905,T,IEX,117.315000,335
2019-10-17 15:01:07.686305024,2019-10-17 15:01:07.686285192,4958067,T,IEX,117.390000,100
2019-10-17 15:01:17.846502912,2019-10-17 15:01:17.846485587,4971276,T,IEX,117.390000,100
2019-10-17 15:01:55.77131008,2019-10-17 15:01:55.77107538,5014212,T,IEX,117.370000,100
2019-10-17 15:02:48.867748096,2019-10-17 15:02:48.867730405,5083599,T,IEX,117.390000,200
2019-10-17 15:03:57.561869056,2019-10-17 15:03:57.561848745,5146389,T,IEX,117.500000,47
2019-10-17 15:03:57.585347072,2019-10-17 15:03:57.585331060,5146699,T,IEX,117.500000,53
2019-10-17 15:03:59.188965888,2019-10-17 15:03:59.188946333,5147996,T,IEX,117.480000,1
2019-10-17 15:04:26.538405120,2019-10-17 15:04:26.538381747,5169707,T,IEX,117.540000,2
2019-10-17 15:04:57.782604032,2019-10-17 15:04:57.782584568,5191183,T,IEX,117.510000,100
2019-10-17 15:04:57.852566016,2019-10-17 15:04:57.852550698,5191698,T,IEX,117.510000,100
2019-10-17 15:05:44.304609024,2019-10-17 15:05:44.304591533,5229965,T,IEX,117.590000,500
2019-10-17 15:07:07.148544000,2019-10-17 15:07:07.148523602,5306334,T,IEX,117.580000,100
2019-10-17 15:07:14.987340032,2019-10-17 15:07:14.987319871,5313896,T,IEX,117.590000,100
2019-10-17 15:09:12.585433088,2019-10-17 15:09:12.585414999,5395874,T,IEX,117.530000,100
2019-10-17 15:09:12.592382976,2019-10-17 15:09:12.592366805,5395900,T,IEX,117.520000,100
2019-10-17 15:09:15.168526080,2019-10-17 15:09:15.168507947,5398126,T,IEX,117.500000,100
2019-10-17 15:09:17.3333888,2019-10-17 15:09:17.3314054,5401565,T,IEX,117.480000,21
2019-10-17 15:11:50.146150912,2019-10-17 15:11:50.146129588,5504634,T,IEX,117.495000,100
2019-10-17 15:11:57.939497984,2019-10-17 15:11:57.939480262,5509268,T,IEX,117.480000,100
2019-10-17 15:12:42.807020032,2019-10-17 15:12:42.807000170,5542982,T,IEX,117.510000,100
2019-10-17 15:14:04.304706048,2019-10-17 15:14:04.304688656,5596282,T,IEX,117.400000,100
2019-10-17 15:14:36.260428032,2019-10-17 15:14:36.260411500,5617261,T,IEX,117.385000,100
2019-10-17 15:16:12.600489984,2019-10-17 15:16:12.600472399,5673006,T,IEX,117.320000,100
2019-10-17 15:16:17.462660096,2019-10-17 15:16:17.462644734,5675361,T,IEX,117.300000,100
2019-10-17 15:16:30.167362048,2019-10-17 15:16:30.167345581,5681429,T,IEX,117.310000,100
2019-10-17 15:16:30.167670016,2019-10-17 15:16:30.167651295,5681431,T,IEX,117.310000,100
2019-10-17 15:16:45.24645120,2019-10-17 15:16:45.24627320,5689956,T,IEX,117.320000,100
2019-10-17 15:16:45.24806912,2019-10-17 15:16:45.24789682,5689963,T,IEX,117.320000,100
2019-10-17 15:16:45.25018880,2019-10-17 15:16:45.25001147,5689972,T,IEX,117.320000,100
2019-10-17 15:16:45.706370048,2019-10-17 15:16:45.706342361,5690385,T,IEX,117.320000,66
2019-10-17 15:16:47.138098944,2019-10-17 15:16:47.138082002,5691501,T,IEX,117.320000,100
2019-10-17 15:16:47.627185920,2019-10-17 15:16:47.627165588,5691863,T,IEX,117.320000,34
2019-10-17 15:16:58.410584064,2019-10-17 15:16:58.410565693,5697755,T,IEX,117.300000,200
2019-10-17 15:16:58.456645888,2019-10-17 15:16:58.456624592,5697794,T,IEX,117.300000,200
2019-10-17 15:17:35.330287104,2019-10-17 15:17:35.330271925,5717978,T,IEX,117.300000,200
2019-10-17 15:17:58.771166976,2019-10-17 15:17:58.771146782,5731254,T,IEX,117.320000,100
2019-10-17 15:18:14.485720064,2019-10-17 15:18:14.485693783,5740039,T,IEX,117.295000,200
2019-10-17 15:18:24.837819904,2019-10-17 15:18:24.837800611,5747831,T,IEX,117.310000,32
2019-10-17 15:18:32.259340032,2019-10-17 15:18:32.259321281,5753295,T,IEX,117.290000,200
2019-10-17 15:18:35.432937984,2019-10-17 15:18:35.432920002,5755211,T,IEX,117.290000,200
2019-10-17 15:19:12.466992128,2019-10-17 15:19:12.466971097,5777653,T,IEX,117.310000,100
2019-10-17 15:19:24.517764096,2019-10-17 15:19:24.517743475,5785134,T,IEX,117.285000,1
2019-10-17 15:19:28.331380992,2019-10-17 15:19:28.331360788,5787832,T,IEX,117.285000,100
2019-10-17 15:19:28.395756032,2019-10-17 15:19:28.395737555,5787870,T,IEX,117.280000,100
2019-10-17 15:19:28.452168960,2019-10-17 15:19:28.452146124,5787912,T,IEX,117.285000,100
2019-10-17 15:19:31.939986944,2019-10-17 15:19:31.939968339,5792085,T,IEX,117.285000,100
2019-10-17 15:19:35.474699008,2019-10-17 15:19:35.474681411,5794478,T,IEX,117.285000,100
2019-10-17 15:19:36.935077120,2019-10-17 15:19:36.935057061,5795155,T,IEX,117.290000,100
2019-10-17 15:19:36.935151104,2019-10-17 15:19:36.935126397,5795160,T,IEX,117.290000,100
2019-10-17 15:19:36.935266048,2019-10-17 15:19:36.935238848,5795169,T,IEX,117.290000,75
2019-10-17 15:19:36.935342080,2019-10-17 15:19:36.935323968,5795174,T,IEX,117.290000,100
2019-10-17 15:19:36.935457024,2019-10-17 15:19:36.935434635,5795178,T,IEX,117.290000,100
2019-10-17 15:19:36.935534080,2019-10-17 15:19:36.935513830,5795185,T,IEX,117.290000,25
2019-10-17 15:19:38.203367936,2019-10-17 15:19:38.203345717,5796311,T,IEX,117.300000,100
2019-10-17 15:20:01.232916992,2019-10-17 15:20:01.232897626,5810275,T,IEX,117.300000,100
2019-10-17 15:20:01.233117952,2019-10-17 15:20:01.233099326,5810282,T,IEX,117.300000,100
2019-10-17 15:20:03.12926976,2019-10-17 15:20:03.12909493,5812324,T,IEX,117.310000,91
2019-10-17 15:20:15.228365056,2019-10-17 15:20:15.228348156,5821132,T,IEX,117.310000,9
2019-10-17 15:20:15.936858880,2019-10-17 15:20:15.936841236,5821487,T,IEX,117.310000,100
2019-10-17 15:21:29.689181952,2019-10-17 15:21:29.689164008,5869894,T,IEX,117.320000,100
2019-10-17 15:21:31.359134976,2019-10-17 15:21:31.359114470,5870885,T,IEX,117.300000,100
2019-10-17 15:24:32.314758912,2019-10-17 15:24:32.314739686,5981201,T,IEX,117.360000,1
2019-10-17 15:24:59.360548096,2019-10-17 15:24:59.360532089,5998447,T,IEX,117.320000,100
2019-10-17 15:25:04.115461120,2019-10-17 15:25:04.115443465,6002184,T,IEX,117.320000,100
2019-10-17 15:27:02.554473984,2019-10-17 15:27:02.554455679,6070771,T,IEX,117.355000,100
2019-10-17 15:27:03.597754112,2019-10-17 15:27:03.597735725,6071578,T,IEX,117.350000,100
2019-10-17 15:28:04.647033088,2019-10-17 15:28:04.647015740,6109380,T,IEX,117.310000,100
2019-10-17 15:29:26.613312000,2019-10-17 15:29:26.613291606,6154602,T,IEX,117.305000,3
2019-10-17 15:29:44.569460992,2019-10-17 15:29:44.569444475,6163531,T,IEX,117.305000,100
2019-10-17 15:30:20.826838016,2019-10-17 15:30:20.826815001,6191017,T,IEX,117.315000,100
2019-10-17 15:30:25.237564928,2019-10-17 15:30:25.237544006,6193635,T,IEX,117.315000,100
2019-10-17 15:30:26.723343104,2019-10-17 15:30:26.723325652,6194327,T,IEX,117.315000,362
2019-10-17 15:34:58.42016000,2019-10-17 15:34:58.41996975,6382946,T,IEX,117.265000,100
2019-10-17 15:35:23.767388928,2019-10-17 15:35:23.767367968,6413511,T,IEX,117.250000,100
2019-10-17 15:35:23.769284096,2019-10-17 15:35:23.769264377,6413513,T,IEX,117.250000,100
2019-10-17 15:36:11.528040960,2019-10-17 15:36:11.528020755,6450184,T,IEX,117.245000,5
2019-10-17 15:36:21.14708992,2019-10-17 15:36:21.14688994,6456417,T,IEX,117.250000,100
2019-10-17 15:36:39.16614912,2019-10-17 15:36:39.16595072,6465126,T,IEX,117.255000,100
2019-10-17 15:36:53.115504128,2019-10-17 15:36:53.115486607,6472096,T,IEX,117.265000,100
2019-10-17 15:37:47.450157056,2019-10-17 15:37:47.450134470,6505337,T,IEX,117.270000,100
2019-10-17 15:38:15.682917888,2019-10-17 15:38:15.682898654,6517797,T,IEX,117.280000,100
2019-10-17 15:38:25.255983104,2019-10-17 15:38:25.255963883,6524082,T,IEX,117.315000,124
2019-10-17 15:38:55.896295936,2019-10-17 15:38:55.896278730,6541879,T,IEX,117.310000,100
2019-10-17 15:39:25.288409088,2019-10-17 15:39:25.288392832,6555189,T,IEX,117.315000,119
2019-10-17 15:39:29.761097984,2019-10-17 15:39:29.761080459,6556971,T,IEX,117.305000,101
2019-10-17 15:39:58.538778880,2019-10-17 15:39:58.538757833,6572406,T,IEX,117.300000,100
2019-10-17 15:40:25.303708928,2019-10-17 15:40:25.303690281,6592007,T,IEX,117.275000,120
2019-10-17 15:40:25.304901888,2019-10-17 15:40:25.304883809,6592010,T,IEX,117.275000,120
2019-10-17 15:40:25.306110976,2019-10-17 15:40:25.306093441,6592014,T,IEX,117.275000,120
2019-10-17 15:40:52.376527872,2019-10-17 15:40:52.376507712,6604787,T,IEX,117.265000,2200
2019-10-17 15:40:53.437851904,2019-10-17 15:40:53.437831794,6607648,T,IEX,117.295000,107
2019-10-17 15:40:53.438781952,2019-10-17 15:40:53.438765037,6607651,T,IEX,117.295000,133
2019-10-17 15:40:53.439717888,2019-10-17 15:40:53.439698593,6607660,T,IEX,117.295000,510
2019-10-17 15:41:25.382078976,2019-10-17 15:41:25.382057236,6627299,T,IEX,117.290000,118
2019-10-17 15:41:41.974949888,2019-10-17 15:41:41.974931255,6634785,T,IEX,117.310000,100
2019-10-17 15:41:41.975229952,2019-10-17 15:41:41.975214488,6634788,T,IEX,117.310000,100
2019-10-17 15:41:41.975269888,2019-10-17 15:41:41.975252918,6634789,T,IEX,117.310000,100
2019-10-17 15:41:41.975384064,2019-10-17 15:41:41.975366574,6634791,T,IEX,117.310000,100
2019-10-17 15:42:05.886924032,2019-10-17 15:42:05.886904635,6646069,T,IEX,117.300000,200
2019-10-17 15:42:06.722673920,2019-10-17 15:42:06.722655402,6646376,T,IEX,117.305000,100
2019-10-17 15:42:29.8097024,2019-10-17 15:42:29.8078648,6663202,T,IEX,117.260000,100
2019-10-17 15:43:34.216145920,2019-10-17 15:43:34.216124132,6727462,T,IEX,117.250000,100
2019-10-17 15:44:30.741256960,2019-10-17 15:44:30.741239736,6765733,T,IEX,117.250000,100
2019-10-17 15:47:04.627484928,2019-10-17 15:47:04.627465712,6862150,T,IEX,117.260000,79
2019-10-17 15:49:25.636532992,2019-10-17 15:49:25.636515086,6932671,T,IEX,117.200000,6
2019-10-17 15:52:10.676229888,2019-10-17 15:52:10.676204818,7024018,T,IEX,117.170000,100
2019-10-17 15:52:25.774543104,2019-10-17 15:52:25.774527837,7043119,T,IEX,117.170000,100
2019-10-17 15:52:48.974124032,2019-10-17 15:52:48.974101951,7072830,T,IEX,117.140000,1
2019-10-17 15:56:10.326927872,2019-10-17 15:56:10.326765625,7205630,T,IEX,117.190000,100
2019-10-17 15:56:10.326927872,2019-10-17 15:56:10.326765625,7205640,T,IEX,117.190000,100
2019-10-17 15:56:18.123880960,2019-10-17 15:56:18.123862990,7209151,T,IEX,117.185000,100
2019-10-17 15:58:29.364386048,2019-10-17 15:58:29.364370297,7277583,T,IEX,117.180000,100
2019-10-17 15:59:27.130462976,2019-10-17 15:59:27.130447196,7304611,T,IEX,117.180000,100
2019-10-17 15:59:33.659264000,2019-10-17 15:59:33.659249062,7308094,T,IEX,117.190000,1
2019-10-17 16:00:43.168428032,2019-10-17 16:00:43.168409459,7352295,T,IEX,117.175000,100
2019-10-17 16:00:46.81153024,2019-10-17 16:00:46.81130432,7354526,T,IEX,117.180000,318
2019-10-17 16:05:39.924939008,2019-10-17 16:05:39.924920010,7542635,T,IEX,117.130000,100
2019-10-17 16:06:40.82628096,2019-10-17 16:06:40.82606955,7572798,T,IEX,117.130000,55
2019-10-17 16:09:41.447309056,2019-10-17 16:09:41.447286635,7658475,T,IEX,117.165000,6
2019-10-17 16:09:41.449595904,2019-10-17 16:09:41.449577590,7658476,T,IEX,117.170000,100
2019-10-17 16:09:57.964668928,2019-10-17 16:09:57.964648630,7666587,T,IEX,117.180000,74
2019-10-17 16:11:57.73300992,2019-10-17 16:11:57.73280419,7723681,T,IEX,117.170000,94
2019-10-17 16:12:04.81551104,2019-10-17 16:12:04.81529423,7726403,T,IEX,117.180000,6
2019-10-17 16:12:41.500781056,2019-10-17 16:12:41.500759836,7741540,T,IEX,117.160000,100
2019-10-17 16:15:00.219944960,2019-10-17 16:15:00.219924675,7807577,T,IEX,117.180000,800
2019-10-17 16:17:13.84199936,2019-10-17 16:17:13.84181611,7876467,T,IEX,117.140000,33
2019-10-17 16:22:20.262710016,2019-10-17 16:22:20.262691572,8006344,T,IEX,117.150000,41
2019-10-17 16:22:20.263002880,2019-10-17 16:22:20.262985276,8006348,T,IEX,117.150000,59
2019-10-17 16:23:16.216256000,2019-10-17 16:23:16.216233372,8030021,T,IEX,117.150000,100
2019-10-17 16:29:11.378496000,2019-10-17 16:29:11.378477902,8204727,T,IEX,117.180000,9
2019-10-17 16:29:11.378618112,2019-10-17 16:29:11.378599731,8204729,T,IEX,117.180000,6
2019-10-17 16:29:11.378629888,2019-10-17 16:29:11.378613381,8204730,T,IEX,117.180000,69
2019-10-17 16:29:11.378745088,2019-10-17 16:29:11.378727115,8204731,T,IEX,117.180000,22
2019-10-17 16:29:58.398510080,2019-10-17 16:29:58.398493900,8221620,T,IEX,117.205000,350
2019-10-17 16:32:12.390926080,2019-10-17 16:32:12.390906764,8276822,T,IEX,117.220000,1
2019-10-17 16:32:22.344787968,2019-10-17 16:32:22.344766882,8281410,T,IEX,117.230000,28
2019-10-17 16:32:22.345236992,2019-10-17 16:32:22.345219885,8281413,T,IEX,117.230000,72
2019-10-17 16:32:35.619546112,2019-10-17 16:32:35.619526096,8285603,T,IEX,117.250000,15
2019-10-17 16:32:39.442441984,2019-10-17 16:32:39.442418848,8286938,T,IEX,117.250000,58
2019-10-17 16:32:55.485821952,2019-10-17 16:32:55.485803688,8292981,T,IEX,117.250000,26
2019-10-17 16:33:31.358639104,2019-10-17 16:33:31.358619305,8309487,T,IEX,117.240000,100
2019-10-17 16:34:46.760610048,2019-10-17 16:34:46.760594601,8343413,T,IEX,117.270000,200
2019-10-17 16:37:14.126562048,2019-10-17 16:37:14.126543304,8403186,T,IEX,117.290000,100
2019-10-17 16:37:47.318585088,2019-10-17 16:37:47.318563141,8414257,T,IEX,117.300000,100
2019-10-17 16:41:47.591289088,2019-10-17 16:41:47.591268569,8498815,T,IEX,117.305000,700
2019-10-17 16:42:15.337854976,2019-10-17 16:42:15.337837624,8511092,T,IEX,117.275000,100
2019-10-17 16:42:16.376612096,2019-10-17 16:42:16.376593913,8511660,T,IEX,117.275000,100
2019-10-17 16:42:16.532715008,2019-10-17 16:42:16.532694751,8511700,T,IEX,117.275000,100
2019-10-17 16:42:34.975512064,2019-10-17 16:42:34.975490878,8518613,T,IEX,117.295000,100
2019-10-17 16:42:48.729485056,2019-10-17 16:42:48.729469112,8526026,T,IEX,117.285000,6
2019-10-17 16:43:04.695237120,2019-10-17 16:43:04.695219871,8531057,T,IEX,117.290000,100
2019-10-17 16:44:41.998078976,2019-10-17 16:44:41.998061701,8562730,T,IEX,117.295000,100
2019-10-17 16:46:38.217896960,2019-10-17 16:46:38.217875452,8601086,T,IEX,117.305000,77
2019-10-17 16:46:53.555874048,2019-10-17 16:46:53.555852299,8608682,T,IEX,117.290000,1
2019-10-17 16:48:52.361240064,2019-10-17 16:48:52.361220429,8650413,T,IEX,117.275000,100
2019-10-17 16:48:54.282366976,2019-10-17 16:48:54.282347999,8650730,T,IEX,117.275000,100
2019-10-17 16:49:46.370518016,2019-10-17 16:49:46.370497608,8666552,T,IEX,117.280000,100
2019-10-17 16:51:19.692057088,2019-10-17 16:51:19.692041093,8699672,T,IEX,117.290000,10
2019-10-17 16:51:28.338678016,2019-10-17 16:51:28.338653590,8702430,T,IEX,117.295000,1
2019-10-17 16:52:00.311347968,2019-10-17 16:52:00.311329651,8713161,T,IEX,117.305000,25
2019-10-17 16:52:27.189761024,2019-10-17 16:52:27.189742142,8722049,T,IEX,117.315000,64
2019-10-17 16:55:27.460592896,2019-10-17 16:55:27.460577819,8781576,T,IEX,117.305000,100
2019-10-17 16:55:37.598574080,2019-10-17 16:55:37.598554898,8785679,T,IEX,117.325000,100
2019-10-17 16:57:04.535917056,2019-10-17 16:57:04.535896392,8813004,T,IEX,117.325000,100
2019-10-17 16:58:58.949001984,2019-10-17 16:58:58.948981766,8845648,T,IEX,117.340000,100
2019-10-17 17:00:31.375631872,2019-10-17 17:00:31.375611962,8880752,T,IEX,117.320000,1
2019-10-17 17:00:31.375676928,2019-10-17 17:00:31.375659814,8880753,T,IEX,117.320000,10
2019-10-17 17:01:36.484657920,2019-10-17 17:01:36.484637285,8902103,T,IEX,117.310000,21
2019-10-17 17:01:36.484704000,2019-10-17 17:01:36.484686530,8902104,T,IEX,117.310000,24
2019-10-17 17:02:20.476293888,2019-10-17 17:02:20.476273332,8914949,T,IEX,117.295000,10
2019-10-17 17:03:43.417970944,2019-10-17 17:03:43.417954664,8938820,T,IEX,117.315000,317
2019-10-17 17:03:47.668333056,2019-10-17 17:03:47.668310833,8940033,T,IEX,117.315000,100
2019-10-17 17:03:49.706936064,2019-10-17 17:03:49.706914771,8940910,T,IEX,117.300000,3
2019-10-17 17:03:49.708313088,2019-10-17 17:03:49.708291773,8940911,T,IEX,117.300000,48
2019-10-17 17:05:08.39228928,2019-10-17 17:05:08.39209248,8964615,T,IEX,117.315000,5
2019-10-17 17:05:08.39247104,2019-10-17 17:05:08.39229154,8964616,T,IEX,117.315000,95
2019-10-17 17:06:22.430844928,2019-10-17 17:06:22.430824836,8991427,T,IEX,117.315000,100
2019-10-17 17:07:55.147087872,2019-10-17 17:07:55.147067255,9028863,T,IEX,117.265000,19
2019-10-17 17:08:00.339204096,2019-10-17 17:08:00.339186337,9030738,T,IEX,117.275000,100
2019-10-17 17:08:42.830498048,2019-10-17 17:08:42.830481223,9045769,T,IEX,117.245000,103
2019-10-17 17:08:42.833590016,2019-10-17 17:08:42.833574440,9045771,T,IEX,117.250000,10
2019-10-17 17:11:17.911796992,2019-10-17 17:11:17.911773589,9095984,T,IEX,117.285000,10
2019-10-17 17:11:21.253923072,2019-10-17 17:11:21.253903375,9096918,T,IEX,117.300000,400
2019-10-17 17:11:55.362193920,2019-10-17 17:11:55.362174209,9107402,T,IEX,117.315000,855
2019-10-17 17:14:08.381241088,2019-10-17 17:14:08.381218357,9152043,T,IEX,117.260000,100
2019-10-17 17:14:18.119378944,2019-10-17 17:14:18.119360959,9155314,T,IEX,117.290000,6
2019-10-17 17:17:47.568882944,2019-10-17 17:17:47.568866419,9239930,T,IEX,117.380000,1
2019-10-17 17:17:50.409638912,2019-10-17 17:17:50.409617828,9242358,T,IEX,117.370000,100
2019-10-17 17:21:23.234622976,2019-10-17 17:21:23.234602550,9336465,T,IEX,117.390000,100
2019-10-17 17:24:18.629576960,2019-10-17 17:24:18.629560838,9390794,T,IEX,117.380000,155
2019-10-17 17:25:14.75831040,2019-10-17 17:25:14.75812083,9407756,T,IEX,117.360000,100
2019-10-17 17:25:43.7915008,2019-10-17 17:25:43.7897525,9417066,T,IEX,117.340000,10
2019-10-17 17:25:43.7986944,2019-10-17 17:25:43.7968600,9417067,T,IEX,117.340000,5
2019-10-17 17:28:47.281807872,2019-10-17 17:28:47.281787580,9470384,T,IEX,117.395000,100
2019-10-17 17:28:51.79680000,2019-10-17 17:28:51.79661516,9471328,T,IEX,117.390000,33
2019-10-17 17:29:29.928366080,2019-10-17 17:29:29.928347702,9485013,T,IEX,117.345000,3
2019-10-17 17:30:31.778224896,2019-10-17 17:30:31.778207081,9510599,T,IEX,117.355000,333
2019-10-17 17:31:43.823365120,2019-10-17 17:31:43.823347122,9534389,T,IEX,117.375000,10
2019-10-17 17:32:19.407159040,2019-10-17 17:32:19.407140696,9545815,T,IEX,117.350000,100
2019-10-17 17:33:18.142948096,2019-10-17 17:33:18.142926436,9566568,T,IEX,117.345000,100
2019-10-17 17:33:19.76224000,2019-10-17 17:33:19.76205694,9566911,T,IEX,117.345000,132
2019-10-17 17:33:56.406944000,2019-10-17 17:33:56.406922759,9582118,T,IEX,117.320000,100
2019-10-17 17:34:04.77572096,2019-10-17 17:34:04.77547943,9585974,T,IEX,117.320000,100
2019-10-17 17:34:04.79241984,2019-10-17 17:34:04.79222304,9585975,T,IEX,117.320000,100
2019-10-17 17:34:18.947798016,2019-10-17 17:34:18.947779604,9591481,T,IEX,117.300000,100
2019-10-17 17:34:18.947922944,2019-10-17 17:34:18.947906122,9591483,T,IEX,117.300000,100
2019-10-17 17:34:19.396129024,2019-10-17 17:34:19.396105294,9591584,T,IEX,117.295000,100
2019-10-17 17:34:19.485122048,2019-10-17 17:34:19.485100584,9591596,T,IEX,117.295000,100
2019-10-17 17:35:34.339987968,2019-10-17 17:35:34.339968671,9623318,T,IEX,117.300000,100
2019-10-17 17:35:36.396007936,2019-10-17 17:35:36.395989545,9624628,T,IEX,117.315000,100
2019-10-17 17:36:02.126900992,2019-10-17 17:36:02.126880977,9633812,T,IEX,117.305000,100
2019-10-17 17:36:32.482247936,2019-10-17 17:36:32.482230317,9643288,T,IEX,117.290000,100
2019-10-17 17:37:18.488295936,2019-10-17 17:37:18.488276534,9657671,T,IEX,117.280000,50
2019-10-17 17:37:27.312964096,2019-10-17 17:37:27.312946562,9660267,T,IEX,117.260000,100
2019-10-17 17:39:11.942257920,2019-10-17 17:39:11.942237810,9696182,T,IEX,117.300000,200
2019-10-17 17:39:11.942459904,2019-10-17 17:39:11.942442266,9696184,T,IEX,117.300000,6
2019-10-17 17:39:44.180082944,2019-10-17 17:39:44.180063105,9706430,T,IEX,117.310000,100
2019-10-17 17:39:44.686252032,2019-10-17 17:39:44.686233434,9706672,T,IEX,117.310000,100
2019-10-17 17:41:34.451852032,2019-10-17 17:41:34.451831530,9740350,T,IEX,117.320000,100
2019-10-17 17:42:44.781224960,2019-10-17 17:42:44.781207690,9762375,T,IEX,117.285000,6
2019-10-17 17:42:44.781243904,2019-10-17 17:42:44.781227750,9762376,T,IEX,117.285000,100
2019-10-17 17:43:11.445936896,2019-10-17 17:43:11.445917221,9773350,T,IEX,117.260000,100
2019-10-17 17:43:25.851316992,2019-10-17 17:43:25.851299503,9779562,T,IEX,117.250000,100
2019-10-17 17:43:25.881331968,2019-10-17 17:43:25.881310294,9779667,T,IEX,117.250000,100
2019-10-17 17:44:29.653619968,2019-10-17 17:44:29.653602082,9804590,T,IEX,117.240000,100
2019-10-17 17:45:15.184933888,2019-10-17 17:45:15.184915907,9819309,T,IEX,117.250000,100
2019-10-17 17:46:44.945868032,2019-10-17 17:46:44.945849402,9844325,T,IEX,117.245000,10
2019-10-17 17:47:25.373714944,2019-10-17 17:47:25.373692222,9857149,T,IEX,117.245000,100
2019-10-17 17:47:25.412694016,2019-10-17 17:47:25.412678365,9857158,T,IEX,117.245000,100
2019-10-17 17:49:30.191501056,2019-10-17 17:49:30.191481295,9898612,T,IEX,117.190000,100
2019-10-17 17:51:30.168869888,2019-10-17 17:51:30.168849920,9939797,T,IEX,117.160000,100
2019-10-17 17:51:50.143845888,2019-10-17 17:51:50.143825798,9947289,T,IEX,117.150000,100
2019-10-17 17:52:07.338415104,2019-10-17 17:52:07.338394186,9953040,T,IEX,117.170000,6
2019-10-17 17:52:19.361641984,2019-10-17 17:52:19.361623660,9958017,T,IEX,117.180000,175
2019-10-17 17:52:20.143345920,2019-10-17 17:52:20.143325907,9958384,T,IEX,117.170000,94
2019-10-17 17:52:31.462593024,2019-10-17 17:52:31.462572960,9962140,T,IEX,117.160000,9
2019-10-17 17:53:24.327041024,2019-10-17 17:53:24.327023492,9980082,T,IEX,117.150000,100
2019-10-17 17:54:45.428389120,2019-10-17 17:54:45.428369697,10007874,T,IEX,117.125000,10
2019-10-17 17:54:45.428401920,2019-10-17 17:54:45.428385880,10007875,T,IEX,117.125000,132
2019-10-17 17:55:38.195810048,2019-10-17 17:55:38.195790152,10028035,T,IEX,117.135000,100
2019-10-17 17:55:44.460402944,2019-10-17 17:55:44.460383701,10029951,T,IEX,117.135000,100
2019-10-17 17:56:34.321529088,2019-10-17 17:56:34.321513234,10045126,T,IEX,117.100000,100
2019-10-17 17:56:51.112920064,2019-10-17 17:56:51.112900583,10049142,T,IEX,117.080000,100
2019-10-17 17:57:49.642900992,2019-10-17 17:57:49.642884696,10067746,T,IEX,117.040000,5
2019-10-17 17:57:49.642959872,2019-10-17 17:57:49.642942268,10067748,T,IEX,117.040000,95
2019-10-17 17:58:44.657253888,2019-10-17 17:58:44.657234729,10089501,T,IEX,117.030000,100
2019-10-17 17:58:56.492250112,2019-10-17 17:58:56.492227855,10094053,T,IEX,117.020000,9
2019-10-17 17:58:56.492519936,2019-10-17 17:58:56.492501903,10094055,T,IEX,117.020000,191
2019-10-17 17:58:56.492624896,2019-10-17 17:58:56.492608607,10094057,T,IEX,117.020000,10
2019-10-17 17:59:28.411311104,2019-10-17 17:59:28.411290110,10107765,T,IEX,117.020000,100
2019-10-17 18:00:00.829214976,2019-10-17 18:00:00.829198889,10119771,T,IEX,117.025000,100
2019-10-17 18:00:00.829655040,2019-10-17 18:00:00.829637328,10119774,T,IEX,117.025000,234
2019-10-17 18:00:01.35109120,2019-10-17 18:00:01.35091396,10120404,T,IEX,117.025000,37
2019-10-17 18:00:02.380174080,2019-10-17 18:00:02.380156695,10121188,T,IEX,117.030000,100
2019-10-17 18:00:02.380357888,2019-10-17 18:00:02.380341836,10121190,T,IEX,117.030000,100
2019-10-17 18:00:02.380427008,2019-10-17 18:00:02.380409992,10121191,T,IEX,117.030000,3
2019-10-17 18:00:02.380465920,2019-10-17 18:00:02.380448556,10121192,T,IEX,117.030000,60
2019-10-17 18:00:23.245298944,2019-10-17 18:00:23.245278527,10131563,T,IEX,117.040000,100
2019-10-17 18:00:45.602529024,2019-10-17 18:00:45.602507562,10139555,T,IEX,117.040000,100
2019-10-17 18:01:47.919260928,2019-10-17 18:01:47.919245194,10163558,T,IEX,117.025000,100
2019-10-17 18:02:16.354790912,2019-10-17 18:02:16.354770454,10180375,T,IEX,117.010000,100
2019-10-17 18:02:23.958117120,2019-10-17 18:02:23.958099574,10185948,T,IEX,117.010000,100
2019-10-17 18:03:36.477377024,2019-10-17 18:03:36.477356062,10221412,T,IEX,116.960000,86
2019-10-17 18:03:36.477508096,2019-10-17 18:03:36.477489595,10221414,T,IEX,116.960000,14
2019-10-17 18:03:45.614554880,2019-10-17 18:03:45.614535734,10226662,T,IEX,116.950000,100
2019-10-17 18:04:05.232404992,2019-10-17 18:04:05.232385746,10236268,T,IEX,116.940000,90
2019-10-17 18:04:05.232755968,2019-10-17 18:04:05.232737152,10236270,T,IEX,116.940000,10
2019-10-17 18:04:33.136218112,2019-10-17 18:04:33.136199766,10247581,T,IEX,116.910000,100
2019-10-17 18:04:37.537366016,2019-10-17 18:04:37.537345605,10248819,T,IEX,116.915000,300
2019-10-17 18:04:44.999927040,2019-10-17 18:04:44.999908695,10251651,T,IEX,116.920000,4
2019-10-17 18:05:20.342256896,2019-10-17 18:05:20.342236874,10268451,T,IEX,116.900000,100
2019-10-17 18:05:37.730878976,2019-10-17 18:05:37.730860819,10274791,T,IEX,116.900000,100
2019-10-17 18:06:10.418990080,2019-10-17 18:06:10.418968274,10283417,T,IEX,116.930000,100
2019-10-17 18:06:11.2565888,2019-10-17 18:06:11.2545016,10283736,T,IEX,116.940000,100
2019-10-17 18:06:29.346722048,2019-10-17 18:06:29.346702077,10290888,T,IEX,116.955000,100
2019-10-17 18:07:33.538286080,2019-10-17 18:07:33.538268193,10311081,T,IEX,116.950000,3
2019-10-17 18:08:02.337762048,2019-10-17 18:08:02.337743414,10319526,T,IEX,116.960000,100
2019-10-17 18:08:06.966994944,2019-10-17 18:08:06.966972930,10320737,T,IEX,116.960000,100
2019-10-17 18:08:57.272110080,2019-10-17 18:08:57.272086952,10336878,T,IEX,116.975000,100
2019-10-17 18:09:04.351808000,2019-10-17 18:09:04.351788276,10339870,T,IEX,116.970000,100
2019-10-17 18:09:27.639932928,2019-10-17 18:09:27.639914474,10346837,T,IEX,116.985000,100
2019-10-17 18:09:27.648282880,2019-10-17 18:09:27.648265314,10346867,T,IEX,116.980000,100
2019-10-17 18:10:01.738046976,2019-10-17 18:10:01.738027781,10359626,T,IEX,116.965000,100
2019-10-17 18:10:01.753609984,2019-10-17 18:10:01.753591178,10359734,T,IEX,116.965000,100
2019-10-17 18:10:01.754854912,2019-10-17 18:10:01.754837073,10359740,T,IEX,116.965000,100
2019-10-17 18:10:01.953406976,2019-10-17 18:10:01.953391472,10359927,T,IEX,116.960000,100
2019-10-17 18:10:31.560308992,2019-10-17 18:10:31.560289567,10372259,T,IEX,116.960000,1
2019-10-17 18:10:31.673501952,2019-10-17 18:10:31.673481136,10372295,T,IEX,116.955000,100
2019-10-17 18:10:51.822451968,2019-10-17 18:10:51.822435957,10380002,T,IEX,116.945000,121
2019-10-17 18:10:53.388464128,2019-10-17 18:10:53.388443325,10380726,T,IEX,116.930000,100
2019-10-17 18:11:28.250947072,2019-10-17 18:11:28.250928024,10394151,T,IEX,116.940000,100
2019-10-17 18:11:28.333658880,2019-10-17 18:11:28.333638244,10394188,T,IEX,116.940000,2
2019-10-17 18:11:44.871716096,2019-10-17 18:11:44.871695118,10399877,T,IEX,116.945000,129
2019-10-17 18:11:46.97459968,2019-10-17 18:11:46.97439389,10400198,T,IEX,116.945000,50
2019-10-17 18:11:46.474872064,2019-10-17 18:11:46.474852255,10400289,T,IEX,116.945000,11
2019-10-17 18:12:01.408487936,2019-10-17 18:12:01.408466422,10407427,T,IEX,116.945000,100
2019-10-17 18:12:37.363640064,2019-10-17 18:12:37.363623920,10420010,T,IEX,116.940000,100
2019-10-17 18:12:45.928433920,2019-10-17 18:12:45.928417216,10423265,T,IEX,116.950000,100
2019-10-17 18:12:52.328381952,2019-10-17 18:12:52.328336117,10426792,T,IEX,116.925000,6
2019-10-17 18:13:21.283277056,2019-10-17 18:13:21.283258418,10439119,T,IEX,116.910000,15
2019-10-17 18:13:26.301089024,2019-10-17 18:13:26.301068296,10441615,T,IEX,116.905000,100
2019-10-17 18:14:45.51538944,2019-10-17 18:14:45.51518119,10471833,T,IEX,116.915000,10
2019-10-17 18:14:45.56325120,2019-10-17 18:14:45.56309113,10471846,T,IEX,116.920000,100
2019-10-17 18:15:19.610586112,2019-10-17 18:15:19.610566331,10485155,T,IEX,116.915000,1500
2019-10-17 18:16:02.128820992,2019-10-17 18:16:02.128805066,10501172,T,IEX,116.890000,6
2019-10-17 18:17:34.704124928,2019-10-17 18:17:34.704104625,10538435,T,IEX,116.840000,100
2019-10-17 18:17:39.767215104,2019-10-17 18:17:39.767196523,10540020,T,IEX,116.835000,200
2019-10-17 18:18:45.297858048,2019-10-17 18:18:45.297839709,10563868,T,IEX,116.845000,100
2019-10-17 18:20:23.136355072,2019-10-17 18:20:23.136334113,10606108,T,IEX,116.840000,100
2019-10-17 18:21:48.462253056,2019-10-17 18:21:48.462233523,10636049,T,IEX,116.830000,100
2019-10-17 18:22:04.906126080,2019-10-17 18:22:04.906107784,10641328,T,IEX,116.840000,100
2019-10-17 18:22:10.114895104,2019-10-17 18:22:10.114874272,10642878,T,IEX,116.840000,3
2019-10-17 18:22:46.455212032,2019-10-17 18:22:46.455193572,10653808,T,IEX,116.835000,100
2019-10-17 18:22:53.77356032,2019-10-17 18:22:53.77335483,10655923,T,IEX,116.835000,6
2019-10-17 18:23:04.883555072,2019-10-17 18:23:04.883531555,10660912,T,IEX,116.840000,100
2019-10-17 18:23:04.917349888,2019-10-17 18:23:04.917328251,10661172,T,IEX,116.845000,100
2019-10-17 18:23:13.856814080,2019-10-17 18:23:13.856795667,10663681,T,IEX,116.860000,100
2019-10-17 18:24:00.637893888,2019-10-17 18:24:00.637874938,10677959,T,IEX,116.870000,15
2019-10-17 18:24:25.388076032,2019-10-17 18:24:25.388058019,10685632,T,IEX,116.865000,100
2019-10-17 18:24:25.491165952,2019-10-17 18:24:25.491147660,10685651,T,IEX,116.860000,34
2019-10-17 18:24:25.742454016,2019-10-17 18:24:25.742434165,10685710,T,IEX,116.870000,85
2019-10-17 18:24:26.14073088,2019-10-17 18:24:26.14053220,10685792,T,IEX,116.880000,100
2019-10-17 18:24:29.119728896,2019-10-17 18:24:29.119706237,10686397,T,IEX,116.880000,200
2019-10-17 18:24:54.205821952,2019-10-17 18:24:54.205800454,10692977,T,IEX,116.870000,23
2019-10-17 18:24:59.598651904,2019-10-17 18:24:59.598633784,10694247,T,IEX,116.880000,200
2019-10-17 18:25:04.111037952,2019-10-17 18:25:04.111014946,10696193,T,IEX,116.870000,100
2019-10-17 18:25:09.311056896,2019-10-17 18:25:09.311034196,10698452,T,IEX,116.880000,100
2019-10-17 18:25:30.522067968,2019-10-17 18:25:30.522047879,10707357,T,IEX,116.880000,100
2019-10-17 18:25:30.522081024,2019-10-17 18:25:30.522064435,10707358,T,IEX,116.880000,100
2019-10-17 18:25:57.184975872,2019-10-17 18:25:57.184956792,10714410,T,IEX,116.875000,100
2019-10-17 18:26:07.452762880,2019-10-17 18:26:07.452744807,10717894,T,IEX,116.880000,100
2019-10-17 18:26:17.407216896,2019-10-17 18:26:17.407196151,10721339,T,IEX,116.875000,2
2019-10-17 18:26:24.67418112,2019-10-17 18:26:24.67397639,10725325,T,IEX,116.875000,60
2019-10-17 18:26:25.218592000,2019-10-17 18:26:25.218574204,10725788,T,IEX,116.875000,200
2019-10-17 18:26:34.795339008,2019-10-17 18:26:34.795319956,10728951,T,IEX,116.875000,300
2019-10-17 18:26:38.378627072,2019-10-17 18:26:38.378609050,10729986,T,IEX,116.875000,200
2019-10-17 18:27:00.249060096,2019-10-17 18:27:00.249039671,10737090,T,IEX,116.870000,100
2019-10-17 18:27:03.181296128,2019-10-17 18:27:03.181273227,10738621,T,IEX,116.875000,100
2019-10-17 18:27:04.664100096,2019-10-17 18:27:04.664080754,10739631,T,IEX,116.885000,1
2019-10-17 18:27:09.956673024,2019-10-17 18:27:09.956655429,10742815,T,IEX,116.895000,200
2019-10-17 18:27:28.209358080,2019-10-17 18:27:28.209339878,10751681,T,IEX,116.890000,100
2019-10-17 18:27:41.29005056,2019-10-17 18:27:41.28985297,10757195,T,IEX,116.880000,1
2019-10-17 18:27:53.718710016,2019-10-17 18:27:53.718688586,10763462,T,IEX,116.850000,100
2019-10-17 18:29:25.98498048,2019-10-17 18:29:25.98482179,10795706,T,IEX,116.850000,100
2019-10-17 18:29:45.858801920,2019-10-17 18:29:45.858783484,10802146,T,IEX,116.845000,100
2019-10-17 18:29:53.764208896,2019-10-17 18:29:53.764190476,10804994,T,IEX,116.870000,1
2019-10-17 18:29:58.824412928,2019-10-17 18:29:58.824392872,10806243,T,IEX,116.865000,1
2019-10-17 18:30:01.709094912,2019-10-17 18:30:01.709063436,10807901,T,IEX,116.860000,100
2019-10-17 18:30:19.606258944,2019-10-17 18:30:19.606235208,10814608,T,IEX,116.860000,100
2019-10-17 18:31:01.185769984,2019-10-17 18:31:01.185748795,10828062,T,IEX,116.860000,4
2019-10-17 18:31:01.187766016,2019-10-17 18:31:01.187748385,10828066,T,IEX,116.860000,296
2019-10-17 18:31:22.526909952,2019-10-17 18:31:22.526891096,10835073,T,IEX,116.860000,4
2019-10-17 18:31:24.899177984,2019-10-17 18:31:24.899158378,10835632,T,IEX,116.850000,33
2019-10-17 18:31:45.983287040,2019-10-17 18:31:45.983266378,10842369,T,IEX,116.855000,124
2019-10-17 18:32:00.5342976,2019-10-17 18:32:00.5316151,10847210,T,IEX,116.850000,100
2019-10-17 18:32:00.5377024,2019-10-17 18:32:00.5348039,10847214,T,IEX,116.850000,134
2019-10-17 18:32:14.678426112,2019-10-17 18:32:14.678406144,10853267,T,IEX,116.845000,100
2019-10-17 18:33:31.901946112,2019-10-17 18:33:31.901928479,10883727,T,IEX,116.820000,6
2019-10-17 18:34:10.134959104,2019-10-17 18:34:10.134941651,10897240,T,IEX,116.825000,2952
2019-10-17 18:35:12.110219008,2019-10-17 18:35:12.110201172,10918471,T,IEX,116.860000,100
2019-10-17 18:36:10.7902976,2019-10-17 18:36:10.7884367,10940139,T,IEX,116.870000,100
2019-10-17 18:36:11.138266112,2019-10-17 18:36:11.138248009,10941586,T,IEX,116.875000,10
2019-10-17 18:37:08.897588992,2019-10-17 18:37:08.897568659,10965111,T,IEX,116.880000,100
2019-10-17 18:37:48.52561920,2019-10-17 18:37:48.52542439,10978296,T,IEX,116.875000,100
2019-10-17 18:38:44.641079040,2019-10-17 18:38:44.641059214,10996533,T,IEX,116.890000,100
2019-10-17 18:39:13.510316032,2019-10-17 18:39:13.510300214,11004329,T,IEX,116.885000,100
2019-10-17 18:40:12.424453888,2019-10-17 18:40:12.424437861,11026999,T,IEX,116.870000,3
2019-10-17 18:40:28.285054976,2019-10-17 18:40:28.285036709,11032953,T,IEX,116.855000,7
2019-10-17 18:40:58.410808064,2019-10-17 18:40:58.410785692,11041661,T,IEX,116.860000,100
2019-10-17 18:43:34.963884032,2019-10-17 18:43:34.963863912,11090618,T,IEX,116.875000,2100
2019-10-17 18:43:34.987126016,2019-10-17 18:43:34.987106767,11090623,T,IEX,116.875000,1900
2019-10-17 18:43:35.67310080,2019-10-17 18:43:35.67288931,11090634,T,IEX,116.880000,100
2019-10-17 18:43:35.67316992,2019-10-17 18:43:35.67297955,11090635,T,IEX,116.880000,100
2019-10-17 18:43:35.85176064,2019-10-17 18:43:35.85153805,11090637,T,IEX,116.890000,1900
2019-10-17 18:43:35.185746944,2019-10-17 18:43:35.185727459,11090652,T,IEX,116.890000,2200
2019-10-17 18:43:35.206703104,2019-10-17 18:43:35.206686493,11090659,T,IEX,116.880000,7
2019-10-17 18:43:35.206755072,2019-10-17 18:43:35.206736898,11090660,T,IEX,116.890000,3100
2019-10-17 18:43:35.225742080,2019-10-17 18:43:35.225721689,11090664,T,IEX,116.890000,1800
2019-10-17 18:43:35.545670912,2019-10-17 18:43:35.545648639,11090762,T,IEX,116.895000,60
2019-10-17 18:43:43.238481920,2019-10-17 18:43:43.238461763,11093304,T,IEX,116.915000,300
2019-10-17 18:43:43.246287104,2019-10-17 18:43:43.246267658,11093305,T,IEX,116.915000,100
2019-10-17 18:43:43.507268096,2019-10-17 18:43:43.507249828,11093473,T,IEX,116.900000,100
2019-10-17 18:43:43.508512000,2019-10-17 18:43:43.508490017,11093474,T,IEX,116.910000,27
2019-10-17 18:43:46.978676992,2019-10-17 18:43:46.978655263,11094619,T,IEX,116.915000,500
2019-10-17 18:43:46.978692096,2019-10-17 18:43:46.978674800,11094620,T,IEX,116.915000,1800
2019-10-17 18:43:47.16058112,2019-10-17 18:43:47.16038200,11094631,T,IEX,116.915000,1000
2019-10-17 18:43:48.39316992,2019-10-17 18:43:48.39300513,11094914,T,IEX,116.915000,500
2019-10-17 18:43:50.726976000,2019-10-17 18:43:50.726953363,11095656,T,IEX,116.920000,100
2019-10-17 18:43:53.386565888,2019-10-17 18:43:53.386545530,11096708,T,IEX,116.930000,300
2019-10-17 18:43:53.392295936,2019-10-17 18:43:53.392275741,11096709,T,IEX,116.920000,100
2019-10-17 18:43:53.392318976,2019-10-17 18:43:53.392301097,11096710,T,IEX,116.920000,100
2019-10-17 18:43:53.403440128,2019-10-17 18:43:53.403418058,11096712,T,IEX,116.920000,70
2019-10-17 18:43:53.593971968,2019-10-17 18:43:53.593951061,11096752,T,IEX,116.930000,500
2019-10-17 18:43:57.267140096,2019-10-17 18:43:57.267119647,11097682,T,IEX,116.935000,18
2019-10-17 18:43:58.968715008,2019-10-17 18:43:58.968694169,11098205,T,IEX,116.935000,1098
2019-10-17 18:44:03.281147904,2019-10-17 18:44:03.281128033,11099804,T,IEX,116.905000,500
2019-10-17 18:44:05.651194112,2019-10-17 18:44:05.651173786,11100905,T,IEX,116.895000,6
2019-10-17 18:44:05.651208960,2019-10-17 18:44:05.651193694,11100906,T,IEX,116.895000,494
2019-10-17 18:44:06.429268992,2019-10-17 18:44:06.429253766,11101211,T,IEX,116.890000,100
2019-10-17 18:44:09.853172992,2019-10-17 18:44:09.853151109,11102498,T,IEX,116.875000,100
2019-10-17 18:44:09.854153984,2019-10-17 18:44:09.854134202,11102499,T,IEX,116.875000,100
2019-10-17 18:44:09.963518976,2019-10-17 18:44:09.963502291,11102568,T,IEX,116.885000,108
2019-10-17 18:44:11.378316032,2019-10-17 18:44:11.378297812,11102852,T,IEX,116.885000,500
2019-10-17 18:44:14.833133056,2019-10-17 18:44:14.833113123,11104100,T,IEX,116.865000,5600
2019-10-17 18:44:17.730621952,2019-10-17 18:44:17.730605259,11104767,T,IEX,116.890000,100
2019-10-17 18:44:17.737883904,2019-10-17 18:44:17.737861605,11104774,T,IEX,116.890000,200
2019-10-17 18:44:18.112519936,2019-10-17 18:44:18.112502127,11104836,T,IEX,116.890000,36
2019-10-17 18:44:27.939249920,2019-10-17 18:44:27.939229949,11107731,T,IEX,116.900000,3500
2019-10-17 18:44:43.819590912,2019-10-17 18:44:43.819570773,11111156,T,IEX,116.920000,6
2019-10-17 18:44:54.980840960,2019-10-17 18:44:54.980820265,11114072,T,IEX,116.915000,300
2019-10-17 18:45:25.998550016,2019-10-17 18:45:25.998529247,11124453,T,IEX,116.875000,300
2019-10-17 18:45:25.999478016,2019-10-17 18:45:25.999457211,11124454,T,IEX,116.875000,800
2019-10-17 18:45:27.741891072,2019-10-17 18:45:27.741872513,11124807,T,IEX,116.875000,300
2019-10-17 18:45:29.199077120,2019-10-17 18:45:29.199056808,11125809,T,IEX,116.875000,492
2019-10-17 18:45:49.59289088,2019-10-17 18:45:49.59270793,11131350,T,IEX,116.910000,100
2019-10-17 18:45:51.405848064,2019-10-17 18:45:51.405829519,11132356,T,IEX,116.910000,200
2019-10-17 18:45:52.62117888,2019-10-17 18:45:52.62098384,11132489,T,IEX,116.910000,300
2019-10-17 18:45:55.632582912,2019-10-17 18:45:55.632563209,11133366,T,IEX,116.900000,100
2019-10-17 18:45:55.632594944,2019-10-17 18:45:55.632578680,11133367,T,IEX,116.900000,1
2019-10-17 18:45:55.632612096,2019-10-17 18:45:55.632596521,11133368,T,IEX,116.900000,99
2019-10-17 18:45:56.684208896,2019-10-17 18:45:56.684190880,11133522,T,IEX,116.905000,2
2019-10-17 18:45:58.125122048,2019-10-17 18:45:58.125100959,11133965,T,IEX,116.895000,1
2019-10-17 18:45:58.970608128,2019-10-17 18:45:58.970587756,11134190,T,IEX,116.895000,100
2019-10-17 18:45:58.977430016,2019-10-17 18:45:58.977410857,11134192,T,IEX,116.895000,100
2019-10-17 18:46:13.456307968,2019-10-17 18:46:13.456286341,11137951,T,IEX,116.900000,100
2019-10-17 18:46:15.681264896,2019-10-17 18:46:15.681247603,11138858,T,IEX,116.900000,300
2019-10-17 18:46:26.813413120,2019-10-17 18:46:26.813393755,11142740,T,IEX,116.900000,100
2019-10-17 18:46:36.800481024,2019-10-17 18:46:36.800459207,11146891,T,IEX,116.895000,300
2019-10-17 18:46:47.614857984,2019-10-17 18:46:47.614835646,11149738,T,IEX,116.865000,500
2019-10-17 18:46:51.587025920,2019-10-17 18:46:51.586999158,11150944,T,IEX,116.860000,3700
2019-10-17 18:46:53.949231104,2019-10-17 18:46:53.949210867,11151450,T,IEX,116.870000,500
2019-10-17 18:46:55.222440960,2019-10-17 18:46:55.222419958,11151810,T,IEX,116.870000,600
2019-10-17 18:47:05.424291072,2019-10-17 18:47:05.424275704,11155539,T,IEX,116.890000,300
2019-10-17 18:47:06.213126912,2019-10-17 18:47:06.213110066,11156208,T,IEX,116.900000,95
2019-10-17 18:48:17.56562944,2019-10-17 18:48:17.56544515,11181485,T,IEX,116.885000,300
2019-10-17 18:48:42.260775936,2019-10-17 18:48:42.260757660,11189084,T,IEX,116.890000,1
2019-10-17 18:48:44.564317952,2019-10-17 18:48:44.564295725,11189578,T,IEX,116.885000,300
2019-10-17 18:48:55.168733952,2019-10-17 18:48:55.168712798,11192482,T,IEX,116.875000,300
2019-10-17 18:49:06.120088064,2019-10-17 18:49:06.120069336,11195665,T,IEX,116.885000,300
2019-10-17 18:49:36.482649088,2019-10-17 18:49:36.482626627,11203648,T,IEX,116.875000,300
2019-10-17 18:49:37.274292992,2019-10-17 18:49:37.274271391,11203856,T,IEX,116.875000,300
2019-10-17 18:49:51.203424000,2019-10-17 18:49:51.203402483,11207439,T,IEX,116.880000,400
2019-10-17 18:49:52.410597888,2019-10-17 18:49:52.410578744,11207666,T,IEX,116.880000,300
2019-10-17 18:49:56.542757120,2019-10-17 18:49:56.542738385,11208426,T,IEX,116.875000,22
2019-10-17 18:49:58.204087040,2019-10-17 18:49:58.204071080,11210160,T,IEX,116.885000,1478
2019-10-17 18:49:59.480421888,2019-10-17 18:49:59.480401728,11210841,T,IEX,116.885000,300
2019-10-17 18:49:59.897756928,2019-10-17 18:49:59.897736104,11211007,T,IEX,116.885000,300
2019-10-17 18:50:01.578285056,2019-10-17 18:50:01.578262043,11211702,T,IEX,116.890000,2
2019-10-17 18:50:02.307456000,2019-10-17 18:50:02.307435619,11211996,T,IEX,116.885000,489
2019-10-17 18:50:12.102064128,2019-10-17 18:50:12.102042870,11216780,T,IEX,116.895000,300
2019-10-17 18:50:14.532007936,2019-10-17 18:50:14.531989072,11217557,T,IEX,116.895000,300
2019-10-17 18:50:18.823287040,2019-10-17 18:50:18.823246407,11219193,T,IEX,116.910000,100
2019-10-17 18:50:20.205448960,2019-10-17 18:50:20.205431514,11222883,T,IEX,116.910000,300
2019-10-17 18:50:20.389575936,2019-10-17 18:50:20.389557816,11223033,T,IEX,116.910000,300
2019-10-17 18:50:27.971148032,2019-10-17 18:50:27.971127138,11232498,T,IEX,116.915000,300
2019-10-17 18:50:31.123046912,2019-10-17 18:50:31.123024341,11234542,T,IEX,116.920000,9
2019-10-17 18:50:32.152838912,2019-10-17 18:50:32.152819804,11235130,T,IEX,116.920000,300
2019-10-17 18:50:32.152880128,2019-10-17 18:50:32.152863075,11235131,T,IEX,116.920000,300
2019-10-17 18:50:32.194713088,2019-10-17 18:50:32.194695573,11235168,T,IEX,116.920000,500
2019-10-17 18:50:32.965155072,2019-10-17 18:50:32.965135775,11235582,T,IEX,116.920000,300
2019-10-17 18:50:34.659960064,2019-10-17 18:50:34.659940991,11236405,T,IEX,116.915000,100
2019-10-17 18:50:34.702020096,2019-10-17 18:50:34.701998705,11236411,T,IEX,116.915000,200
2019-10-17 18:50:36.623752960,2019-10-17 18:50:36.623729779,11237820,T,IEX,116.910000,50
2019-10-17 18:50:42.460210944,2019-10-17 18:50:42.460192908,11242477,T,IEX,116.925000,500
2019-10-17 18:50:42.460226048,2019-10-17 18:50:42.460208661,11242478,T,IEX,116.925000,300
2019-10-17 18:50:45.539691008,2019-10-17 18:50:45.539674667,11243754,T,IEX,116.935000,100
2019-10-17 18:50:45.543227904,2019-10-17 18:50:45.543204568,11243755,T,IEX,116.935000,200
2019-10-17 18:50:49.857056000,2019-10-17 18:50:49.857035595,11246052,T,IEX,116.915000,300
2019-10-17 18:50:50.20246016,2019-10-17 18:50:50.20225118,11246131,T,IEX,116.915000,300
2019-10-17 18:51:02.422074880,2019-10-17 18:51:02.422054546,11251975,T,IEX,116.885000,400
2019-10-17 18:51:02.423024128,2019-10-17 18:51:02.423007100,11251981,T,IEX,116.885000,1400
2019-10-17 18:51:02.423970048,2019-10-17 18:51:02.423950133,11251982,T,IEX,116.885000,400
2019-10-17 18:51:02.720775936,2019-10-17 18:51:02.720756708,11252178,T,IEX,116.885000,300
2019-10-17 18:51:13.137467904,2019-10-17 18:51:13.137446052,11258168,T,IEX,116.875000,800
2019-10-17 18:51:13.287003904,2019-10-17 18:51:13.286982154,11258205,T,IEX,116.875000,200
2019-10-17 18:51:48.31462912,2019-10-17 18:51:48.31444198,11271675,T,IEX,116.880000,99
2019-10-17 18:52:54.353127936,2019-10-17 18:52:54.353106563,11290573,T,IEX,116.880000,300
2019-10-17 18:53:14.467258112,2019-10-17 18:53:14.467239170,11298382,T,IEX,116.875000,100
2019-10-17 18:53:26.249537024,2019-10-17 18:53:26.249515588,11302942,T,IEX,116.870000,1
2019-10-17 18:53:29.467628032,2019-10-17 18:53:29.467609671,11305727,T,IEX,116.845000,500
2019-10-17 18:53:29.468865024,2019-10-17 18:53:29.468846465,11305732,T,IEX,116.845000,400
2019-10-17 18:53:32.769390080,2019-10-17 18:53:32.769370213,11308342,T,IEX,116.855000,100
2019-10-17 18:53:41.125825024,2019-10-17 18:53:41.125802434,11313372,T,IEX,116.885000,300
2019-10-17 18:53:42.274955008,2019-10-17 18:53:42.274936109,11313820,T,IEX,116.900000,300
2019-10-17 18:54:42.813347072,2019-10-17 18:54:42.813327564,11337603,T,IEX,116.895000,300
2019-10-17 18:55:02.994273024,2019-10-17 18:55:02.994254499,11345402,T,IEX,116.885000,500
2019-10-17 18:55:02.995303936,2019-10-17 18:55:02.995283150,11345403,T,IEX,116.885000,1020
2019-10-17 18:55:32.391578112,2019-10-17 18:55:32.391558837,11354509,T,IEX,116.890000,100
2019-10-17 18:55:39.116011008,2019-10-17 18:55:39.115992089,11356244,T,IEX,116.885000,100
2019-10-17 18:56:07.575457024,2019-10-17 18:56:07.575441233,11365413,T,IEX,116.875000,10
2019-10-17 18:56:20.250449920,2019-10-17 18:56:20.250428904,11368770,T,IEX,116.880000,300
2019-10-17 18:57:12.761421056,2019-10-17 18:57:12.761399955,11387430,T,IEX,116.870000,300
2019-10-17 18:58:15.625134080,2019-10-17 18:58:15.625113622,11411552,T,IEX,116.885000,300
2019-10-17 18:58:16.421289984,2019-10-17 18:58:16.421268830,11411870,T,IEX,116.885000,300
2019-10-17 19:00:28.444680960,2019-10-17 19:00:28.444660134,11463848,T,IEX,116.895000,350
2019-10-17 19:00:28.451400960,2019-10-17 19:00:28.451383991,11463852,T,IEX,116.895000,2
2019-10-17 19:00:37.414491904,2019-10-17 19:00:37.414471038,11467879,T,IEX,116.900000,100
2019-10-17 19:01:00.628590080,2019-10-17 19:01:00.628569683,11476091,T,IEX,116.905000,100
2019-10-17 19:01:05.524192000,2019-10-17 19:01:05.524170024,11477703,T,IEX,116.905000,1
2019-10-17 19:01:06.392448000,2019-10-17 19:01:06.392429548,11478229,T,IEX,116.910000,100
2019-10-17 19:01:18.819078912,2019-10-17 19:01:18.819060887,11483249,T,IEX,116.905000,300
2019-10-17 19:01:45.726102016,2019-10-17 19:01:45.726083760,11490280,T,IEX,116.895000,247
2019-10-17 19:01:47.726799104,2019-10-17 19:01:47.726781563,11490781,T,IEX,116.895000,300
2019-10-17 19:02:09.708062976,2019-10-17 19:02:09.708041467,11496137,T,IEX,116.895000,100
2019-10-17 19:03:04.894788096,2019-10-17 19:03:04.894766235,11515178,T,IEX,116.875000,400
2019-10-17 19:03:18.720445952,2019-10-17 19:03:18.720421633,11519476,T,IEX,116.865000,600
2019-10-17 19:03:39.266532096,2019-10-17 19:03:39.266511886,11527825,T,IEX,116.865000,355
2019-10-17 19:04:27.81203968,2019-10-17 19:04:27.81183939,11543871,T,IEX,116.825000,6
2019-10-17 19:04:27.81220096,2019-10-17 19:04:27.81204132,11543872,T,IEX,116.830000,85
2019-10-17 19:04:28.117808128,2019-10-17 19:04:28.117790342,11544230,T,IEX,116.825000,300
2019-10-17 19:05:02.616293888,2019-10-17 19:05:02.616274609,11556139,T,IEX,116.830000,10
2019-10-17 19:05:56.905711104,2019-10-17 19:05:56.905695253,11573515,T,IEX,116.820000,77
2019-10-17 19:05:56.905949952,2019-10-17 19:05:56.905933299,11573517,T,IEX,116.820000,6
2019-10-17 19:05:56.905969920,2019-10-17 19:05:56.905953214,11573518,T,IEX,116.820000,3
2019-10-17 19:05:56.905982976,2019-10-17 19:05:56.905966319,11573519,T,IEX,116.820000,23
2019-10-17 19:05:56.906077952,2019-10-17 19:05:56.906059707,11573520,T,IEX,116.820000,100
2019-10-17 19:05:56.906117888,2019-10-17 19:05:56.906101285,11573521,T,IEX,116.820000,100
2019-10-17 19:06:00.967805952,2019-10-17 19:06:00.967788561,11574894,T,IEX,116.820000,50
2019-10-17 19:06:16.598439936,2019-10-17 19:06:16.598424418,11581999,T,IEX,116.815000,100
2019-10-17 19:09:06.676802048,2019-10-17 19:09:06.676779719,11640428,T,IEX,116.830000,100
2019-10-17 19:09:46.342130944,2019-10-17 19:09:46.342108423,11650973,T,IEX,116.850000,100
2019-10-17 19:09:59.461787904,2019-10-17 19:09:59.461769046,11655656,T,IEX,116.840000,100
2019-10-17 19:11:00.950428928,2019-10-17 19:11:00.950409430,11676032,T,IEX,116.855000,300
2019-10-17 19:11:29.234595072,2019-10-17 19:11:29.234573904,11686711,T,IEX,116.840000,200
2019-10-17 19:11:51.982744064,2019-10-17 19:11:51.982724304,11693375,T,IEX,116.850000,100
2019-10-17 19:12:07.439758080,2019-10-17 19:12:07.439740250,11700037,T,IEX,116.850000,100
2019-10-17 19:12:25.664002048,2019-10-17 19:12:25.663982476,11707853,T,IEX,116.855000,300
2019-10-17 19:12:52.442942976,2019-10-17 19:12:52.442920525,11716344,T,IEX,116.870000,6
2019-10-17 19:12:52.447875072,2019-10-17 19:12:52.447854146,11716345,T,IEX,116.865000,100
2019-10-17 19:13:12.28354048,2019-10-17 19:13:12.28330537,11724138,T,IEX,116.880000,100
2019-10-17 19:13:57.134718976,2019-10-17 19:13:57.134697174,11738191,T,IEX,116.875000,300
2019-10-17 19:14:08.156884992,2019-10-17 19:14:08.156867141,11742610,T,IEX,116.875000,100
2019-10-17 19:14:43.661870080,2019-10-17 19:14:43.661851404,11754243,T,IEX,116.880000,100
2019-10-17 19:14:43.661970944,2019-10-17 19:14:43.661954211,11754245,T,IEX,116.880000,100
2019-10-17 19:14:43.662541056,2019-10-17 19:14:43.662522983,11754247,T,IEX,116.880000,100
2019-10-17 19:14:44.939649024,2019-10-17 19:14:44.939626432,11754522,T,IEX,116.890000,100
2019-10-17 19:14:46.133476096,2019-10-17 19:14:46.133455743,11755448,T,IEX,116.895000,300
2019-10-17 19:14:47.897807872,2019-10-17 19:14:47.897790139,11756423,T,IEX,116.895000,100
2019-10-17 19:14:50.56771072,2019-10-17 19:14:50.56750562,11756988,T,IEX,116.910000,100
2019-10-17 19:14:51.845004032,2019-10-17 19:14:51.844979693,11757445,T,IEX,116.905000,100
2019-10-17 19:14:55.766512896,2019-10-17 19:14:55.766495087,11758493,T,IEX,116.900000,100
2019-10-17 19:15:04.481393920,2019-10-17 19:15:04.481372043,11762556,T,IEX,116.905000,300
2019-10-17 19:15:28.392295936,2019-10-17 19:15:28.392276075,11771208,T,IEX,116.930000,300
2019-10-17 19:15:45.915610880,2019-10-17 19:15:45.915592051,11777122,T,IEX,116.925000,300
2019-10-17 19:16:01.702433024,2019-10-17 19:16:01.702411362,11782158,T,IEX,116.905000,300
2019-10-17 19:16:09.470241024,2019-10-17 19:16:09.470222751,11784106,T,IEX,116.890000,200
2019-10-17 19:16:15.99283968,2019-10-17 19:16:15.99260736,11785346,T,IEX,116.895000,300
2019-10-17 19:16:19.5946880,2019-10-17 19:16:19.5926109,11786119,T,IEX,116.885000,539
2019-10-17 19:16:19.122992128,2019-10-17 19:16:19.122972109,11786150,T,IEX,116.885000,300
2019-10-17 19:16:19.140142080,2019-10-17 19:16:19.140119033,11786159,T,IEX,116.885000,500
2019-10-17 19:16:22.752752128,2019-10-17 19:16:22.752733856,11787080,T,IEX,116.885000,300
2019-10-17 19:16:22.845619968,2019-10-17 19:16:22.845600890,11787104,T,IEX,116.885000,400
2019-10-17 19:16:23.194145024,2019-10-17 19:16:23.194124126,11787199,T,IEX,116.885000,300
2019-10-17 19:16:30.301933056,2019-10-17 19:16:30.301914364,11789189,T,IEX,116.890000,100
2019-10-17 19:16:30.302100992,2019-10-17 19:16:30.302083314,11789191,T,IEX,116.890000,100
2019-10-17 19:17:10.770347008,2019-10-17 19:17:10.770327479,11800946,T,IEX,116.885000,10
2019-10-17 19:17:59.755051008,2019-10-17 19:17:59.755032920,11817445,T,IEX,116.885000,166
2019-10-17 19:18:07.367629056,2019-10-17 19:18:07.367607490,11822670,T,IEX,116.875000,300
2019-10-17 19:18:15.801847040,2019-10-17 19:18:15.801829569,11828123,T,IEX,116.875000,300
2019-10-17 19:18:27.65960960,2019-10-17 19:18:27.65937783,11831946,T,IEX,116.875000,100
2019-10-17 19:19:21.130515968,2019-10-17 19:19:21.130495298,11852562,T,IEX,116.855000,2
2019-10-17 19:19:35.948167936,2019-10-17 19:19:35.948147466,11856977,T,IEX,116.865000,300
2019-10-17 19:19:40.43185920,2019-10-17 19:19:40.43164276,11858241,T,IEX,116.865000,100
2019-10-17 19:19:58.893670912,2019-10-17 19:19:58.893648659,11864696,T,IEX,116.865000,177
2019-10-17 19:21:06.280445952,2019-10-17 19:21:06.280423710,11887391,T,IEX,116.875000,300
2019-10-17 19:21:07.457548032,2019-10-17 19:21:07.457526948,11887669,T,IEX,116.875000,2
2019-10-17 19:22:23.935019008,2019-10-17 19:22:23.934998266,11915969,T,IEX,116.865000,300
2019-10-17 19:23:07.34951936,2019-10-17 19:23:07.34929796,11928975,T,IEX,116.865000,100
2019-10-17 19:23:28.377886976,2019-10-17 19:23:28.377864740,11936552,T,IEX,116.855000,3
2019-10-17 19:23:40.177562880,2019-10-17 19:23:40.177540461,11939601,T,IEX,116.855000,100
2019-10-17 19:23:42.334699008,2019-10-17 19:23:42.334675704,11940349,T,IEX,116.855000,100
2019-10-17 19:24:00.998685952,2019-10-17 19:24:00.998664000,11946530,T,IEX,116.860000,100
2019-10-17 19:24:48.657718016,2019-10-17 19:24:48.657696905,11961641,T,IEX,116.875000,100
2019-10-17 19:25:47.774371072,2019-10-17 19:25:47.774354650,11979692,T,IEX,116.860000,100
2019-10-17 19:27:19.140784128,2019-10-17 19:27:19.140764223,12012866,T,IEX,116.840000,100
2019-10-17 19:27:49.251663872,2019-10-17 19:27:49.251645872,12024805,T,IEX,116.830000,100
2019-10-17 19:27:49.251983872,2019-10-17 19:27:49.251965030,12024807,T,IEX,116.830000,2
2019-10-17 19:28:35.60015104,2019-10-17 19:28:35.59996506,12039434,T,IEX,116.805000,8
2019-10-17 19:29:36.62705920,2019-10-17 19:29:36.62690227,12064460,T,IEX,116.810000,100
2019-10-17 19:29:38.384824064,2019-10-17 19:29:38.384802887,12065432,T,IEX,116.810000,87
2019-10-17 19:29:41.496662016,2019-10-17 19:29:41.496640672,12066283,T,IEX,116.810000,13
2019-10-17 19:30:19.965785088,2019-10-17 19:30:19.965767463,12089012,T,IEX,116.820000,350
2019-10-17 19:30:43.914650880,2019-10-17 19:30:43.914631910,12103823,T,IEX,116.835000,100
2019-10-17 19:30:46.965972992,2019-10-17 19:30:46.965954348,12105634,T,IEX,116.835000,133
2019-10-17 19:31:30.337746944,2019-10-17 19:31:30.337728461,12129985,T,IEX,116.835000,6
2019-10-17 19:31:47.56903936,2019-10-17 19:31:47.56882292,12135065,T,IEX,116.835000,2
2019-10-17 19:31:47.427589120,2019-10-17 19:31:47.427567479,12135126,T,IEX,116.830000,100
2019-10-17 19:31:48.66944000,2019-10-17 19:31:48.66922933,12135277,T,IEX,116.835000,109
2019-10-17 19:31:48.66952960,2019-10-17 19:31:48.66936055,12135278,T,IEX,116.835000,10
2019-10-17 19:32:24.880070912,2019-10-17 19:32:24.880050004,12158593,T,IEX,116.850000,86
2019-10-17 19:34:30.648756992,2019-10-17 19:34:30.648734953,12221278,T,IEX,116.825000,103
2019-10-17 19:34:47.256655104,2019-10-17 19:34:47.256634593,12227850,T,IEX,116.825000,152
2019-10-17 19:35:22.104955904,2019-10-17 19:35:22.104938621,12243673,T,IEX,116.815000,100
2019-10-17 19:35:23.86529024,2019-10-17 19:35:23.86509277,12244517,T,IEX,116.835000,100
2019-10-17 19:35:23.87969024,2019-10-17 19:35:23.87951424,12244519,T,IEX,116.835000,100
2019-10-17 19:35:32.442629120,2019-10-17 19:35:32.442609846,12249423,T,IEX,116.835000,100
2019-10-17 19:35:32.443586048,2019-10-17 19:35:32.443569842,12249427,T,IEX,116.835000,100
2019-10-17 19:35:32.443645952,2019-10-17 19:35:32.443629055,12249428,T,IEX,116.835000,100
2019-10-17 19:35:32.640677120,2019-10-17 19:35:32.640655990,12249499,T,IEX,116.840000,100
2019-10-17 19:35:32.943159040,2019-10-17 19:35:32.943137982,12249577,T,IEX,116.840000,200
2019-10-17 19:35:32.943984896,2019-10-17 19:35:32.943965353,12249578,T,IEX,116.840000,100
2019-10-17 19:35:37.137707008,2019-10-17 19:35:37.137685696,12251252,T,IEX,116.845000,100
2019-10-17 19:35:37.138737920,2019-10-17 19:35:37.138719655,12251254,T,IEX,116.845000,100
2019-10-17 19:36:09.728161024,2019-10-17 19:36:09.728140819,12263259,T,IEX,116.865000,100
2019-10-17 19:36:22.259032064,2019-10-17 19:36:22.259009776,12268345,T,IEX,116.850000,100
2019-10-17 19:36:30.203224064,2019-10-17 19:36:30.203204559,12270640,T,IEX,116.860000,100
2019-10-17 19:37:46.140662016,2019-10-17 19:37:46.140640377,12300950,T,IEX,116.815000,100
2019-10-17 19:38:06.934907904,2019-10-17 19:38:06.934889242,12310616,T,IEX,116.815000,100
2019-10-17 19:38:09.496688128,2019-10-17 19:38:09.496672131,12312994,T,IEX,116.820000,5
2019-10-17 19:38:33.936444928,2019-10-17 19:38:33.936422155,12322583,T,IEX,116.815000,100
2019-10-17 19:39:01.9485056,2019-10-17 19:39:01.9465127,12332929,T,IEX,116.790000,1
2019-10-17 19:39:06.491183104,2019-10-17 19:39:06.491163117,12336102,T,IEX,116.770000,4
2019-10-17 19:40:02.185989120,2019-10-17 19:40:02.185968000,12359687,T,IEX,116.790000,100
2019-10-17 19:40:02.186001920,2019-10-17 19:40:02.185985500,12359688,T,IEX,116.790000,100
2019-10-17 19:40:11.960515072,2019-10-17 19:40:11.960496927,12365375,T,IEX,116.785000,300
2019-10-17 19:40:13.377090048,2019-10-17 19:40:13.377073006,12365888,T,IEX,116.785000,1
2019-10-17 19:40:18.142663936,2019-10-17 19:40:18.142645565,12367642,T,IEX,116.785000,100
2019-10-17 19:40:24.627760896,2019-10-17 19:40:24.627740822,12372482,T,IEX,116.775000,300
2019-10-17 19:40:34.407574016,2019-10-17 19:40:34.407552331,12378969,T,IEX,116.775000,100
2019-10-17 19:40:35.591924992,2019-10-17 19:40:35.591901934,12379352,T,IEX,116.775000,300
2019-10-17 19:40:44.120755968,2019-10-17 19:40:44.120729352,12383567,T,IEX,116.770000,100
2019-10-17 19:40:47.196504064,2019-10-17 19:40:47.196487567,12387203,T,IEX,116.745000,300
2019-10-17 19:41:00.880154880,2019-10-17 19:41:00.880137309,12394410,T,IEX,116.765000,300
2019-10-17 19:41:07.96057088,2019-10-17 19:41:07.96034638,12397343,T,IEX,116.755000,300
2019-10-17 19:41:22.370536960,2019-10-17 19:41:22.370519545,12404597,T,IEX,116.760000,7
2019-10-17 19:41:26.64044032,2019-10-17 19:41:26.64025098,12406333,T,IEX,116.765000,300
2019-10-17 19:41:26.65102080,2019-10-17 19:41:26.65081739,12406334,T,IEX,116.760000,1
2019-10-17 19:41:28.59047936,2019-10-17 19:41:28.59031548,12407626,T,IEX,116.770000,100
2019-10-17 19:41:31.247823104,2019-10-17 19:41:31.247804425,12410095,T,IEX,116.770000,300
2019-10-17 19:42:18.618217984,2019-10-17 19:42:18.618201100,12430628,T,IEX,116.775000,100
2019-10-17 19:42:53.166690048,2019-10-17 19:42:53.166667337,12444330,T,IEX,116.775000,300
2019-10-17 19:43:09.171086080,2019-10-17 19:43:09.171065179,12450843,T,IEX,116.780000,100
2019-10-17 19:43:09.171544064,2019-10-17 19:43:09.171528029,12450846,T,IEX,116.780000,25
2019-10-17 19:43:09.171565056,2019-10-17 19:43:09.171547461,12450847,T,IEX,116.780000,15
2019-10-17 19:43:09.298629120,2019-10-17 19:43:09.298603079,12450948,T,IEX,116.785000,20
2019-10-17 19:43:09.302546944,2019-10-17 19:43:09.302526858,12451080,T,IEX,116.785000,37
2019-10-17 19:43:09.303417088,2019-10-17 19:43:09.303398935,12451114,T,IEX,116.785000,18
2019-10-17 19:43:09.309682944,2019-10-17 19:43:09.309664325,12451207,T,IEX,116.790000,84
2019-10-17 19:43:30.68915968,2019-10-17 19:43:30.68893196,12459935,T,IEX,116.800000,100
2019-10-17 19:43:30.68930048,2019-10-17 19:43:30.68911911,12459936,T,IEX,116.800000,100
2019-10-17 19:43:30.69539072,2019-10-17 19:43:30.69522320,12459938,T,IEX,116.800000,100
2019-10-17 19:43:30.69552896,2019-10-17 19:43:30.69535661,12459939,T,IEX,116.800000,100
2019-10-17 19:43:30.69857024,2019-10-17 19:43:30.69838680,12459940,T,IEX,116.800000,300
2019-10-17 19:43:30.572804096,2019-10-17 19:43:30.572780927,12460108,T,IEX,116.810000,100
2019-10-17 19:43:30.597335040,2019-10-17 19:43:30.597319088,12460118,T,IEX,116.815000,100
2019-10-17 19:43:31.903406080,2019-10-17 19:43:31.903386809,12460616,T,IEX,116.825000,300
2019-10-17 19:43:32.890971904,2019-10-17 19:43:32.890951997,12461000,T,IEX,116.830000,300
2019-10-17 19:43:33.990322944,2019-10-17 19:43:33.990303022,12461376,T,IEX,116.825000,1063
2019-10-17 19:43:37.906180096,2019-10-17 19:43:37.906160190,12462761,T,IEX,116.835000,400
2019-10-17 19:43:53.513574912,2019-10-17 19:43:53.513554741,12469144,T,IEX,116.865000,300
2019-10-17 19:44:04.155119104,2019-10-17 19:44:04.155100006,12474449,T,IEX,116.865000,200
2019-10-17 19:44:18.354727936,2019-10-17 19:44:18.354709311,12481398,T,IEX,116.865000,1
2019-10-17 19:44:20.156122880,2019-10-17 19:44:20.156102948,12482320,T,IEX,116.895000,100
2019-10-17 19:44:20.979162112,2019-10-17 19:44:20.979142061,12482688,T,IEX,116.895000,300
2019-10-17 19:44:22.548552960,2019-10-17 19:44:22.548535055,12483325,T,IEX,116.915000,2
2019-10-17 19:44:23.979693056,2019-10-17 19:44:23.979674633,12483701,T,IEX,116.915000,300
2019-10-17 19:44:26.333389056,2019-10-17 19:44:26.333367268,12484557,T,IEX,116.905000,100
2019-10-17 19:44:27.334441984,2019-10-17 19:44:27.334425153,12484960,T,IEX,116.910000,100
2019-10-17 19:44:29.234198016,2019-10-17 19:44:29.234180427,12486034,T,IEX,116.910000,100
2019-10-17 19:44:32.34628096,2019-10-17 19:44:32.34607659,12487060,T,IEX,116.910000,100
2019-10-17 19:44:47.616973056,2019-10-17 19:44:47.616953101,12492332,T,IEX,116.905000,300
2019-10-17 19:45:04.765324032,2019-10-17 19:45:04.765307761,12502184,T,IEX,116.895000,300
2019-10-17 19:45:14.278521088,2019-10-17 19:45:14.278499567,12507936,T,IEX,116.895000,300
2019-10-17 19:45:24.525611008,2019-10-17 19:45:24.525595314,12511912,T,IEX,116.895000,1000
2019-10-17 19:45:40.435514112,2019-10-17 19:45:40.435493628,12517757,T,IEX,116.885000,300
2019-10-17 19:45:41.754416128,2019-10-17 19:45:41.754397272,12518199,T,IEX,116.885000,300
2019-10-17 19:45:43.315721984,2019-10-17 19:45:43.315700747,12518729,T,IEX,116.890000,200
2019-10-17 19:45:44.572626944,2019-10-17 19:45:44.572607535,12519142,T,IEX,116.895000,6900
2019-10-17 19:45:48.463951872,2019-10-17 19:45:48.463930919,12520735,T,IEX,116.895000,300
2019-10-17 19:45:51.709032960,2019-10-17 19:45:51.709015652,12521996,T,IEX,116.890000,10
2019-10-17 19:45:53.220328960,2019-10-17 19:45:53.220309374,12522573,T,IEX,116.885000,44
2019-10-17 19:45:53.320246016,2019-10-17 19:45:53.320225660,12522606,T,IEX,116.885000,200
2019-10-17 19:45:53.321179904,2019-10-17 19:45:53.321162438,12522607,T,IEX,116.885000,400
2019-10-17 19:45:53.332243968,2019-10-17 19:45:53.332224267,12522612,T,IEX,116.885000,100
2019-10-17 19:45:57.991384064,2019-10-17 19:45:57.991364928,12524230,T,IEX,116.875000,300
2019-10-17 19:45:57.992328960,2019-10-17 19:45:57.992308923,12524231,T,IEX,116.875000,1300
2019-10-17 19:45:57.993265920,2019-10-17 19:45:57.993249559,12524233,T,IEX,116.875000,400
2019-10-17 19:45:58.27154944,2019-10-17 19:45:58.27134638,12524242,T,IEX,116.875000,1000
2019-10-17 19:46:01.173756928,2019-10-17 19:46:01.173739340,12530022,T,IEX,116.895000,2900
2019-10-17 19:46:03.571729920,2019-10-17 19:46:03.571707376,12532187,T,IEX,116.905000,624
2019-10-17 19:46:20.488745984,2019-10-17 19:46:20.488722567,12542254,T,IEX,116.910000,100
2019-10-17 19:47:48.20781056,2019-10-17 19:47:48.20759861,12584236,T,IEX,116.910000,100
2019-10-17 19:48:20.489456896,2019-10-17 19:48:20.489436033,12603391,T,IEX,116.890000,100
2019-10-17 19:48:48.544736000,2019-10-17 19:48:48.544715826,12615945,T,IEX,116.915000,80
2019-10-17 19:49:14.269993984,2019-10-17 19:49:14.269976874,12630463,T,IEX,116.910000,100
2019-10-17 19:49:17.449011968,2019-10-17 19:49:17.448995649,12632591,T,IEX,116.915000,100
2019-10-17 19:49:30.778764032,2019-10-17 19:49:30.778745892,12646503,T,IEX,116.860000,100
2019-10-17 19:49:48.925007872,2019-10-17 19:49:48.924986709,12661561,T,IEX,116.825000,100
2019-10-17 19:49:55.781552128,2019-10-17 19:49:55.781532594,12666381,T,IEX,116.820000,17
2019-10-17 19:49:55.781571072,2019-10-17 19:49:55.781551634,12666382,T,IEX,116.820000,17
2019-10-17 19:49:56.446887936,2019-10-17 19:49:56.446866843,12667567,T,IEX,116.810000,100
2019-10-17 19:50:00.719176960,2019-10-17 19:50:00.719160289,12673505,T,IEX,116.795000,100
2019-10-17 19:50:02.524222976,2019-10-17 19:50:02.524203806,12682922,T,IEX,116.770000,100
2019-10-17 19:50:08.826223104,2019-10-17 19:50:08.826204765,12694310,T,IEX,116.805000,100
2019-10-17 19:50:10.92055040,2019-10-17 19:50:10.92036572,12697527,T,IEX,116.815000,140
2019-10-17 19:50:10.263362048,2019-10-17 19:50:10.263343729,12697834,T,IEX,116.815000,260
2019-10-17 19:50:11.743186944,2019-10-17 19:50:11.743168801,12699281,T,IEX,116.800000,100
2019-10-17 19:50:12.503613952,2019-10-17 19:50:12.503593474,12700426,T,IEX,116.790000,100
2019-10-17 19:50:18.9388032,2019-10-17 19:50:18.9370362,12705936,T,IEX,116.790000,20
2019-10-17 19:50:20.798087936,2019-10-17 19:50:20.798069959,12707493,T,IEX,116.790000,100
2019-10-17 19:50:31.992019968,2019-10-17 19:50:31.991997418,12715068,T,IEX,116.790000,100
2019-10-17 19:50:31.993217024,2019-10-17 19:50:31.993199129,12715072,T,IEX,116.790000,100
2019-10-17 19:50:31.993223936,2019-10-17 19:50:31.993207460,12715073,T,IEX,116.790000,100
2019-10-17 19:50:32.540602880,2019-10-17 19:50:32.540579526,12715647,T,IEX,116.790000,200
2019-10-17 19:50:32.541795072,2019-10-17 19:50:32.541776018,12715709,T,IEX,116.790000,100
2019-10-17 19:50:32.541827072,2019-10-17 19:50:32.541804756,12715712,T,IEX,116.790000,100
2019-10-17 19:50:33.675489024,2019-10-17 19:50:33.675468710,12717719,T,IEX,116.795000,100
2019-10-17 19:50:46.312933888,2019-10-17 19:50:46.312913852,12726103,T,IEX,116.800000,100
2019-10-17 19:50:48.723817984,2019-10-17 19:50:48.723799341,12728877,T,IEX,116.805000,100
2019-10-17 19:50:59.178622976,2019-10-17 19:50:59.178602897,12735495,T,IEX,116.805000,100
2019-10-17 19:51:16.487484928,2019-10-17 19:51:16.487463991,12752860,T,IEX,116.835000,400
2019-10-17 19:51:16.734632960,2019-10-17 19:51:16.734611876,12753031,T,IEX,116.830000,400
2019-10-17 19:51:26.192706048,2019-10-17 19:51:26.192685057,12757837,T,IEX,116.805000,100
2019-10-17 19:51:27.408003072,2019-10-17 19:51:27.407982661,12758495,T,IEX,116.785000,100
2019-10-17 19:51:44.791183872,2019-10-17 19:51:44.791163632,12768357,T,IEX,116.785000,100
2019-10-17 19:51:47.728248064,2019-10-17 19:51:47.728230995,12770605,T,IEX,116.785000,400
2019-10-17 19:51:50.989515008,2019-10-17 19:51:50.989493914,12772379,T,IEX,116.790000,100
2019-10-17 19:52:05.732430080,2019-10-17 19:52:05.732411367,12780312,T,IEX,116.790000,100
2019-10-17 19:52:25.700325120,2019-10-17 19:52:25.700303515,12791032,T,IEX,116.790000,100
2019-10-17 19:52:31.161798912,2019-10-17 19:52:31.161778434,12793684,T,IEX,116.790000,60
2019-10-17 19:52:32.383064064,2019-10-17 19:52:32.383044344,12794128,T,IEX,116.780000,100
2019-10-17 19:52:35.248801024,2019-10-17 19:52:35.248778116,12796354,T,IEX,116.790000,100
2019-10-17 19:52:35.249313024,2019-10-17 19:52:35.249296673,12796356,T,IEX,116.790000,47
2019-10-17 19:52:35.249349120,2019-10-17 19:52:35.249332830,12796358,T,IEX,116.790000,100
2019-10-17 19:52:35.249392128,2019-10-17 19:52:35.249374416,12796359,T,IEX,116.790000,40
2019-10-17 19:52:59.521529088,2019-10-17 19:52:59.521508372,12810000,T,IEX,116.750000,100
2019-10-17 19:53:22.455832064,2019-10-17 19:53:22.455814199,12826224,T,IEX,116.735000,900
2019-10-17 19:53:24.368911104,2019-10-17 19:53:24.368887563,12827196,T,IEX,116.740000,100
2019-10-17 19:53:30.921346048,2019-10-17 19:53:30.921328224,12831717,T,IEX,116.740000,16
2019-10-17 19:53:31.55278080,2019-10-17 19:53:31.55261602,12831810,T,IEX,116.740000,17
2019-10-17 19:53:31.192985088,2019-10-17 19:53:31.192964719,12831896,T,IEX,116.740000,100
2019-10-17 19:53:32.174782976,2019-10-17 19:53:32.174760334,12832404,T,IEX,116.740000,17
2019-10-17 19:53:47.884026880,2019-10-17 19:53:47.884006762,12842051,T,IEX,116.735000,388
2019-10-17 19:53:51.267352064,2019-10-17 19:53:51.267332433,12844395,T,IEX,116.725000,100
2019-10-17 19:54:06.449318912,2019-10-17 19:54:06.449296373,12857662,T,IEX,116.720000,761
2019-10-17 19:54:06.775630080,2019-10-17 19:54:06.775614126,12857869,T,IEX,116.715000,1239
2019-10-17 19:54:06.780621056,2019-10-17 19:54:06.780603294,12857872,T,IEX,116.720000,100
2019-10-17 19:54:14.148419072,2019-10-17 19:54:14.148399096,12863428,T,IEX,116.710000,100
2019-10-17 19:54:19.153072128,2019-10-17 19:54:19.153054485,12868301,T,IEX,116.700000,100
2019-10-17 19:54:19.153090048,2019-10-17 19:54:19.153074097,12868302,T,IEX,116.700000,100
2019-10-17 19:54:20.707072,2019-10-17 19:54:20.684515,12868843,T,IEX,116.700000,100
2019-10-17 19:54:20.307753984,2019-10-17 19:54:20.307732885,12869061,T,IEX,116.700000,100
2019-10-17 19:54:22.471747072,2019-10-17 19:54:22.471725329,12870694,T,IEX,116.695000,100
2019-10-17 19:54:27.998533120,2019-10-17 19:54:27.998516033,12875616,T,IEX,116.735000,2
2019-10-17 19:54:30.390117888,2019-10-17 19:54:30.390099117,12877568,T,IEX,116.725000,100
2019-10-17 19:54:40.940934912,2019-10-17 19:54:40.940914010,12886213,T,IEX,116.695000,100
2019-10-17 19:54:41.132008960,2019-10-17 19:54:41.131988429,12886376,T,IEX,116.700000,300
2019-10-17 19:54:41.132058112,2019-10-17 19:54:41.132041492,12886377,T,IEX,116.695000,100
2019-10-17 19:54:45.79909120,2019-10-17 19:54:45.79886578,12889340,T,IEX,116.705000,100
2019-10-17 19:54:51.402811904,2019-10-17 19:54:51.402791955,12894276,T,IEX,116.710000,12
2019-10-17 19:54:55.553712896,2019-10-17 19:54:55.553691339,12897928,T,IEX,116.705000,257
2019-10-17 19:55:05.75516928,2019-10-17 19:55:05.75499586,12920619,T,IEX,116.670000,88
2019-10-17 19:55:15.541963008,2019-10-17 19:55:15.541943987,12934064,T,IEX,116.660000,100
2019-10-17 19:55:21.843960064,2019-10-17 19:55:21.843938037,12940523,T,IEX,116.655000,249
2019-10-17 19:55:26.132187904,2019-10-17 19:55:26.132170376,12946332,T,IEX,116.645000,100
2019-10-17 19:55:27.825448960,2019-10-17 19:55:27.825429767,12947816,T,IEX,116.640000,100
2019-10-17 19:55:28.863857920,2019-10-17 19:55:28.863836814,12948581,T,IEX,116.635000,100
2019-10-17 19:55:31.697286912,2019-10-17 19:55:31.697267724,12951173,T,IEX,116.625000,100
2019-10-17 19:55:45.57828096,2019-10-17 19:55:45.57808923,12963461,T,IEX,116.605000,113
2019-10-17 19:55:46.557530880,2019-10-17 19:55:46.557510605,12964543,T,IEX,116.605000,100
2019-10-17 19:56:01.28590080,2019-10-17 19:56:01.28571124,12978726,T,IEX,116.575000,100
2019-10-17 19:56:04.261131008,2019-10-17 19:56:04.261112495,12981872,T,IEX,116.585000,4
2019-10-17 19:56:06.395923968,2019-10-17 19:56:06.395906497,12984130,T,IEX,116.595000,2
2019-10-17 19:56:07.897170944,2019-10-17 19:56:07.897149351,12985915,T,IEX,116.595000,100
2019-10-17 19:56:12.185760000,2019-10-17 19:56:12.185739573,12990921,T,IEX,116.595000,100
2019-10-17 19:56:14.326838016,2019-10-17 19:56:14.326816324,12993418,T,IEX,116.590000,100
2019-10-17 19:56:16.584183040,2019-10-17 19:56:16.584164612,12995312,T,IEX,116.585000,100
2019-10-17 19:56:17.825728000,2019-10-17 19:56:17.825707807,12996123,T,IEX,116.580000,100
2019-10-17 19:56:26.796208128,2019-10-17 19:56:26.796193066,13002473,T,IEX,116.585000,100
2019-10-17 19:56:26.828592128,2019-10-17 19:56:26.828516498,13002501,T,IEX,116.580000,100
2019-10-17 19:56:27.86468096,2019-10-17 19:56:27.86450259,13002983,T,IEX,116.570000,100
2019-10-17 19:56:37.208224000,2019-10-17 19:56:37.208208276,13011929,T,IEX,116.565000,2
2019-10-17 19:56:37.229669120,2019-10-17 19:56:37.229651548,13011957,T,IEX,116.570000,4
2019-10-17 19:56:41.597373952,2019-10-17 19:56:41.597354077,13015164,T,IEX,116.565000,100
2019-10-17 19:56:44.119755008,2019-10-17 19:56:44.119732365,13016965,T,IEX,116.565000,100
2019-10-17 19:56:53.102093056,2019-10-17 19:56:53.102073081,13027262,T,IEX,116.555000,100
2019-10-17 19:56:54.654098944,2019-10-17 19:56:54.654077561,13028732,T,IEX,116.555000,100
2019-10-17 19:57:07.268770048,2019-10-17 19:57:07.268749900,13040853,T,IEX,116.565000,100
2019-10-17 19:57:09.866685952,2019-10-17 19:57:09.866665659,13043120,T,IEX,116.580000,16
2019-10-17 19:57:09.867036928,2019-10-17 19:57:09.867019814,13043123,T,IEX,116.580000,84
2019-10-17 19:57:12.141536000,2019-10-17 19:57:12.141515036,13045140,T,IEX,116.575000,100
2019-10-17 19:57:35.479744000,2019-10-17 19:57:35.479724208,13067707,T,IEX,116.630000,100
2019-10-17 19:57:47.167643904,2019-10-17 19:57:47.167627061,13078957,T,IEX,116.620000,100
2019-10-17 19:57:51.40037888,2019-10-17 19:57:51.40019855,13083376,T,IEX,116.625000,100
2019-10-17 19:57:55.600950016,2019-10-17 19:57:55.600930514,13087130,T,IEX,116.625000,300
2019-10-17 19:57:58.403727104,2019-10-17 19:57:58.403708462,13089889,T,IEX,116.625000,100
2019-10-17 19:57:58.700000000,2019-10-17 19:57:58.699980288,13090403,T,IEX,116.635000,100
2019-10-17 19:58:00.668069120,2019-10-17 19:58:00.668052527,13093629,T,IEX,116.645000,100
2019-10-17 19:58:01.519907072,2019-10-17 19:58:01.519888570,13094928,T,IEX,116.640000,8
2019-10-17 19:58:01.871401984,2019-10-17 19:58:01.871386065,13095312,T,IEX,116.640000,100
2019-10-17 19:58:03.919597056,2019-10-17 19:58:03.919578970,13097839,T,IEX,116.640000,100
2019-10-17 19:58:06.941124096,2019-10-17 19:58:06.941104797,13101764,T,IEX,116.650000,100
2019-10-17 19:58:09.801768960,2019-10-17 19:58:09.801749133,13106137,T,IEX,116.655000,100
2019-10-17 19:58:12.858464000,2019-10-17 19:58:12.858448621,13109684,T,IEX,116.655000,100
2019-10-17 19:58:14.22408960,2019-10-17 19:58:14.22387411,13110936,T,IEX,116.655000,100
2019-10-17 19:58:19.610558976,2019-10-17 19:58:19.610542169,13117661,T,IEX,116.665000,100
2019-10-17 19:58:21.202227968,2019-10-17 19:58:21.202211327,13120198,T,IEX,116.665000,100
2019-10-17 19:58:26.167930112,2019-10-17 19:58:26.167912049,13126697,T,IEX,116.685000,5
2019-10-17 19:58:26.181102080,2019-10-17 19:58:26.181080752,13127192,T,IEX,116.670000,100
2019-10-17 19:58:26.192864000,2019-10-17 19:58:26.192845980,13127615,T,IEX,116.670000,100
2019-10-17 19:58:26.203876096,2019-10-17 19:58:26.203858504,13127988,T,IEX,116.670000,100
2019-10-17 19:58:28.300148992,2019-10-17 19:58:28.300129023,13131573,T,IEX,116.670000,100
2019-10-17 19:58:30.104096000,2019-10-17 19:58:30.104077615,13133195,T,IEX,116.675000,100
2019-10-17 19:58:30.540123904,2019-10-17 19:58:30.540102165,13133825,T,IEX,116.675000,100
2019-10-17 19:58:31.366211072,2019-10-17 19:58:31.366193263,13134774,T,IEX,116.675000,100
2019-10-17 19:58:33.484193024,2019-10-17 19:58:33.484174729,13136773,T,IEX,116.685000,100
2019-10-17 19:58:37.803012096,2019-10-17 19:58:37.802993341,13141019,T,IEX,116.695000,100
2019-10-17 19:58:39.4854016,2019-10-17 19:58:39.4835261,13142225,T,IEX,116.685000,100
2019-10-17 19:58:39.6083072,2019-10-17 19:58:39.6066203,13142230,T,IEX,116.685000,100
2019-10-17 19:58:40.864123904,2019-10-17 19:58:40.864106731,13144110,T,IEX,116.665000,100
2019-10-17 19:58:40.864211968,2019-10-17 19:58:40.864194954,13144111,T,IEX,116.665000,100
2019-10-17 19:58:42.673600000,2019-10-17 19:58:42.673580013,13146096,T,IEX,116.665000,100
2019-10-17 19:58:43.901058048,2019-10-17 19:58:43.901038826,13147109,T,IEX,116.665000,200
2019-10-17 19:58:45.803677952,2019-10-17 19:58:45.803661809,13149524,T,IEX,116.665000,200
2019-10-17 19:58:48.202320896,2019-10-17 19:58:48.202300158,13152428,T,IEX,116.670000,4
2019-10-17 19:58:49.462880000,2019-10-17 19:58:49.462861114,13154151,T,IEX,116.665000,100
2019-10-17 19:58:51.603720960,2019-10-17 19:58:51.603701826,13156253,T,IEX,116.665000,100
2019-10-17 19:59:04.675294976,2019-10-17 19:59:04.675276249,13175196,T,IEX,116.645000,100
2019-10-17 19:59:06.700826112,2019-10-17 19:59:06.700808086,13177901,T,IEX,116.635000,900
2019-10-17 19:59:06.702508032,2019-10-17 19:59:06.702487612,13177903,T,IEX,116.635000,2000
2019-10-17 19:59:07.151408128,2019-10-17 19:59:07.151389856,13178631,T,IEX,116.620000,100
2019-10-17 19:59:12.837687040,2019-10-17 19:59:12.837670464,13187261,T,IEX,116.625000,35
2019-10-17 19:59:15.206104064,2019-10-17 19:59:15.206086605,13191390,T,IEX,116.590000,100
2019-10-17 19:59:15.289821952,2019-10-17 19:59:15.289804600,13191586,T,IEX,116.590000,100
2019-10-17 19:59:15.290068992,2019-10-17 19:59:15.290050803,13191589,T,IEX,116.590000,68
2019-10-17 19:59:15.290106880,2019-10-17 19:59:15.290090347,13191590,T,IEX,116.590000,32
2019-10-17 19:59:15.290115072,2019-10-17 19:59:15.290099132,13191591,T,IEX,116.590000,68
2019-10-17 19:59:15.893227008,2019-10-17 19:59:15.893209237,13192785,T,IEX,116.595000,94
2019-10-17 19:59:19.893651968,2019-10-17 19:59:19.893634969,13199203,T,IEX,116.575000,50
2019-10-17 19:59:20.701281024,2019-10-17 19:59:20.701260817,13200347,T,IEX,116.575000,2
2019-10-17 19:59:23.75354112,2019-10-17 19:59:23.75339080,13203513,T,IEX,116.570000,100
2019-10-17 19:59:24.18188032,2019-10-17 19:59:24.18171626,13204575,T,IEX,116.560000,200
2019-10-17 19:59:29.771705088,2019-10-17 19:59:29.771681753,13211755,T,IEX,116.555000,20
2019-10-17 19:59:29.773871104,2019-10-17 19:59:29.773852964,13211758,T,IEX,116.555000,50
2019-10-17 19:59:33.65585920,2019-10-17 19:59:33.65567567,13231778,T,IEX,116.555000,100
2019-10-17 19:59:33.528093952,2019-10-17 19:59:33.528076669,13233980,T,IEX,116.555000,30
2019-10-17 19:59:38.677736960,2019-10-17 19:59:38.677718925,13266064,T,IEX,116.615000,1
2019-10-17 19:59:38.934807040,2019-10-17 19:59:38.934789504,13267246,T,IEX,116.620000,100
2019-10-17 19:59:47.528393984,2019-10-17 19:59:47.528377098,13324627,T,IEX,116.640000,7
2019-10-17 19:59:53.311291904,2019-10-17 19:59:53.311273672,13364481,T,IEX,116.620000,100
