2019-10-14 14:00:33.816346112,2019-10-14 14:00:33.816328209,1738289,T,IEX,17.490000,200
2019-10-14 15:01:45.51997952,2019-10-14 15:01:45.51980128,4054881,T,IEX,17.590000,100
2019-10-14 15:39:22.346014976,2019-10-14 15:39:22.345996657,5187770,T,IEX,17.370000,100
2019-10-14 16:07:51.450536960,2019-10-14 16:07:51.450517742,5843710,T,IEX,17.390000,100
