2019-10-07 13:37:49.855384064,2019-10-07 13:37:49.855361635,565200,T,IEX,30.235000,100
2019-10-07 13:37:49.937044992,2019-10-07 13:37:49.937027289,565224,T,IEX,30.235000,100
2019-10-07 13:37:50.51048960,2019-10-07 13:37:50.51031225,565265,T,IEX,30.235000,100
2019-10-07 13:41:39.668390912,2019-10-07 13:41:39.668370309,744356,T,IEX,30.220000,100
2019-10-07 13:48:55.180154880,2019-10-07 13:48:55.180135453,1118116,T,IEX,30.265000,100
2019-10-07 13:52:22.506234112,2019-10-07 13:52:22.506215296,1304330,T,IEX,30.185000,67
2019-10-07 13:59:07.100357888,2019-10-07 13:59:07.100334757,1639050,T,IEX,30.220000,100
2019-10-07 13:59:07.100395008,2019-10-07 13:59:07.100376428,1639052,T,IEX,30.220000,1000
2019-10-07 14:22:40.795164928,2019-10-07 14:22:40.795144791,2778965,T,IEX,30.135000,300
2019-10-07 14:22:40.795988992,2019-10-07 14:22:40.795967007,2778989,T,IEX,30.135000,100
2019-10-07 14:22:40.797533952,2019-10-07 14:22:40.797514651,2779033,T,IEX,30.135000,200
2019-10-07 14:22:40.799463936,2019-10-07 14:22:40.799445345,2779064,T,IEX,30.135000,100
2019-10-07 14:22:40.803785984,2019-10-07 14:22:40.803766619,2779100,T,IEX,30.135000,200
2019-10-07 14:23:04.617144064,2019-10-07 14:23:04.617125542,2791393,T,IEX,30.135000,100
2019-10-07 14:27:39.969123072,2019-10-07 14:27:39.969103686,2987392,T,IEX,30.085000,300
2019-10-07 14:27:39.970096128,2019-10-07 14:27:39.970078773,2987407,T,IEX,30.085000,100
2019-10-07 14:27:40.485121024,2019-10-07 14:27:40.485103995,2987773,T,IEX,30.085000,200
2019-10-07 14:27:50.592765952,2019-10-07 14:27:50.592746611,2993302,T,IEX,30.080000,100
2019-10-07 14:34:01.514644992,2019-10-07 14:34:01.514625694,3245000,T,IEX,30.080000,100
2019-10-07 14:57:55.100047104,2019-10-07 14:57:55.100028950,4273707,T,IEX,30.030000,24
