2019-10-15 13:31:11.722007040,2019-10-15 13:31:11.721976076,190485,T,IEX,52.200000,192
2019-10-15 13:41:22.288599040,2019-10-15 13:41:22.288579562,750943,T,IEX,52.200000,200
2019-10-15 13:41:22.289851904,2019-10-15 13:41:22.289831508,750998,T,IEX,52.200000,12
2019-10-15 13:41:23.623127040,2019-10-15 13:41:23.623109291,752102,T,IEX,52.200000,19
2019-10-15 13:48:58.676397056,2019-10-15 13:48:58.676375826,1140346,T,IEX,52.335000,200
2019-10-15 14:02:00.785881088,2019-10-15 14:02:00.785862027,1724688,T,IEX,52.310000,100
2019-10-15 14:02:00.786359040,2019-10-15 14:02:00.786340987,1724711,T,IEX,52.310000,10
2019-10-15 14:02:00.787326976,2019-10-15 14:02:00.787309742,1724766,T,IEX,52.310000,100
2019-10-15 14:31:30.892293120,2019-10-15 14:31:30.892273389,3195762,T,IEX,52.850000,100
2019-10-15 14:31:35.75357952,2019-10-15 14:31:35.75335799,3199579,T,IEX,52.850000,100
2019-10-15 14:31:37.256122880,2019-10-15 14:31:37.256099640,3202254,T,IEX,52.850000,100
2019-10-15 14:31:37.258825984,2019-10-15 14:31:37.258807017,3202359,T,IEX,52.850000,100
2019-10-15 14:31:37.494487040,2019-10-15 14:31:37.494465802,3202771,T,IEX,52.850000,100
2019-10-15 14:38:20.330268928,2019-10-15 14:38:20.330238538,3648898,T,IEX,53.100000,100
2019-10-15 14:39:37.281519104,2019-10-15 14:39:37.281496359,3733271,T,IEX,53.090000,200
2019-10-15 14:40:56.605602048,2019-10-15 14:40:56.605583202,3827397,T,IEX,53.170000,1000
2019-10-15 14:41:30.954650880,2019-10-15 14:41:30.954622464,3875880,T,IEX,53.150000,100
2019-10-15 15:09:14.981498112,2019-10-15 15:09:14.981479698,5354751,T,IEX,53.360000,200
2019-10-15 15:21:05.373670912,2019-10-15 15:21:05.373649118,5911144,T,IEX,53.120000,100
2019-10-15 15:26:34.263560960,2019-10-15 15:26:34.263533180,6186483,T,IEX,53.200000,112
2019-10-15 15:26:37.161538048,2019-10-15 15:26:37.161521385,6188774,T,IEX,53.200000,75
2019-10-15 15:26:37.161764096,2019-10-15 15:26:37.161744489,6188778,T,IEX,53.200000,82
2019-10-15 15:28:02.176718080,2019-10-15 15:28:02.176695264,6240200,T,IEX,53.160000,200
2019-10-15 15:33:32.876251904,2019-10-15 15:33:32.876232906,6446140,T,IEX,53.240000,100
2019-10-15 15:33:32.876352000,2019-10-15 15:33:32.876325396,6446144,T,IEX,53.240000,100
2019-10-15 16:25:12.644489984,2019-10-15 16:25:12.644470690,7936898,T,IEX,53.200000,100
2019-10-15 16:34:37.478555904,2019-10-15 16:34:37.478536954,8181326,T,IEX,53.190000,100
2019-10-15 16:34:37.478864896,2019-10-15 16:34:37.478846896,8181338,T,IEX,53.190000,100
2019-10-15 16:39:58.661886976,2019-10-15 16:39:58.661865556,8284580,T,IEX,53.210000,1000
2019-10-15 16:42:23.55660032,2019-10-15 16:42:23.55632126,8338120,T,IEX,53.200000,100
2019-10-15 18:05:02.444332032,2019-10-15 18:05:02.444312301,10055722,T,IEX,53.380000,224
2019-10-15 18:05:02.444445952,2019-10-15 18:05:02.444416742,10055731,T,IEX,53.380000,13
2019-10-15 18:32:57.779902976,2019-10-15 18:32:57.779879282,10645012,T,IEX,53.400000,246
2019-10-15 18:56:16.562362880,2019-10-15 18:56:16.562335031,11132442,T,IEX,53.320000,700
2019-10-15 19:00:00.45945088,2019-10-15 19:00:00.45925013,11240487,T,IEX,53.270000,100
2019-10-15 19:03:22.699128064,2019-10-15 19:03:22.699103654,11321323,T,IEX,53.200000,200
2019-10-15 19:03:22.699450112,2019-10-15 19:03:22.699431285,11321335,T,IEX,53.200000,51
2019-10-15 19:09:33.544297984,2019-10-15 19:09:33.544279563,11453816,T,IEX,53.210000,100
2019-10-15 19:09:33.776448000,2019-10-15 19:09:33.776430814,11454031,T,IEX,53.210000,100
2019-10-15 19:09:34.953618944,2019-10-15 19:09:34.953599552,11454694,T,IEX,53.205000,43
2019-10-15 19:30:54.283969024,2019-10-15 19:30:54.283950100,11939338,T,IEX,53.300000,224
2019-10-15 19:32:12.833564928,2019-10-15 19:32:12.833544415,11977979,T,IEX,53.305000,1
2019-10-15 19:46:19.221155072,2019-10-15 19:46:19.221137727,12439190,T,IEX,53.180000,100
2019-10-15 19:46:19.221172992,2019-10-15 19:46:19.221157066,12439191,T,IEX,53.180000,200
2019-10-15 19:48:55.489851904,2019-10-15 19:48:55.489819075,12536103,T,IEX,53.140000,100
2019-10-15 19:50:00.262688000,2019-10-15 19:50:00.262670693,12585023,T,IEX,53.120000,100
2019-10-15 19:50:46.182243072,2019-10-15 19:50:46.182224730,12624307,T,IEX,53.170000,100
2019-10-15 19:50:55.336404992,2019-10-15 19:50:55.336388922,12629065,T,IEX,53.170000,100
2019-10-15 19:51:01.321854976,2019-10-15 19:51:01.321838004,12633202,T,IEX,53.170000,100
2019-10-15 19:51:25.792630016,2019-10-15 19:51:25.792600717,12650687,T,IEX,53.170000,100
2019-10-15 19:52:48.269218048,2019-10-15 19:52:48.269191017,12705705,T,IEX,53.170000,100
2019-10-15 19:53:41.826641920,2019-10-15 19:53:41.826624298,12743712,T,IEX,53.140000,100
2019-10-15 19:54:00.919464960,2019-10-15 19:54:00.919445385,12759936,T,IEX,53.110000,100
2019-10-15 19:54:16.851544064,2019-10-15 19:54:16.851526505,12771761,T,IEX,53.115000,100
2019-10-15 19:54:18.589006080,2019-10-15 19:54:18.588986778,12772729,T,IEX,53.115000,100
2019-10-15 19:54:28.716150016,2019-10-15 19:54:28.716122481,12781420,T,IEX,53.100000,100
2019-10-15 19:55:24.56183040,2019-10-15 19:55:24.56161399,12862008,T,IEX,53.090000,100
2019-10-15 19:55:24.67258880,2019-10-15 19:55:24.67240885,12862463,T,IEX,53.100000,100
2019-10-15 19:55:24.725776896,2019-10-15 19:55:24.725756767,12864105,T,IEX,53.105000,100
2019-10-15 19:56:32.943574016,2019-10-15 19:56:32.943555125,12932379,T,IEX,53.140000,100
2019-10-15 19:56:34.134116096,2019-10-15 19:56:34.134097451,12934932,T,IEX,53.120000,100
2019-10-15 19:56:54.335897088,2019-10-15 19:56:54.335871736,12955650,T,IEX,53.110000,100
2019-10-15 19:57:32.47126016,2019-10-15 19:57:32.47108910,12997280,T,IEX,53.085000,100
2019-10-15 19:57:55.856651008,2019-10-15 19:57:55.856633668,13021271,T,IEX,53.100000,100
2019-10-15 19:59:32.661219072,2019-10-15 19:59:32.661200469,13181195,T,IEX,53.100000,7
