Name,Time,Cumulative PnL
MVWAP,2023-Jan-03 14:30:16.511613,0.000000
MVWAP,2023-Jan-03 14:31:18.041999,0.000000
MVWAP,2023-Jan-03 14:32:19.922905,0.000000
MVWAP,2023-Jan-03 14:33:22.561490,0.000000
MVWAP,2023-Jan-03 14:34:26.263281,0.000000
MVWAP,2023-Jan-03 14:35:26.785327,0.000000
MVWAP,2023-Jan-03 14:36:27.302742,0.000000
MVWAP,2023-Jan-03 14:37:28.104096,0.000000
MVWAP,2023-Jan-03 14:38:28.440521,5.043495
MVWAP,2023-Jan-03 14:39:28.789299,7.748350
MVWAP,2023-Jan-03 14:40:32.182627,7.748350
MVWAP,2023-Jan-03 14:41:32.682295,7.748350
MVWAP,2023-Jan-03 14:42:34.454803,7.748350
MVWAP,2023-Jan-03 14:43:35.163288,-9.983009
MVWAP,2023-Jan-03 14:44:36.482281,-112.919009
MVWAP,2023-Jan-03 14:45:37.017643,-112.919009
MVWAP,2023-Jan-03 14:46:41.138157,-62.519009
MVWAP,2023-Jan-03 14:47:42.625492,-279.227009
MVWAP,2023-Jan-03 14:48:43.493799,-308.398555
MVWAP,2023-Jan-03 14:49:44.497235,-275.965751
MVWAP,2023-Jan-03 14:50:45.942909,-275.965751
MVWAP,2023-Jan-03 14:51:47.957495,-221.901751
MVWAP,2023-Jan-03 14:52:48.777932,-306.901751
MVWAP,2023-Jan-03 14:53:49.718204,-303.563751
MVWAP,2023-Jan-03 14:54:50.571873,-1559.563751
MVWAP,2023-Jan-03 14:55:51.276129,-1565.292891
MVWAP,2023-Jan-03 14:56:51.728783,-384.492891
MVWAP,2023-Jan-03 14:57:52.387226,-995.521696
MVWAP,2023-Jan-03 14:58:53.142020,-1005.740313
MVWAP,2023-Jan-03 14:59:56.564155,-511.658856
MVWAP,2023-Jan-03 15:00:56.673980,-1006.058856
MVWAP,2023-Jan-03 15:01:58.233998,-1130.294856
MVWAP,2023-Jan-03 15:03:01.593061,-1130.294856
MVWAP,2023-Jan-03 15:04:04.966848,-1135.723708
MVWAP,2023-Jan-03 15:05:06.225083,-444.295708
MVWAP,2023-Jan-03 15:06:07.428035,-468.924620
MVWAP,2023-Jan-03 15:07:08.434226,-1258.217364
MVWAP,2023-Jan-03 15:08:11.384748,-472.938692
MVWAP,2023-Jan-03 15:09:15.997689,-529.870692
MVWAP,2023-Jan-03 15:10:16.285308,-638.853403
MVWAP,2023-Jan-03 15:11:16.607540,-1191.445945
MVWAP,2023-Jan-03 15:12:16.926222,-1104.138333
MVWAP,2023-Jan-03 15:13:17.185347,-1186.074333
MVWAP,2023-Jan-03 15:14:17.488432,-724.374333
MVWAP,2023-Jan-03 15:15:19.263353,-747.380333
MVWAP,2023-Jan-03 15:16:20.578884,-693.544439
MVWAP,2023-Jan-03 15:17:21.145456,-736.488552
MVWAP,2023-Jan-03 15:18:22.632931,-1436.488552
MVWAP,2023-Jan-03 15:19:23.435824,-1436.488552
MVWAP,2023-Jan-03 15:20:23.674379,-964.380040
MVWAP,2023-Jan-03 15:21:24.274461,-1452.416040
MVWAP,2023-Jan-03 15:22:25.809996,-1453.333770
MVWAP,2023-Jan-03 15:23:27.015058,-1398.425432
MVWAP,2023-Jan-03 15:24:27.248838,-1471.061432
MVWAP,2023-Jan-03 15:25:28.572367,-874.579296
MVWAP,2023-Jan-03 15:26:29.628805,-888.207160
MVWAP,2023-Jan-03 15:27:30.795620,-875.116902
MVWAP,2023-Jan-03 15:28:31.414366,-1412.616902
MVWAP,2023-Jan-03 15:29:32.848427,-946.924620
MVWAP,2023-Jan-03 15:30:33.060427,-947.070295
MVWAP,2023-Jan-03 15:31:33.745051,-1019.597809
MVWAP,2023-Jan-03 15:32:34.175788,-869.925526
MVWAP,2023-Jan-03 15:33:34.335603,-958.517141
MVWAP,2023-Jan-03 15:34:36.211468,-1075.043141
MVWAP,2023-Jan-03 15:35:36.549387,-910.730951
MVWAP,2023-Jan-03 15:36:36.908623,-864.542951
MVWAP,2023-Jan-03 15:37:37.102607,-869.904852
MVWAP,2023-Jan-03 15:38:37.446820,-881.104852
MVWAP,2023-Jan-03 15:39:38.417476,-830.704852
MVWAP,2023-Jan-03 15:40:39.031539,-801.122884
MVWAP,2023-Jan-03 15:41:39.740323,-771.871032
MVWAP,2023-Jan-03 15:42:43.325370,-805.455274
MVWAP,2023-Jan-03 15:43:44.789211,-816.647400
MVWAP,2023-Jan-03 15:44:46.466565,-792.775560
MVWAP,2023-Jan-03 15:45:46.675815,-727.811560
MVWAP,2023-Jan-03 15:46:47.568879,-659.803928
MVWAP,2023-Jan-03 15:47:48.161007,-686.875928
MVWAP,2023-Jan-03 15:48:49.075378,-754.875928
MVWAP,2023-Jan-03 15:49:49.325541,-733.484265
MVWAP,2023-Jan-03 15:50:50.462221,-789.612599
MVWAP,2023-Jan-03 15:51:51.034675,-1194.212599
MVWAP,2023-Jan-03 15:52:51.661641,-798.832388
MVWAP,2023-Jan-03 15:53:52.315949,-1217.668388
MVWAP,2023-Jan-03 15:54:53.076128,-900.996474
MVWAP,2023-Jan-03 15:55:54.169107,-812.632474
MVWAP,2023-Jan-03 15:56:54.939013,-698.424566
MVWAP,2023-Jan-03 15:57:55.659095,-632.483063
MVWAP,2023-Jan-03 15:58:56.527590,-632.483063
MVWAP,2023-Jan-03 15:59:56.815824,-549.811640
MVWAP,2023-Jan-03 16:00:57.861798,-475.011640
MVWAP,2023-Jan-03 16:01:59.072463,-545.047640
MVWAP,2023-Jan-03 16:03:01.646755,-598.276444
MVWAP,2023-Jan-03 16:04:03.001015,-605.676444
MVWAP,2023-Jan-03 16:05:04.015399,-736.212444
MVWAP,2023-Jan-03 16:06:05.175714,-748.204866
MVWAP,2023-Jan-03 16:07:06.094846,-793.540866
MVWAP,2023-Jan-03 16:08:07.832907,-847.076866
MVWAP,2023-Jan-03 16:09:10.240576,-827.369113
MVWAP,2023-Jan-03 16:10:10.980532,-1363.369113
MVWAP,2023-Jan-03 16:11:11.823678,-1135.796809
MVWAP,2023-Jan-03 16:12:14.367508,-1232.532809
MVWAP,2023-Jan-03 16:13:16.047565,-1421.856405
MVWAP,2023-Jan-03 16:14:18.711003,-1421.856405
MVWAP,2023-Jan-03 16:15:22.383444,-1734.447402
MVWAP,2023-Jan-03 16:16:25.730705,-1587.783402
MVWAP,2023-Jan-03 16:17:28.885995,-1606.183402
MVWAP,2023-Jan-03 16:18:30.875339,-1753.383402
MVWAP,2023-Jan-03 16:19:34.096657,-1807.155402
MVWAP,2023-Jan-03 16:20:35.650725,-1523.346722
MVWAP,2023-Jan-03 16:21:37.021915,-1619.682722
MVWAP,2023-Jan-03 16:22:41.624699,-1823.718722
MVWAP,2023-Jan-03 16:23:42.682094,-1405.718722
MVWAP,2023-Jan-03 16:24:44.177745,-1834.536082
MVWAP,2023-Jan-03 16:25:45.539118,-1439.472082
MVWAP,2023-Jan-03 16:26:47.027772,-1487.263247
MVWAP,2023-Jan-03 16:27:47.532620,-1569.999247
MVWAP,2023-Jan-03 16:28:47.902573,-1630.926621
MVWAP,2023-Jan-03 16:29:50.109321,-1852.617611
MVWAP,2023-Jan-03 16:30:51.250870,-1870.353611
MVWAP,2023-Jan-03 16:31:52.343054,-1832.590805
MVWAP,2023-Jan-03 16:32:53.667879,-2110.738525
MVWAP,2023-Jan-03 16:33:56.206234,-1712.810525
MVWAP,2023-Jan-03 16:34:58.108702,-2191.546525
MVWAP,2023-Jan-03 16:35:59.093509,-1865.682525
MVWAP,2023-Jan-03 16:37:02.912269,-1865.682525
MVWAP,2023-Jan-03 16:38:04.090405,-1832.182525
MVWAP,2023-Jan-03 16:39:05.523840,-1834.318525
MVWAP,2023-Jan-03 16:40:08.985348,-1839.454525
MVWAP,2023-Jan-03 16:41:10.281005,-1845.490525
MVWAP,2023-Jan-03 16:42:11.731888,-2295.526525
MVWAP,2023-Jan-03 16:43:14.939041,-2295.526525
MVWAP,2023-Jan-03 16:44:16.466900,-2014.461120
MVWAP,2023-Jan-03 16:45:17.384229,-2122.597120
MVWAP,2023-Jan-03 16:46:17.876250,-2059.133120
MVWAP,2023-Jan-03 16:47:18.065182,-2510.133120
MVWAP,2023-Jan-03 16:48:18.472990,-2223.133120
MVWAP,2023-Jan-03 16:49:21.314637,-2064.939896
MVWAP,2023-Jan-03 16:50:23.539010,-2507.739896
MVWAP,2023-Jan-03 16:51:24.014793,-2285.766564
MVWAP,2023-Jan-03 16:52:24.200253,-2214.947172
MVWAP,2023-Jan-03 16:53:25.048119,-1946.347172
MVWAP,2023-Jan-03 16:54:25.327756,-2524.310001
MVWAP,2023-Jan-03 16:55:25.624258,-2529.453236
MVWAP,2023-Jan-03 16:56:26.015297,-2446.215675
MVWAP,2023-Jan-03 16:57:26.312346,-2546.042101
MVWAP,2023-Jan-03 16:58:26.423510,-2282.258783
MVWAP,2023-Jan-03 16:59:27.170364,-2169.115406
MVWAP,2023-Jan-03 17:00:27.786804,-2100.374957
MVWAP,2023-Jan-03 17:01:28.689971,-2145.752455
MVWAP,2023-Jan-03 17:02:28.805061,-2280.032513
MVWAP,2023-Jan-03 17:03:29.722203,-2265.868513
MVWAP,2023-Jan-03 17:04:29.934192,-2190.875161
MVWAP,2023-Jan-03 17:05:30.063112,-2234.501855
MVWAP,2023-Jan-03 17:06:30.117036,-2190.001855
MVWAP,2023-Jan-03 17:07:30.562418,-1967.501855
MVWAP,2023-Jan-03 17:08:31.349742,-2648.773855
MVWAP,2023-Jan-03 17:09:32.452944,-1841.273855
MVWAP,2023-Jan-03 17:10:35.503384,-2677.326786
MVWAP,2023-Jan-03 17:11:36.293967,-2679.143709
MVWAP,2023-Jan-03 17:12:36.862759,-1787.979709
MVWAP,2023-Jan-03 17:13:37.227828,-1760.350713
MVWAP,2023-Jan-03 17:14:38.098718,-1747.386713
MVWAP,2023-Jan-03 17:15:39.431767,-1888.786713
MVWAP,2023-Jan-03 17:16:39.818807,-1728.677771
MVWAP,2023-Jan-03 17:17:39.921537,-2715.513771
MVWAP,2023-Jan-03 17:18:40.217754,-2059.304634
MVWAP,2023-Jan-03 17:19:40.501286,-2148.140634
MVWAP,2023-Jan-03 17:20:40.748710,-2068.201477
MVWAP,2023-Jan-03 17:21:43.126558,-2057.237477
MVWAP,2023-Jan-03 17:22:43.584975,-2173.473477
MVWAP,2023-Jan-03 17:23:43.922222,-2735.073477
MVWAP,2023-Jan-03 17:24:44.954319,-2770.179876
MVWAP,2023-Jan-03 17:25:45.462654,-2484.960343
MVWAP,2023-Jan-03 17:26:45.906458,-2353.660343
MVWAP,2023-Jan-03 17:27:46.771805,-2286.296343
MVWAP,2023-Jan-03 17:28:47.593634,-2369.392394
MVWAP,2023-Jan-03 17:29:47.949548,-2483.328394
MVWAP,2023-Jan-03 17:30:48.919260,-2448.779069
MVWAP,2023-Jan-03 17:31:49.057217,-2042.179069
MVWAP,2023-Jan-03 17:32:49.308408,-2052.879069
MVWAP,2023-Jan-03 17:33:49.661826,-1763.979069
MVWAP,2023-Jan-03 17:34:50.241886,-1485.779069
MVWAP,2023-Jan-03 17:35:50.437580,-1421.579069
MVWAP,2023-Jan-03 17:36:50.928880,-1676.706315
MVWAP,2023-Jan-03 17:37:51.990662,-1708.806315
MVWAP,2023-Jan-03 17:38:52.249138,-2832.306315
MVWAP,2023-Jan-03 17:39:52.673885,-2802.597386
MVWAP,2023-Jan-03 17:40:53.650980,-2105.797386
MVWAP,2023-Jan-03 17:41:53.812600,-2802.597386
MVWAP,2023-Jan-03 17:42:54.764187,-2396.997386
MVWAP,2023-Jan-03 17:43:55.759593,-2808.633386
MVWAP,2023-Jan-03 17:44:56.215894,-2634.103974
MVWAP,2023-Jan-03 17:45:57.003300,-3087.439974
MVWAP,2023-Jan-03 17:46:57.145864,-6629.139974
MVWAP,2023-Jan-03 17:47:57.434886,-6629.139974
MVWAP,2023-Jan-03 17:49:00.470981,-3368.375974
MVWAP,2023-Jan-03 17:50:00.835855,-3327.092050
MVWAP,2023-Jan-03 17:51:01.520148,-3266.168189
MVWAP,2023-Jan-03 17:52:01.926522,-3221.884346
MVWAP,2023-Jan-03 17:53:02.412163,-3155.020346
MVWAP,2023-Jan-03 17:54:03.097574,-3291.200443
MVWAP,2023-Jan-03 17:55:04.391631,-3181.516573
MVWAP,2023-Jan-03 17:56:04.995046,-3374.552573
MVWAP,2023-Jan-03 17:57:05.093118,-3084.288573
MVWAP,2023-Jan-03 17:58:05.426746,-2591.214979
MVWAP,2023-Jan-03 17:59:05.747504,-2791.777391
MVWAP,2023-Jan-03 18:00:05.832285,-2815.577391
MVWAP,2023-Jan-03 18:01:06.282769,-2875.077391
MVWAP,2023-Jan-03 18:02:06.842202,-2882.939777
MVWAP,2023-Jan-03 18:03:07.141963,-3042.120035
MVWAP,2023-Jan-03 18:04:07.315974,-2701.456035
MVWAP,2023-Jan-03 18:05:07.607939,-2667.292035
MVWAP,2023-Jan-03 18:06:07.961306,-2869.408773
MVWAP,2023-Jan-03 18:07:08.146163,-2799.215098
MVWAP,2023-Jan-03 18:08:08.597623,-2750.415098
MVWAP,2023-Jan-03 18:09:09.038735,-2928.137465
MVWAP,2023-Jan-03 18:10:09.641849,-2915.627817
MVWAP,2023-Jan-03 18:11:09.814886,-2401.144250
MVWAP,2023-Jan-03 18:12:09.927283,-2534.470857
MVWAP,2023-Jan-03 18:13:10.965616,-2699.106857
MVWAP,2023-Jan-03 18:14:11.436377,-2949.106857
MVWAP,2023-Jan-03 18:15:12.240005,-2930.723176
MVWAP,2023-Jan-03 18:16:13.617515,-3027.295176
MVWAP,2023-Jan-03 18:17:13.902039,-2936.775501
MVWAP,2023-Jan-03 18:18:13.990910,-2894.811501
MVWAP,2023-Jan-03 18:19:14.177223,-2921.001860
MVWAP,2023-Jan-03 18:20:14.230283,-2959.737860
MVWAP,2023-Jan-03 18:21:14.746503,-3090.737860
MVWAP,2023-Jan-03 18:22:15.079575,-2986.228178
MVWAP,2023-Jan-03 18:23:15.196652,-2997.264178
MVWAP,2023-Jan-03 18:24:15.298334,-2591.164178
MVWAP,2023-Jan-03 18:25:15.648293,-2869.000178
MVWAP,2023-Jan-03 18:26:15.788408,-1502.090664
MVWAP,2023-Jan-03 18:27:15.902356,-1606.890664
MVWAP,2023-Jan-03 18:28:16.227313,-1974.462664
MVWAP,2023-Jan-03 18:29:16.513337,-1742.498664
MVWAP,2023-Jan-03 18:30:17.157270,-1669.489729
MVWAP,2023-Jan-03 18:31:17.856376,-1695.676774
MVWAP,2023-Jan-03 18:32:18.127032,-1694.467784
MVWAP,2023-Jan-03 18:33:18.322352,-1762.403784
MVWAP,2023-Jan-03 18:34:18.725908,-1763.621698
MVWAP,2023-Jan-03 18:35:18.783505,-1847.657698
MVWAP,2023-Jan-03 18:36:19.268335,-1696.618689
MVWAP,2023-Jan-03 18:37:19.564339,-2534.144689
MVWAP,2023-Jan-03 18:38:20.593494,-2511.325774
MVWAP,2023-Jan-03 18:39:21.395854,-1763.061774
MVWAP,2023-Jan-03 18:40:22.480002,-1791.652683
MVWAP,2023-Jan-03 18:41:22.822818,-1524.579748
MVWAP,2023-Jan-03 18:42:23.972926,-1618.379748
MVWAP,2023-Jan-03 18:43:24.742483,-1654.142718
MVWAP,2023-Jan-03 18:44:25.320755,-1859.642718
MVWAP,2023-Jan-03 18:45:25.836685,-1982.033581
MVWAP,2023-Jan-03 18:46:26.258061,-2214.369581
MVWAP,2023-Jan-03 18:47:26.410183,-2038.060356
MVWAP,2023-Jan-03 18:48:26.524519,-2020.796356
MVWAP,2023-Jan-03 18:49:27.692423,-1992.787205
MVWAP,2023-Jan-03 18:50:27.963465,-1952.594095
MVWAP,2023-Jan-03 18:51:28.269800,-1791.794095
MVWAP,2023-Jan-03 18:52:28.375578,-1697.620981
MVWAP,2023-Jan-03 18:53:28.599966,-2515.020981
MVWAP,2023-Jan-03 18:54:28.752367,-2512.348092
MVWAP,2023-Jan-03 18:55:29.357814,-1236.984092
MVWAP,2023-Jan-03 18:56:29.810008,-1170.901365
MVWAP,2023-Jan-03 18:57:30.136104,-1133.119870
MVWAP,2023-Jan-03 18:58:30.959233,-1173.319870
MVWAP,2023-Jan-03 18:59:31.484923,-1067.611135
MVWAP,2023-Jan-03 19:00:31.631995,-1264.111135
MVWAP,2023-Jan-03 19:01:31.897395,-1706.238428
MVWAP,2023-Jan-03 19:02:32.230958,-1562.729459
MVWAP,2023-Jan-03 19:03:32.660952,-1694.365459
MVWAP,2023-Jan-03 19:04:32.888961,-1672.656349
MVWAP,2023-Jan-03 19:05:33.085079,-2491.519379
MVWAP,2023-Jan-03 19:06:34.381492,-1692.419379
MVWAP,2023-Jan-03 19:07:34.921822,-1613.819379
MVWAP,2023-Jan-03 19:08:35.059785,-1253.010457
MVWAP,2023-Jan-03 19:09:35.475929,-1381.946457
MVWAP,2023-Jan-03 19:10:35.701635,-1395.371805
MVWAP,2023-Jan-03 19:11:35.959345,-1756.198815
MVWAP,2023-Jan-03 19:12:36.696466,-2455.589779
MVWAP,2023-Jan-03 19:13:37.004675,-2013.616588
MVWAP,2023-Jan-03 19:14:37.268720,-1913.616588
MVWAP,2023-Jan-03 19:15:37.607485,-1639.843471
MVWAP,2023-Jan-03 19:16:38.029955,-1477.343471
MVWAP,2023-Jan-03 19:17:38.341793,-1490.169471
MVWAP,2023-Jan-03 19:18:38.452389,-1659.013559
MVWAP,2023-Jan-03 19:19:39.004163,-1863.813559
MVWAP,2023-Jan-03 19:20:39.225150,-1803.104415
MVWAP,2023-Jan-03 19:21:39.839585,-1878.104415
MVWAP,2023-Jan-03 19:22:40.279592,-1794.540415
MVWAP,2023-Jan-03 19:23:40.874106,-1924.676415
MVWAP,2023-Jan-03 19:24:41.259124,-2422.476415
MVWAP,2023-Jan-03 19:25:41.341903,-2239.076415
MVWAP,2023-Jan-03 19:26:41.529609,-2498.703110
MVWAP,2023-Jan-03 19:27:41.952728,-2328.683765
MVWAP,2023-Jan-03 19:28:42.557946,-2436.819765
MVWAP,2023-Jan-03 19:29:43.205666,-2461.237026
MVWAP,2023-Jan-03 19:30:44.081598,-3174.699721
MVWAP,2023-Jan-03 19:31:44.396145,-2877.826281
MVWAP,2023-Jan-03 19:32:44.622393,-4908.514965
MVWAP,2023-Jan-03 19:33:45.534917,-3262.985286
MVWAP,2023-Jan-03 19:34:45.725656,-3174.321286
MVWAP,2023-Jan-03 19:35:46.545923,-3174.057286
MVWAP,2023-Jan-03 19:36:46.976203,-3123.473498
MVWAP,2023-Jan-03 19:37:47.498295,-3333.509498
MVWAP,2023-Jan-03 19:38:49.430938,-3158.125796
MVWAP,2023-Jan-03 19:39:49.845541,-3159.052087
MVWAP,2023-Jan-03 19:40:50.493423,-3338.598484
MVWAP,2023-Jan-03 19:41:50.686499,-2681.998484
MVWAP,2023-Jan-03 19:42:51.602547,-2563.234484
MVWAP,2023-Jan-03 19:43:51.799629,-1969.405132
MVWAP,2023-Jan-03 19:44:52.209555,-1735.932055
MVWAP,2023-Jan-03 19:45:53.213313,-583.532055
MVWAP,2023-Jan-03 19:46:54.104123,-580.259805
MVWAP,2023-Jan-03 19:47:54.588371,-2322.259805
MVWAP,2023-Jan-03 19:48:55.243244,-745.287226
MVWAP,2023-Jan-03 19:49:56.702533,-435.564801
MVWAP,2023-Jan-03 19:50:56.883965,-436.928295
MVWAP,2023-Jan-03 19:51:57.137367,-2386.240967
MVWAP,2023-Jan-03 19:52:57.381105,-1125.213061
MVWAP,2023-Jan-03 19:53:57.703834,-908.246273
MVWAP,2023-Jan-03 19:54:58.185284,-1043.869675
MVWAP,2023-Jan-03 19:55:58.280039,-936.897041
MVWAP,2023-Jan-03 19:56:59.061704,-1084.897041
MVWAP,2023-Jan-03 19:58:00.004983,-2526.388240
MVWAP,2023-Jan-03 19:59:00.113363,-1135.324240
MVWAP,2023-Jan-03 20:00:01.015649,-1090.615580
MVWAP,2023-Jan-03 20:01:01.258832,-532.407330
MVWAP,2023-Jan-03 20:02:01.322732,-2527.671039
MVWAP,2023-Jan-03 20:03:02.024168,-2527.671039
MVWAP,2023-Jan-03 20:04:02.205243,-905.462419
MVWAP,2023-Jan-03 20:05:02.394876,-706.698419
MVWAP,2023-Jan-03 20:06:03.061388,-574.417556
MVWAP,2023-Jan-03 20:07:04.207490,-818.545017
MVWAP,2023-Jan-03 20:08:04.809581,-1175.723879
MVWAP,2023-Jan-03 20:09:05.046213,-915.515205
MVWAP,2023-Jan-03 20:10:05.120172,-952.342532
MVWAP,2023-Jan-03 20:11:05.311566,-908.645998
MVWAP,2023-Jan-03 20:12:05.987613,-917.033412
MVWAP,2023-Jan-03 20:13:06.204709,-586.152542
MVWAP,2023-Jan-03 20:14:06.389264,-407.830245
MVWAP,2023-Jan-03 20:15:07.073200,-168.491745
MVWAP,2023-Jan-03 20:16:08.035111,-2561.525690
MVWAP,2023-Jan-03 20:17:08.248105,200.270352
MVWAP,2023-Jan-03 20:18:09.014792,124.734352
MVWAP,2023-Jan-03 20:19:11.400282,108.470373
MVWAP,2023-Jan-03 20:20:11.542491,-321.557417
MVWAP,2023-Jan-03 20:21:12.038550,-2767.185005
MVWAP,2023-Jan-03 20:22:12.362771,-959.971213
MVWAP,2023-Jan-03 20:23:12.900986,-2774.332142
MVWAP,2023-Jan-03 20:24:13.086605,-1208.430822
MVWAP,2023-Jan-03 20:25:13.477669,-1319.552668
MVWAP,2023-Jan-03 20:26:14.226786,-874.317510
MVWAP,2023-Jan-03 20:27:15.277744,-817.223510
MVWAP,2023-Jan-03 20:28:15.687453,-739.951091
MVWAP,2023-Jan-03 20:29:16.383227,-961.670228
MVWAP,2023-Jan-03 20:30:16.512371,-572.921244
MVWAP,2023-Jan-03 20:31:17.135654,-434.853624
MVWAP,2023-Jan-03 20:32:17.454039,11.558559
MVWAP,2023-Jan-03 20:33:17.784386,-426.603290
MVWAP,2023-Jan-03 20:34:17.863736,-1110.823274
MVWAP,2023-Jan-03 20:35:18.425380,189.448805
MVWAP,2023-Jan-03 20:36:18.792535,203.056800
MVWAP,2023-Jan-03 20:37:19.117997,-1043.043211
MVWAP,2023-Jan-03 20:38:19.177120,-1029.234947
MVWAP,2023-Jan-03 20:39:19.814471,-173.062737
MVWAP,2023-Jan-03 20:40:19.879913,-243.498322
MVWAP,2023-Jan-03 20:41:20.714162,-125.662246
MVWAP,2023-Jan-03 20:42:20.905847,-579.795942
MVWAP,2023-Jan-03 20:43:21.411756,-313.837646
MVWAP,2023-Jan-03 20:44:21.848797,-218.665436
MVWAP,2023-Jan-03 20:45:22.350744,-587.029173
MVWAP,2023-Jan-03 20:46:22.461511,-296.048470
MVWAP,2023-Jan-03 20:47:22.714844,-1097.007740
MVWAP,2023-Jan-03 20:48:22.888317,115.164517
MVWAP,2023-Jan-03 20:49:23.006112,-243.657483
MVWAP,2023-Jan-03 20:50:24.539004,-14.417063
MVWAP,2023-Jan-03 20:51:25.262617,-44.617063
MVWAP,2023-Jan-03 20:52:26.282855,-4.507008
MVWAP,2023-Jan-03 20:53:26.647489,-333.879008
MVWAP,2023-Jan-03 20:54:27.056824,287.584992
MVWAP,2023-Jan-03 20:55:27.630871,-94.543027
MVWAP,2023-Jan-03 20:56:28.547798,-1310.070707
MVWAP,2023-Jan-03 20:57:28.996317,-72.254332
MVWAP,2023-Jan-03 20:58:30.011804,298.673668
MVWAP,2023-Jan-03 20:59:30.208508,-3296.182275
MVWAP,2023-Jan-03 21:05:54.541921,-9991.900294
MVWAP,2023-Jan-04 05:00:00,-9991.900294
