2019-10-31 12:29:54.320417024,2019-10-31 12:29:54.320383274,35504,T,IEX,306.470000,15
2019-10-31 13:30:37.670956032,2019-10-31 13:30:37.670933025,159896,T,IEX,305.630000,1
2019-10-31 13:30:56.262141952,2019-10-31 13:30:56.262117339,178907,T,IEX,305.640000,100
2019-10-31 13:31:57.354727936,2019-10-31 13:31:57.354702327,259517,T,IEX,305.410000,75
2019-10-31 13:32:59.604232960,2019-10-31 13:32:59.604217042,338700,T,IEX,305.430000,43
2019-10-31 13:33:11.536427008,2019-10-31 13:33:11.536409721,358408,T,IEX,305.550000,100
2019-10-31 13:36:13.285417984,2019-10-31 13:36:13.285398605,594783,T,IEX,305.575000,100
2019-10-31 13:36:31.860238080,2019-10-31 13:36:31.860215042,619292,T,IEX,305.680000,100
2019-10-31 13:37:30.740646912,2019-10-31 13:37:30.740628490,694963,T,IEX,305.550000,100
2019-10-31 13:37:30.740674048,2019-10-31 13:37:30.740657363,694965,T,IEX,305.550000,300
2019-10-31 13:43:49.413731072,2019-10-31 13:43:49.413708957,1077692,T,IEX,305.410000,100
2019-10-31 13:46:34.350552064,2019-10-31 13:46:34.350532286,1253579,T,IEX,305.350000,100
2019-10-31 13:46:34.350580992,2019-10-31 13:46:34.350558258,1253582,T,IEX,305.350000,100
2019-10-31 13:46:45.366039040,2019-10-31 13:46:45.366019584,1264334,T,IEX,305.390000,200
2019-10-31 14:12:46.17403904,2019-10-31 14:12:46.17387166,2815729,T,IEX,304.570000,100
2019-10-31 14:16:18.704688128,2019-10-31 14:16:18.704660381,3016429,T,IEX,304.430000,100
2019-10-31 14:16:18.704817920,2019-10-31 14:16:18.704788418,3016438,T,IEX,304.430000,100
2019-10-31 14:18:34.263742976,2019-10-31 14:18:34.263720919,3122854,T,IEX,304.500000,9
2019-10-31 14:18:34.263848960,2019-10-31 14:18:34.263829716,3122860,T,IEX,304.500000,191
2019-10-31 14:19:10.810417920,2019-10-31 14:19:10.810397743,3149566,T,IEX,304.495000,100
2019-10-31 14:19:10.820761088,2019-10-31 14:19:10.820737498,3149572,T,IEX,304.495000,100
2019-10-31 14:19:29.178721024,2019-10-31 14:19:29.178701148,3162287,T,IEX,304.490000,15
2019-10-31 14:23:11.3042048,2019-10-31 14:23:11.3021563,3349991,T,IEX,304.040000,40
2019-10-31 14:25:12.779141888,2019-10-31 14:25:12.779122423,3494148,T,IEX,304.100000,100
2019-10-31 14:25:12.779166976,2019-10-31 14:25:12.779149772,3494149,T,IEX,304.100000,600
2019-10-31 14:26:44.47342080,2019-10-31 14:26:44.47313888,3570831,T,IEX,304.200000,1300
2019-10-31 14:29:00.46363904,2019-10-31 14:29:00.46346441,3681671,T,IEX,304.110000,117
2019-10-31 14:30:57.289317120,2019-10-31 14:30:57.289296244,3789780,T,IEX,303.870000,100
2019-10-31 14:31:05.661910016,2019-10-31 14:31:05.661885145,3800245,T,IEX,303.920000,100
2019-10-31 14:31:10.208238080,2019-10-31 14:31:10.208208359,3805551,T,IEX,303.850000,200
2019-10-31 14:32:12.78845952,2019-10-31 14:32:12.78823323,3862415,T,IEX,303.690000,100
2019-10-31 14:32:13.571674880,2019-10-31 14:32:13.571651060,3867883,T,IEX,303.620000,300
2019-10-31 14:32:13.624549888,2019-10-31 14:32:13.624530628,3868551,T,IEX,303.590000,1100
2019-10-31 14:32:13.624651008,2019-10-31 14:32:13.624627622,3868556,T,IEX,303.600000,100
2019-10-31 14:34:42.752844032,2019-10-31 14:34:42.752823593,4014670,T,IEX,303.680000,100
2019-10-31 14:36:45.422416896,2019-10-31 14:36:45.422396717,4148464,T,IEX,303.650000,100
2019-10-31 14:38:57.788310016,2019-10-31 14:38:57.788280657,4254055,T,IEX,303.730000,100
2019-10-31 14:43:52.753488896,2019-10-31 14:43:52.753462169,4493785,T,IEX,303.970000,400
2019-10-31 14:48:23.551581952,2019-10-31 14:48:23.551560855,4704840,T,IEX,304.070000,75
2019-10-31 14:48:23.551891968,2019-10-31 14:48:23.551871445,4704859,T,IEX,304.070000,25
2019-10-31 14:49:42.329657088,2019-10-31 14:49:42.329632513,4761498,T,IEX,304.170000,100
2019-10-31 14:49:50.179090944,2019-10-31 14:49:50.179073384,4767493,T,IEX,304.140000,100
2019-10-31 14:50:24.910690048,2019-10-31 14:50:24.910672576,4791941,T,IEX,304.130000,100
2019-10-31 14:51:18.136625920,2019-10-31 14:51:18.136605505,4824839,T,IEX,304.160000,100
2019-10-31 14:51:20.371580928,2019-10-31 14:51:20.371563040,4826224,T,IEX,304.150000,100
2019-10-31 14:58:50.826096128,2019-10-31 14:58:50.826070051,5148132,T,IEX,304.430000,300
2019-10-31 15:05:28.381465088,2019-10-31 15:05:28.381410763,5424079,T,IEX,304.520000,1700
2019-10-31 15:05:28.381701120,2019-10-31 15:05:28.381615729,5424112,T,IEX,304.520000,100
2019-10-31 15:06:11.177335040,2019-10-31 15:06:11.177316568,5456355,T,IEX,304.570000,200
2019-10-31 15:06:11.177427968,2019-10-31 15:06:11.177411181,5456358,T,IEX,304.590000,300
2019-10-31 15:06:31.820943872,2019-10-31 15:06:31.820924677,5472062,T,IEX,304.620000,100
2019-10-31 15:18:50.639131904,2019-10-31 15:18:50.639111650,5952483,T,IEX,304.405000,100
2019-10-31 15:21:22.663271936,2019-10-31 15:21:22.663248594,6053964,T,IEX,304.430000,100
2019-10-31 15:21:23.342075904,2019-10-31 15:21:23.342058812,6054432,T,IEX,304.440000,100
2019-10-31 15:21:23.906078976,2019-10-31 15:21:23.906058376,6055033,T,IEX,304.430000,100
2019-10-31 15:21:24.55046912,2019-10-31 15:21:24.55026464,6055237,T,IEX,304.420000,100
2019-10-31 15:38:32.432716032,2019-10-31 15:38:32.432696708,6704408,T,IEX,304.200000,100
2019-10-31 15:38:49.543066880,2019-10-31 15:38:49.543044396,6715147,T,IEX,304.290000,300
2019-10-31 15:42:18.729091072,2019-10-31 15:42:18.729060916,6861114,T,IEX,304.520000,100
2019-10-31 15:44:04.960409088,2019-10-31 15:44:04.960387922,6932584,T,IEX,304.485000,100
2019-10-31 15:52:06.460555008,2019-10-31 15:52:06.460536340,7242125,T,IEX,304.440000,100
2019-10-31 16:08:36.26151936,2019-10-31 16:08:36.26133907,7933894,T,IEX,304.100000,100
2019-10-31 16:08:36.26397952,2019-10-31 16:08:36.26379232,7933908,T,IEX,304.100000,10
2019-10-31 16:08:36.26418944,2019-10-31 16:08:36.26393197,7933910,T,IEX,304.100000,90
2019-10-31 16:08:36.142003968,2019-10-31 16:08:36.141985249,7934116,T,IEX,304.100000,100
2019-10-31 16:08:49.691020032,2019-10-31 16:08:49.690989693,7939360,T,IEX,304.100000,100
2019-10-31 16:08:50.731066880,2019-10-31 16:08:50.731048847,7939802,T,IEX,304.100000,100
2019-10-31 16:09:04.427859968,2019-10-31 16:09:04.427840130,7945273,T,IEX,304.100000,100
2019-10-31 16:13:33.76239872,2019-10-31 16:13:33.76217627,8079012,T,IEX,304.130000,100
2019-10-31 16:51:12.527546880,2019-10-31 16:51:12.527529577,9278622,T,IEX,303.645000,100
2019-10-31 16:51:12.528796928,2019-10-31 16:51:12.528775746,9278623,T,IEX,303.645000,100
2019-10-31 16:56:44.965027072,2019-10-31 16:56:44.965008647,9424933,T,IEX,303.850000,100
2019-10-31 17:31:32.60664064,2019-10-31 17:31:32.60644788,10282701,T,IEX,304.210000,5
2019-10-31 18:11:44.771728896,2019-10-31 18:11:44.771710698,11187852,T,IEX,303.980000,100
2019-10-31 18:22:14.858214912,2019-10-31 18:22:14.858192371,11428971,T,IEX,303.890000,53
2019-10-31 18:33:11.195495936,2019-10-31 18:33:11.195478185,11704837,T,IEX,304.120000,100
2019-10-31 18:41:33.634081024,2019-10-31 18:41:33.634062142,11917835,T,IEX,303.790000,100
2019-10-31 18:41:35.252841984,2019-10-31 18:41:35.252820702,11918545,T,IEX,303.790000,100
2019-10-31 18:41:41.189327872,2019-10-31 18:41:41.189308345,11920806,T,IEX,303.785000,115
2019-10-31 18:58:17.88334080,2019-10-31 18:58:17.88312536,12355748,T,IEX,303.945000,16
2019-10-31 19:12:25.749847040,2019-10-31 19:12:25.749818269,12749175,T,IEX,304.180000,100
2019-10-31 19:12:27.178386944,2019-10-31 19:12:27.178367371,12749798,T,IEX,304.170000,200
2019-10-31 19:13:11.502112000,2019-10-31 19:13:11.502094032,12768626,T,IEX,304.185000,200
2019-10-31 19:13:33.442900992,2019-10-31 19:13:33.442880973,12778090,T,IEX,304.230000,100
2019-10-31 19:13:33.442968064,2019-10-31 19:13:33.442941188,12778095,T,IEX,304.230000,100
2019-10-31 19:13:33.443020032,2019-10-31 19:13:33.442998030,12778099,T,IEX,304.230000,500
2019-10-31 19:14:43.406821120,2019-10-31 19:14:43.406799961,12821828,T,IEX,304.305000,100
2019-10-31 19:15:48.205753088,2019-10-31 19:15:48.205734891,12857923,T,IEX,304.280000,100
2019-10-31 19:17:26.897490944,2019-10-31 19:17:26.897466546,12901905,T,IEX,304.360000,100
2019-10-31 19:17:26.897536000,2019-10-31 19:17:26.897500831,12901910,T,IEX,304.360000,100
2019-10-31 19:20:53.702300928,2019-10-31 19:20:53.702279877,12988590,T,IEX,304.300000,200
2019-10-31 19:20:53.705982976,2019-10-31 19:20:53.705962944,12988592,T,IEX,304.300000,100
2019-10-31 19:36:57.980880896,2019-10-31 19:36:57.980860564,13495784,T,IEX,304.440000,100
2019-10-31 19:36:58.723415040,2019-10-31 19:36:58.723397235,13496944,T,IEX,304.440000,100
2019-10-31 19:38:31.562216960,2019-10-31 19:38:31.562195980,13553404,T,IEX,304.365000,100
2019-10-31 19:41:34.744800000,2019-10-31 19:41:34.744779132,13657665,T,IEX,304.400000,300
2019-10-31 19:43:06.879375872,2019-10-31 19:43:06.879353351,13705445,T,IEX,304.430000,100
2019-10-31 19:44:36.630928896,2019-10-31 19:44:36.630909079,13753707,T,IEX,304.390000,27
2019-10-31 19:44:56.797122048,2019-10-31 19:44:56.797101356,13766889,T,IEX,304.370000,100
2019-10-31 19:46:53.508889088,2019-10-31 19:46:53.508871624,13838466,T,IEX,304.350000,100
2019-10-31 19:48:21.750915072,2019-10-31 19:48:21.750895462,13901168,T,IEX,304.305000,84
2019-10-31 19:48:51.874842112,2019-10-31 19:48:51.874822690,13923426,T,IEX,304.300000,100
2019-10-31 19:50:02.624826112,2019-10-31 19:50:02.624795027,13991842,T,IEX,304.230000,100
2019-10-31 19:52:49.75660032,2019-10-31 19:52:49.75639094,14136363,T,IEX,304.245000,100
2019-10-31 19:54:49.405913088,2019-10-31 19:54:49.405895819,14263420,T,IEX,304.410000,100
2019-10-31 19:55:17.99996928,2019-10-31 19:55:17.99970590,14318011,T,IEX,304.440000,100
2019-10-31 19:58:18.944225024,2019-10-31 19:58:18.944209480,14573726,T,IEX,304.610000,300
2019-10-31 19:58:26.583580928,2019-10-31 19:58:26.583557831,14583597,T,IEX,304.610000,100
2019-10-31 19:58:37.444035072,2019-10-31 19:58:37.444015367,14598232,T,IEX,304.610000,100
2019-10-31 19:58:47.846085120,2019-10-31 19:58:47.846068315,14614944,T,IEX,304.660000,100
2019-10-31 19:58:56.791494912,2019-10-31 19:58:56.791478330,14628900,T,IEX,304.690000,100
2019-10-31 19:59:00.12079104,2019-10-31 19:59:00.12048073,14634789,T,IEX,304.705000,100
2019-10-31 19:59:04.988443904,2019-10-31 19:59:04.988427448,14648456,T,IEX,304.710000,100
2019-10-31 19:59:12.13466112,2019-10-31 19:59:12.13446355,14665509,T,IEX,304.800000,100
2019-10-31 19:59:16.941583104,2019-10-31 19:59:16.941565771,14678659,T,IEX,304.870000,100
2019-10-31 19:59:19.498326016,2019-10-31 19:59:19.498307938,14683727,T,IEX,304.880000,100
2019-10-31 19:59:25.562501120,2019-10-31 19:59:25.562466174,14694544,T,IEX,304.865000,100
2019-10-31 19:59:38.671275008,2019-10-31 19:59:38.671255344,14760949,T,IEX,304.890000,100
2019-10-31 19:59:47.3657984,2019-10-31 19:59:47.3631543,14821532,T,IEX,304.930000,100
2019-10-31 19:59:47.3716096,2019-10-31 19:59:47.3671677,14821539,T,IEX,304.930000,100
2019-10-31 19:59:57.426391040,2019-10-31 19:59:57.426375472,14901824,T,IEX,304.980000,144
