2019-10-23 14:30:00.79002880,2019-10-23 14:30:00.78985696,3257733,T,IEX,16.200000,100
2019-10-23 14:57:21.963728896,2019-10-23 14:57:21.963708955,4529906,T,IEX,15.715000,100
2019-10-23 15:02:12.704048896,2019-10-23 15:02:12.704028614,4737417,T,IEX,15.840000,100
2019-10-23 15:10:00.974587904,2019-10-23 15:10:00.974570662,4997110,T,IEX,15.825000,10
2019-10-23 15:23:36.828654080,2019-10-23 15:23:36.828634552,5477960,T,IEX,15.585000,400
2019-10-23 16:21:35.358544896,2019-10-23 16:21:35.358529233,7137704,T,IEX,15.500000,1
2019-10-23 17:38:38.41192960,2019-10-23 17:38:38.41171293,8849922,T,IEX,15.200000,300
2019-10-23 17:38:38.332093952,2019-10-23 17:38:38.332073378,8850110,T,IEX,15.190000,300
2019-10-23 17:38:38.593235968,2019-10-23 17:38:38.593214912,8850170,T,IEX,15.190000,300
2019-10-23 17:38:40.618465024,2019-10-23 17:38:40.618443307,8851063,T,IEX,15.190000,300
2019-10-23 17:41:27.555150080,2019-10-23 17:41:27.555131101,8899003,T,IEX,15.200000,200
2019-10-23 19:26:59.929712128,2019-10-23 19:26:59.929689062,11353416,T,IEX,15.075000,200
2019-10-23 19:49:12.615499008,2019-10-23 19:49:12.615478056,12047831,T,IEX,15.055000,200
