2019-10-21 13:14:58.215662080,2019-10-21 13:14:58.215621246,81695,T,IEX,268.280000,250
2019-10-21 13:17:41.110991872,2019-10-21 13:17:41.110954602,84006,T,IEX,268.300000,300
2019-10-21 13:30:00.574676992,2019-10-21 13:30:00.574648078,120371,T,IEX,268.100000,20
2019-10-21 13:30:19.925121024,2019-10-21 13:30:19.925095302,165565,T,IEX,268.140000,100
2019-10-21 14:01:26.379653120,2019-10-21 14:01:26.379636216,1954369,T,IEX,267.840000,10
2019-10-21 14:01:41.821724928,2019-10-21 14:01:41.821706160,1965406,T,IEX,267.780000,23
2019-10-21 14:06:08.120049920,2019-10-21 14:06:08.120031958,2207460,T,IEX,267.510000,100
2019-10-21 14:06:11.415343104,2019-10-21 14:06:11.415324805,2212924,T,IEX,267.500000,100
2019-10-21 14:07:37.937500928,2019-10-21 14:07:37.937482031,2305152,T,IEX,267.700000,100
2019-10-21 14:12:56.924732928,2019-10-21 14:12:56.924713000,2554044,T,IEX,267.810000,100
2019-10-21 15:08:55.632443904,2019-10-21 15:08:55.632418169,4726899,T,IEX,267.920000,100
2019-10-21 15:14:46.275053056,2019-10-21 15:14:46.275034352,4936003,T,IEX,268.040000,100
2019-10-21 15:16:30.262796032,2019-10-21 15:16:30.262777636,4996002,T,IEX,267.990000,100
2019-10-21 15:19:44.670457088,2019-10-21 15:19:44.670439863,5106472,T,IEX,267.860000,100
2019-10-21 15:22:02.515396096,2019-10-21 15:22:02.515379308,5184343,T,IEX,267.850000,10
2019-10-21 15:22:14.991963904,2019-10-21 15:22:14.991945260,5191331,T,IEX,267.800000,100
2019-10-21 15:22:34.322475008,2019-10-21 15:22:34.322453669,5204392,T,IEX,267.850000,100
2019-10-21 15:22:34.323584000,2019-10-21 15:22:34.323563842,5204393,T,IEX,267.850000,100
2019-10-21 15:48:10.693881088,2019-10-21 15:48:10.693859017,5925296,T,IEX,267.920000,100
2019-10-21 16:04:01.614630912,2019-10-21 16:04:01.614612956,6330311,T,IEX,267.770000,100
2019-10-21 16:19:06.148101888,2019-10-21 16:19:06.148084294,6665645,T,IEX,267.845000,100
2019-10-21 16:34:19.707024896,2019-10-21 16:34:19.707009039,6977171,T,IEX,268.100000,10
2019-10-21 16:42:19.509276928,2019-10-21 16:42:19.509253872,7131655,T,IEX,268.100000,9
2019-10-21 16:42:24.687251968,2019-10-21 16:42:24.687234674,7134009,T,IEX,268.100000,100
2019-10-21 16:43:32.768475904,2019-10-21 16:43:32.768454163,7156852,T,IEX,268.150000,100
2019-10-21 16:47:59.752084992,2019-10-21 16:47:59.752066453,7230418,T,IEX,268.100000,20
2019-10-21 16:49:11.482085888,2019-10-21 16:49:11.482067963,7251025,T,IEX,268.095000,100
2019-10-21 16:49:45.861862912,2019-10-21 16:49:45.861844314,7259368,T,IEX,268.095000,100
2019-10-21 16:49:48.573551104,2019-10-21 16:49:48.573534412,7260207,T,IEX,268.100000,100
2019-10-21 17:02:09.711174912,2019-10-21 17:02:09.711160074,7505620,T,IEX,268.100000,100
2019-10-21 17:05:42.139677952,2019-10-21 17:05:42.139661716,7564284,T,IEX,268.090000,4
2019-10-21 17:05:48.516265984,2019-10-21 17:05:48.516250490,7566931,T,IEX,268.080000,100
2019-10-21 17:18:17.363599872,2019-10-21 17:18:17.363574334,7786101,T,IEX,267.910000,100
2019-10-21 17:20:59.83128064,2019-10-21 17:20:59.83109471,7831425,T,IEX,267.830000,4
2019-10-21 17:41:34.115837952,2019-10-21 17:41:34.115819989,8185346,T,IEX,267.840000,100
2019-10-21 18:20:36.557478912,2019-10-21 18:20:36.557464194,8953831,T,IEX,268.045000,11
2019-10-21 18:40:11.83396096,2019-10-21 18:40:11.83377741,9328322,T,IEX,268.130000,9
2019-10-21 18:43:12.44925952,2019-10-21 18:43:12.44909332,9383585,T,IEX,268.120000,100
2019-10-21 18:50:24.889611008,2019-10-21 18:50:24.889585748,9512243,T,IEX,268.050000,100
2019-10-21 18:50:24.889630976,2019-10-21 18:50:24.889611880,9512244,T,IEX,268.050000,100
2019-10-21 18:51:22.224549888,2019-10-21 18:51:22.224528346,9532232,T,IEX,268.035000,100
2019-10-21 18:54:39.880903936,2019-10-21 18:54:39.880881169,9592373,T,IEX,268.085000,100
2019-10-21 18:54:56.590061056,2019-10-21 18:54:56.590043792,9596685,T,IEX,268.070000,100
2019-10-21 18:59:42.917022976,2019-10-21 18:59:42.917005489,9686211,T,IEX,268.020000,100
2019-10-21 19:05:42.191749888,2019-10-21 19:05:42.191729787,9818714,T,IEX,268.070000,100
2019-10-21 19:09:37.934774016,2019-10-21 19:09:37.934755062,9892754,T,IEX,268.030000,9
2019-10-21 19:10:13.510557952,2019-10-21 19:10:13.510535270,9905244,T,IEX,267.980000,100
2019-10-21 19:16:41.332733952,2019-10-21 19:16:41.332714408,10033496,T,IEX,268.130000,100
2019-10-21 19:21:59.373662976,2019-10-21 19:21:59.373645070,10133892,T,IEX,268.085000,100
2019-10-21 19:25:16.262850048,2019-10-21 19:25:16.262832724,10201145,T,IEX,268.100000,100
2019-10-21 19:26:44.641555968,2019-10-21 19:26:44.641537986,10235203,T,IEX,268.140000,6
2019-10-21 19:26:49.281824000,2019-10-21 19:26:49.281801068,10236693,T,IEX,268.125000,100
2019-10-21 19:29:59.456249088,2019-10-21 19:29:59.456228434,10302232,T,IEX,268.170000,1
2019-10-21 19:31:26.847315968,2019-10-21 19:31:26.847296200,10347055,T,IEX,268.220000,100
2019-10-21 19:31:38.634926080,2019-10-21 19:31:38.634901429,10350612,T,IEX,268.220000,100
2019-10-21 19:37:12.991664896,2019-10-21 19:37:12.991648298,10477443,T,IEX,268.220000,100
2019-10-21 19:37:32.44788992,2019-10-21 19:37:32.44771280,10485301,T,IEX,268.195000,100
2019-10-21 19:39:36.148438016,2019-10-21 19:39:36.148418021,10536208,T,IEX,268.185000,3
2019-10-21 19:39:51.458939904,2019-10-21 19:39:51.458923869,10541451,T,IEX,268.185000,20
2019-10-21 19:43:13.965637888,2019-10-21 19:43:13.965619128,10632086,T,IEX,268.290000,100
2019-10-21 19:44:18.596697088,2019-10-21 19:44:18.596678214,10664580,T,IEX,268.265000,100
2019-10-21 19:44:18.597693952,2019-10-21 19:44:18.597676364,10664587,T,IEX,268.265000,100
2019-10-21 19:46:04.12199936,2019-10-21 19:46:04.12182777,10715222,T,IEX,268.235000,100
2019-10-21 19:49:37.58130944,2019-10-21 19:49:37.58111961,10833734,T,IEX,268.275000,100
2019-10-21 19:55:00.62932992,2019-10-21 19:55:00.62915651,11057510,T,IEX,268.280000,100
2019-10-21 19:55:00.73466112,2019-10-21 19:55:00.73447980,11057765,T,IEX,268.320000,21
2019-10-21 19:55:09.511995904,2019-10-21 19:55:09.511977792,11077299,T,IEX,268.295000,100
2019-10-21 19:55:47.636780032,2019-10-21 19:55:47.636761626,11113863,T,IEX,268.275000,11
2019-10-21 19:58:41.185021952,2019-10-21 19:58:41.185003695,11280604,T,IEX,268.195000,100
2019-10-21 19:58:41.185039104,2019-10-21 19:58:41.185011891,11280607,T,IEX,268.200000,100
2019-10-21 19:58:47.405477120,2019-10-21 19:58:47.405459044,11287063,T,IEX,268.180000,100
2019-10-21 19:58:48.185330944,2019-10-21 19:58:48.185311274,11287821,T,IEX,268.190000,100
2019-10-21 19:59:03.30508032,2019-10-21 19:59:03.30490217,11308093,T,IEX,268.200000,100
2019-10-21 19:59:20.619662080,2019-10-21 19:59:20.619645251,11332653,T,IEX,268.170000,100
2019-10-21 19:59:47.93608960,2019-10-21 19:59:47.93590261,11444045,T,IEX,268.260000,100
2019-10-21 19:59:47.94297088,2019-10-21 19:59:47.94262504,11444086,T,IEX,268.260000,100
2019-10-21 19:59:52.955627008,2019-10-21 19:59:52.955608918,11482678,T,IEX,268.240000,100
2019-10-21 19:59:57.789660928,2019-10-21 19:59:57.789642853,11518066,T,IEX,268.200000,100
2019-10-21 19:59:57.789679104,2019-10-21 19:59:57.789662406,11518067,T,IEX,268.200000,100
2019-10-21 19:59:59.188082944,2019-10-21 19:59:59.188061671,11529716,T,IEX,268.190000,10
2019-10-21 19:59:59.188609024,2019-10-21 19:59:59.188590730,11529726,T,IEX,268.190000,100
2019-10-21 19:59:59.467497984,2019-10-21 19:59:59.467456217,11532113,T,IEX,268.190000,100
2019-10-21 19:59:59.467529984,2019-10-21 19:59:59.467474267,11532121,T,IEX,268.190000,100
2019-10-21 19:59:59.483983872,2019-10-21 19:59:59.483965904,11532268,T,IEX,268.180000,100
