2019-10-29 13:30:59.641106944,2019-10-29 13:30:59.641081606,211045,T,IEX,118.170000,100
2019-10-29 13:31:00.213829888,2019-10-29 13:31:00.213803530,211946,T,IEX,118.100000,100
2019-10-29 13:31:22.558313984,2019-10-29 13:31:22.558287387,237407,T,IEX,118.220000,1000
2019-10-29 13:32:14.161477120,2019-10-29 13:32:14.161452631,289952,T,IEX,118.280000,3
2019-10-29 13:33:13.997441024,2019-10-29 13:33:13.997420556,356478,T,IEX,118.320000,9
2019-10-29 13:33:35.641095936,2019-10-29 13:33:35.641076775,379670,T,IEX,118.450000,9
2019-10-29 13:37:24.905061888,2019-10-29 13:37:24.905042394,620838,T,IEX,118.670000,100
2019-10-29 13:37:27.563077120,2019-10-29 13:37:27.563058221,622871,T,IEX,118.670000,100
2019-10-29 13:37:27.564056064,2019-10-29 13:37:27.564038965,622872,T,IEX,118.670000,100
2019-10-29 13:37:27.565029120,2019-10-29 13:37:27.565011534,622873,T,IEX,118.670000,100
2019-10-29 13:40:22.391534080,2019-10-29 13:40:22.391518677,773180,T,IEX,118.695000,1
2019-10-29 13:40:57.941852928,2019-10-29 13:40:57.941832823,802517,T,IEX,118.625000,1
2019-10-29 13:41:20.307013120,2019-10-29 13:41:20.306995812,821726,T,IEX,118.570000,1
2019-10-29 13:41:28.815830016,2019-10-29 13:41:28.815810272,828057,T,IEX,118.600000,1
2019-10-29 13:42:02.90125056,2019-10-29 13:42:02.90108155,856143,T,IEX,118.540000,1
2019-10-29 13:42:17.669132032,2019-10-29 13:42:17.669112929,870414,T,IEX,118.480000,2
2019-10-29 13:42:18.50222080,2019-10-29 13:42:18.50206831,870672,T,IEX,118.475000,2
2019-10-29 13:42:18.58083072,2019-10-29 13:42:18.58061127,870676,T,IEX,118.475000,1
2019-10-29 13:43:20.404919040,2019-10-29 13:43:20.404901059,919488,T,IEX,118.490000,1
2019-10-29 13:43:20.412737024,2019-10-29 13:43:20.412719747,919492,T,IEX,118.490000,2
2019-10-29 13:43:44.116473088,2019-10-29 13:43:44.116452995,936571,T,IEX,118.485000,1
2019-10-29 13:43:44.127047936,2019-10-29 13:43:44.127030592,936584,T,IEX,118.485000,1
2019-10-29 13:43:59.670900992,2019-10-29 13:43:59.670881899,948923,T,IEX,118.480000,29
2019-10-29 13:45:00.527008000,2019-10-29 13:45:00.526990826,998517,T,IEX,118.470000,600
2019-10-29 13:45:01.664781056,2019-10-29 13:45:01.664761745,999910,T,IEX,118.470000,1
2019-10-29 13:45:01.673670912,2019-10-29 13:45:01.673655538,1000005,T,IEX,118.470000,5
2019-10-29 13:45:01.729885952,2019-10-29 13:45:01.729867766,1000127,T,IEX,118.470000,94
2019-10-29 13:45:02.331748096,2019-10-29 13:45:02.331729274,1001231,T,IEX,118.470000,100
2019-10-29 13:45:52.799162112,2019-10-29 13:45:52.799139413,1042566,T,IEX,118.420000,7
2019-10-29 13:46:35.579416064,2019-10-29 13:46:35.579399740,1077720,T,IEX,118.380000,1
2019-10-29 13:46:35.587198976,2019-10-29 13:46:35.587175633,1077728,T,IEX,118.380000,5
2019-10-29 13:47:05.375780096,2019-10-29 13:47:05.375760429,1096463,T,IEX,118.390000,100
2019-10-29 13:48:00.472922112,2019-10-29 13:48:00.472901349,1145606,T,IEX,118.425000,1
2019-10-29 13:48:00.480023040,2019-10-29 13:48:00.480006124,1145610,T,IEX,118.425000,3
2019-10-29 13:49:54.754061056,2019-10-29 13:49:54.754043143,1230782,T,IEX,118.470000,1
2019-10-29 13:49:54.764224000,2019-10-29 13:49:54.764205925,1230812,T,IEX,118.475000,7
2019-10-29 13:49:57.99433984,2019-10-29 13:49:57.99418586,1232400,T,IEX,118.505000,100
2019-10-29 13:50:00.335639040,2019-10-29 13:50:00.335620387,1236136,T,IEX,118.505000,1
2019-10-29 13:50:00.347674112,2019-10-29 13:50:00.347655668,1236177,T,IEX,118.520000,3
2019-10-29 13:50:10.668019968,2019-10-29 13:50:10.668002195,1246860,T,IEX,118.590000,100
2019-10-29 13:50:34.277313024,2019-10-29 13:50:34.277293740,1268061,T,IEX,118.610000,1
2019-10-29 13:50:35.290891008,2019-10-29 13:50:35.290872522,1268985,T,IEX,118.615000,1
2019-10-29 13:50:35.316387072,2019-10-29 13:50:35.316366974,1268990,T,IEX,118.615000,5
2019-10-29 13:50:46.169207040,2019-10-29 13:50:46.169187923,1278032,T,IEX,118.550000,1
2019-10-29 13:51:42.68957952,2019-10-29 13:51:42.68938800,1325166,T,IEX,118.560000,2
2019-10-29 13:52:19.809646080,2019-10-29 13:52:19.809630505,1355569,T,IEX,118.560000,4
2019-10-29 13:52:54.421711872,2019-10-29 13:52:54.421693308,1379283,T,IEX,118.565000,1
2019-10-29 13:52:54.429309952,2019-10-29 13:52:54.429283497,1379286,T,IEX,118.565000,1
2019-10-29 13:52:58.928050944,2019-10-29 13:52:58.928030704,1382134,T,IEX,118.600000,100
2019-10-29 13:56:57.279575040,2019-10-29 13:56:57.279555363,1566907,T,IEX,118.480000,100
2019-10-29 13:57:38.974411008,2019-10-29 13:57:38.974394439,1596647,T,IEX,118.550000,100
2019-10-29 13:57:38.977620992,2019-10-29 13:57:38.977602365,1596649,T,IEX,118.550000,100
2019-10-29 13:57:44.489811968,2019-10-29 13:57:44.489792717,1600753,T,IEX,118.530000,100
2019-10-29 13:58:16.258435072,2019-10-29 13:58:16.258413318,1621699,T,IEX,118.585000,100
2019-10-29 13:59:14.133842944,2019-10-29 13:59:14.133824377,1662469,T,IEX,118.545000,100
2019-10-29 14:01:07.755782912,2019-10-29 14:01:07.755765142,1747459,T,IEX,118.530000,4
2019-10-29 14:02:44.463038976,2019-10-29 14:02:44.463021964,1833916,T,IEX,118.520000,100
2019-10-29 14:02:44.463162880,2019-10-29 14:02:44.463145883,1833918,T,IEX,118.520000,100
2019-10-29 14:03:20.197017088,2019-10-29 14:03:20.196997636,1858982,T,IEX,118.490000,200
2019-10-29 14:05:53.66839040,2019-10-29 14:05:53.66818884,1982642,T,IEX,118.385000,100
2019-10-29 14:05:57.133209088,2019-10-29 14:05:57.133192568,1985998,T,IEX,118.390000,100
2019-10-29 14:05:57.134281984,2019-10-29 14:05:57.134263168,1985999,T,IEX,118.390000,400
2019-10-29 14:06:10.79365888,2019-10-29 14:06:10.79349914,1997704,T,IEX,118.440000,300
2019-10-29 14:06:10.85548032,2019-10-29 14:06:10.85532468,1997777,T,IEX,118.440000,600
2019-10-29 14:06:10.87720960,2019-10-29 14:06:10.87702716,1997783,T,IEX,118.440000,900
2019-10-29 14:06:24.499643904,2019-10-29 14:06:24.499624089,2009949,T,IEX,118.410000,100
2019-10-29 14:06:24.733779968,2019-10-29 14:06:24.733761586,2010192,T,IEX,118.420000,82
2019-10-29 14:06:44.635571968,2019-10-29 14:06:44.635553693,2028048,T,IEX,118.450000,100
2019-10-29 14:07:25.496079872,2019-10-29 14:07:25.496065164,2059315,T,IEX,118.475000,100
2019-10-29 14:07:34.868675072,2019-10-29 14:07:34.868658868,2066047,T,IEX,118.525000,100
2019-10-29 14:08:08.706724096,2019-10-29 14:08:08.706705714,2087965,T,IEX,118.520000,100
2019-10-29 14:08:47.164240896,2019-10-29 14:08:47.164222672,2118191,T,IEX,118.510000,100
2019-10-29 14:08:58.517505024,2019-10-29 14:08:58.517485519,2130632,T,IEX,118.475000,1
2019-10-29 14:09:14.95713024,2019-10-29 14:09:14.95694198,2144039,T,IEX,118.475000,1
2019-10-29 14:09:22.684750080,2019-10-29 14:09:22.684731922,2148966,T,IEX,118.475000,100
2019-10-29 14:09:50.344702976,2019-10-29 14:09:50.344682820,2170809,T,IEX,118.490000,1
2019-10-29 14:10:10.754358016,2019-10-29 14:10:10.754340075,2189085,T,IEX,118.415000,3
2019-10-29 14:10:32.677710080,2019-10-29 14:10:32.677689826,2205119,T,IEX,118.455000,1
2019-10-29 14:10:32.686108928,2019-10-29 14:10:32.686091083,2205123,T,IEX,118.455000,1
2019-10-29 14:10:51.110775040,2019-10-29 14:10:51.110757188,2217467,T,IEX,118.445000,100
2019-10-29 14:10:51.715533056,2019-10-29 14:10:51.715513684,2217817,T,IEX,118.445000,1
2019-10-29 14:11:27.19258880,2019-10-29 14:11:27.19240896,2244898,T,IEX,118.450000,100
2019-10-29 14:11:35.711361024,2019-10-29 14:11:35.711341889,2250024,T,IEX,118.450000,100
2019-10-29 14:11:43.272022016,2019-10-29 14:11:43.272005349,2256028,T,IEX,118.455000,100
2019-10-29 14:11:53.842846976,2019-10-29 14:11:53.842827241,2262874,T,IEX,118.465000,1
2019-10-29 14:11:53.850446080,2019-10-29 14:11:53.850427350,2262888,T,IEX,118.465000,1
2019-10-29 14:12:28.415094016,2019-10-29 14:12:28.415074891,2284608,T,IEX,118.435000,100
2019-10-29 14:13:29.467181056,2019-10-29 14:13:29.467162621,2329103,T,IEX,118.415000,100
2019-10-29 14:13:56.256858112,2019-10-29 14:13:56.256840810,2346598,T,IEX,118.415000,100
2019-10-29 14:14:35.721868032,2019-10-29 14:14:35.721845827,2373447,T,IEX,118.430000,100
2019-10-29 14:15:00.500207104,2019-10-29 14:15:00.500190117,2387513,T,IEX,118.435000,100
2019-10-29 14:15:12.716953088,2019-10-29 14:15:12.716933562,2397978,T,IEX,118.440000,100
2019-10-29 14:15:32.855382016,2019-10-29 14:15:32.855366401,2411696,T,IEX,118.460000,50
2019-10-29 14:15:33.661168896,2019-10-29 14:15:33.661151063,2412268,T,IEX,118.430000,100
2019-10-29 14:16:32.720006912,2019-10-29 14:16:32.719986614,2456468,T,IEX,118.390000,100
2019-10-29 14:16:50.720212992,2019-10-29 14:16:50.720194063,2469849,T,IEX,118.400000,100
2019-10-29 14:16:53.763228928,2019-10-29 14:16:53.763211007,2471560,T,IEX,118.400000,100
2019-10-29 14:17:14.175819008,2019-10-29 14:17:14.175797795,2483505,T,IEX,118.450000,100
2019-10-29 14:17:20.24230912,2019-10-29 14:17:20.24213884,2487366,T,IEX,118.445000,100
2019-10-29 14:17:30.958221056,2019-10-29 14:17:30.958201799,2494452,T,IEX,118.410000,100
2019-10-29 14:18:22.218014976,2019-10-29 14:18:22.217996772,2530441,T,IEX,118.460000,100
2019-10-29 14:18:32.724054016,2019-10-29 14:18:32.724033283,2536141,T,IEX,118.460000,100
2019-10-29 14:18:32.983360000,2019-10-29 14:18:32.983339853,2536260,T,IEX,118.455000,1
2019-10-29 14:18:47.179554048,2019-10-29 14:18:47.179535876,2544364,T,IEX,118.470000,100
2019-10-29 14:18:50.751732992,2019-10-29 14:18:50.751708354,2546427,T,IEX,118.455000,1
2019-10-29 14:19:01.452806912,2019-10-29 14:19:01.452785345,2551767,T,IEX,118.480000,1
2019-10-29 14:19:23.161884928,2019-10-29 14:19:23.161865893,2567730,T,IEX,118.485000,1
2019-10-29 14:19:25.88648960,2019-10-29 14:19:25.88627372,2569122,T,IEX,118.485000,2
2019-10-29 14:20:06.928857088,2019-10-29 14:20:06.928836886,2594035,T,IEX,118.465000,100
2019-10-29 14:20:28.258616064,2019-10-29 14:20:28.258597075,2608937,T,IEX,118.445000,100
2019-10-29 14:20:50.406115072,2019-10-29 14:20:50.406094915,2623798,T,IEX,118.445000,1
2019-10-29 14:20:50.414192896,2019-10-29 14:20:50.414173381,2623804,T,IEX,118.445000,3
2019-10-29 14:21:00.996121088,2019-10-29 14:21:00.996102639,2629913,T,IEX,118.410000,100
2019-10-29 14:21:04.436765952,2019-10-29 14:21:04.436746506,2633019,T,IEX,118.410000,1
2019-10-29 14:21:22.258074112,2019-10-29 14:21:22.258052498,2649230,T,IEX,118.450000,1
2019-10-29 14:21:23.33378048,2019-10-29 14:21:23.33360832,2650089,T,IEX,118.435000,100
2019-10-29 14:22:06.343744000,2019-10-29 14:22:06.343726047,2681276,T,IEX,118.405000,1
2019-10-29 14:22:06.351971072,2019-10-29 14:22:06.351950854,2681278,T,IEX,118.405000,1
2019-10-29 14:22:23.219112960,2019-10-29 14:22:23.219095506,2692627,T,IEX,118.435000,100
2019-10-29 14:22:23.228456960,2019-10-29 14:22:23.228439123,2692629,T,IEX,118.440000,1
2019-10-29 14:22:38.135020032,2019-10-29 14:22:38.135001114,2704241,T,IEX,118.425000,1
2019-10-29 14:22:38.145445888,2019-10-29 14:22:38.145426431,2704245,T,IEX,118.425000,1
2019-10-29 14:22:59.557929984,2019-10-29 14:22:59.557831694,2717498,T,IEX,118.430000,1
2019-10-29 14:22:59.565627904,2019-10-29 14:22:59.565608092,2717500,T,IEX,118.430000,1
2019-10-29 14:23:22.362132992,2019-10-29 14:23:22.362115051,2733635,T,IEX,118.415000,100
2019-10-29 14:23:22.362150912,2019-10-29 14:23:22.362135628,2733636,T,IEX,118.415000,1
2019-10-29 14:23:38.337344000,2019-10-29 14:23:38.337328588,2743954,T,IEX,118.400000,100
2019-10-29 14:24:16.643672064,2019-10-29 14:24:16.643655857,2768521,T,IEX,118.350000,1
2019-10-29 14:24:22.871417088,2019-10-29 14:24:22.871401322,2771938,T,IEX,118.350000,2
2019-10-29 14:24:34.441079040,2019-10-29 14:24:34.441060061,2777347,T,IEX,118.360000,100
2019-10-29 14:24:37.467353088,2019-10-29 14:24:37.467337858,2779622,T,IEX,118.350000,100
2019-10-29 14:24:37.554590976,2019-10-29 14:24:37.554572253,2779754,T,IEX,118.350000,1
2019-10-29 14:24:57.746877952,2019-10-29 14:24:57.746856841,2791331,T,IEX,118.345000,100
2019-10-29 14:25:25.334577920,2019-10-29 14:25:25.334557692,2807993,T,IEX,118.380000,200
2019-10-29 14:25:25.837964032,2019-10-29 14:25:25.837941204,2808417,T,IEX,118.385000,1
2019-10-29 14:25:25.846368000,2019-10-29 14:25:25.846352358,2808433,T,IEX,118.385000,3
2019-10-29 14:25:42.4116992,2019-10-29 14:25:42.4097548,2818808,T,IEX,118.360000,37
2019-10-29 14:25:42.4272896,2019-10-29 14:25:42.4256986,2818810,T,IEX,118.360000,37
2019-10-29 14:25:42.4674048,2019-10-29 14:25:42.4656351,2818812,T,IEX,118.360000,74
2019-10-29 14:25:42.4966912,2019-10-29 14:25:42.4949938,2818814,T,IEX,118.360000,52
2019-10-29 14:26:00.133748992,2019-10-29 14:26:00.133730442,2832556,T,IEX,118.340000,100
2019-10-29 14:26:25.162279936,2019-10-29 14:26:25.162259372,2846205,T,IEX,118.350000,1
2019-10-29 14:26:34.838813952,2019-10-29 14:26:34.838793673,2852167,T,IEX,118.305000,100
2019-10-29 14:26:37.960977920,2019-10-29 14:26:37.960958465,2853572,T,IEX,118.295000,1
2019-10-29 14:26:49.114322944,2019-10-29 14:26:49.114303955,2860234,T,IEX,118.275000,100
2019-10-29 14:26:58.323023872,2019-10-29 14:26:58.323007977,2864866,T,IEX,118.260000,7
2019-10-29 14:27:21.959994112,2019-10-29 14:27:21.959976394,2880094,T,IEX,118.275000,1
2019-10-29 14:27:29.910696960,2019-10-29 14:27:29.910679312,2884595,T,IEX,118.260000,100
2019-10-29 14:27:31.68568064,2019-10-29 14:27:31.68551650,2885284,T,IEX,118.250000,100
2019-10-29 14:27:46.833115904,2019-10-29 14:27:46.833096763,2892622,T,IEX,118.300000,100
2019-10-29 14:28:45.158012928,2019-10-29 14:28:45.157995690,2927609,T,IEX,118.260000,100
2019-10-29 14:28:45.261308928,2019-10-29 14:28:45.261291635,2927677,T,IEX,118.265000,100
2019-10-29 14:29:15.423368960,2019-10-29 14:29:15.423349631,2943949,T,IEX,118.300000,100
2019-10-29 14:29:26.900514048,2019-10-29 14:29:26.900497976,2950139,T,IEX,118.345000,100
2019-10-29 14:29:45.513716992,2019-10-29 14:29:45.513693884,2965181,T,IEX,118.370000,100
2019-10-29 14:30:11.892797952,2019-10-29 14:30:11.892779783,2984825,T,IEX,118.375000,100
2019-10-29 14:30:27.312104960,2019-10-29 14:30:27.312086624,2998354,T,IEX,118.380000,100
2019-10-29 14:30:35.675320064,2019-10-29 14:30:35.675299167,3005950,T,IEX,118.355000,100
2019-10-29 14:30:48.807031040,2019-10-29 14:30:48.807010448,3017831,T,IEX,118.350000,100
2019-10-29 14:31:53.372790016,2019-10-29 14:31:53.372770154,3074163,T,IEX,118.360000,100
2019-10-29 14:32:47.527376896,2019-10-29 14:32:47.527358280,3107310,T,IEX,118.320000,100
2019-10-29 14:33:47.643024896,2019-10-29 14:33:47.643007781,3154256,T,IEX,118.315000,100
2019-10-29 14:33:56.132854016,2019-10-29 14:33:56.132835263,3160960,T,IEX,118.325000,2
2019-10-29 14:34:59.88897024,2019-10-29 14:34:59.88878974,3205925,T,IEX,118.305000,100
2019-10-29 14:35:26.275642112,2019-10-29 14:35:26.275624695,3224728,T,IEX,118.300000,96
2019-10-29 14:35:26.275845888,2019-10-29 14:35:26.275827307,3224732,T,IEX,118.300000,4
2019-10-29 14:35:26.276279040,2019-10-29 14:35:26.276261305,3224744,T,IEX,118.300000,100
2019-10-29 14:35:26.276340992,2019-10-29 14:35:26.276321862,3224750,T,IEX,118.300000,100
2019-10-29 14:35:26.276416000,2019-10-29 14:35:26.276397443,3224753,T,IEX,118.300000,100
2019-10-29 14:36:07.756204032,2019-10-29 14:36:07.756185565,3259021,T,IEX,118.350000,29
2019-10-29 14:36:13.935567872,2019-10-29 14:36:13.935551826,3266356,T,IEX,118.370000,100
2019-10-29 14:36:35.113615872,2019-10-29 14:36:35.113600578,3280100,T,IEX,118.360000,100
2019-10-29 14:37:02.697956096,2019-10-29 14:37:02.697935350,3297797,T,IEX,118.405000,100
2019-10-29 14:37:41.622160896,2019-10-29 14:37:41.622144811,3321748,T,IEX,118.375000,100
2019-10-29 14:38:06.179013120,2019-10-29 14:38:06.178994907,3333205,T,IEX,118.420000,100
2019-10-29 14:38:06.380311040,2019-10-29 14:38:06.380294742,3333506,T,IEX,118.420000,1
2019-10-29 14:38:19.30976,2019-10-29 14:38:19.11909,3342816,T,IEX,118.390000,100
2019-10-29 14:39:00.500903936,2019-10-29 14:39:00.500886989,3362572,T,IEX,118.375000,2
2019-10-29 14:39:00.508698112,2019-10-29 14:39:00.508682186,3362574,T,IEX,118.375000,1
2019-10-29 14:39:20.607991040,2019-10-29 14:39:20.607972332,3375320,T,IEX,118.375000,100
2019-10-29 14:39:51.83410944,2019-10-29 14:39:51.83393940,3393855,T,IEX,118.375000,100
2019-10-29 14:39:51.84591104,2019-10-29 14:39:51.84575068,3393859,T,IEX,118.375000,1
2019-10-29 14:40:10.339256064,2019-10-29 14:40:10.339238215,3407452,T,IEX,118.335000,1
2019-10-29 14:40:12.86524928,2019-10-29 14:40:12.86506795,3408935,T,IEX,118.325000,100
2019-10-29 14:40:26.469470976,2019-10-29 14:40:26.469447621,3416908,T,IEX,118.325000,3
2019-10-29 14:40:26.469485056,2019-10-29 14:40:26.469467181,3416909,T,IEX,118.325000,100
2019-10-29 14:40:38.662619904,2019-10-29 14:40:38.662600691,3424171,T,IEX,118.330000,1
2019-10-29 14:40:38.670567936,2019-10-29 14:40:38.670545823,3424172,T,IEX,118.330000,1
2019-10-29 14:40:43.935933952,2019-10-29 14:40:43.935916753,3427320,T,IEX,118.315000,100
2019-10-29 14:40:51.353968128,2019-10-29 14:40:51.353948828,3431743,T,IEX,118.315000,100
2019-10-29 14:40:54.331313920,2019-10-29 14:40:54.331292751,3433003,T,IEX,118.315000,100
2019-10-29 14:41:00.748858112,2019-10-29 14:41:00.748839424,3436689,T,IEX,118.315000,1
2019-10-29 14:41:00.756325888,2019-10-29 14:41:00.756302190,3436694,T,IEX,118.315000,1
2019-10-29 14:41:08.940654080,2019-10-29 14:41:08.940635030,3442906,T,IEX,118.315000,100
2019-10-29 14:41:16.375666944,2019-10-29 14:41:16.375645742,3447304,T,IEX,118.330000,100
2019-10-29 14:41:25.642874880,2019-10-29 14:41:25.642857941,3452234,T,IEX,118.330000,100
2019-10-29 14:41:36.558434048,2019-10-29 14:41:36.558417087,3457956,T,IEX,118.360000,100
2019-10-29 14:41:36.567004928,2019-10-29 14:41:36.566990058,3457988,T,IEX,118.360000,1
2019-10-29 14:41:37.642964992,2019-10-29 14:41:37.642946542,3459491,T,IEX,118.360000,1
2019-10-29 14:41:53.353315072,2019-10-29 14:41:53.353296299,3469404,T,IEX,118.365000,1
2019-10-29 14:42:20.13696000,2019-10-29 14:42:20.13676493,3483669,T,IEX,118.375000,100
2019-10-29 14:42:23.490340096,2019-10-29 14:42:23.490323970,3485152,T,IEX,118.360000,1
2019-10-29 14:42:48.208018944,2019-10-29 14:42:48.207999605,3498795,T,IEX,118.375000,1
2019-10-29 14:42:56.939824128,2019-10-29 14:42:56.939805896,3506468,T,IEX,118.440000,100
2019-10-29 14:42:56.939841024,2019-10-29 14:42:56.939823380,3506469,T,IEX,118.440000,100
2019-10-29 14:43:16.192419072,2019-10-29 14:43:16.192401838,3525806,T,IEX,118.500000,100
2019-10-29 14:43:19.739106048,2019-10-29 14:43:19.739090184,3529142,T,IEX,118.470000,5
2019-10-29 14:43:21.865207040,2019-10-29 14:43:21.865189209,3531384,T,IEX,118.470000,3
2019-10-29 14:43:34.47634944,2019-10-29 14:43:34.47617305,3547000,T,IEX,118.390000,100
2019-10-29 14:44:31.20832000,2019-10-29 14:44:31.20812144,3588306,T,IEX,118.415000,1
2019-10-29 14:44:31.28589056,2019-10-29 14:44:31.28567004,3588307,T,IEX,118.415000,2
2019-10-29 14:44:50.817284096,2019-10-29 14:44:50.817264848,3602598,T,IEX,118.410000,100
2019-10-29 14:45:23.577137920,2019-10-29 14:45:23.577118360,3622760,T,IEX,118.410000,1
2019-10-29 14:45:23.577156096,2019-10-29 14:45:23.577140148,3622761,T,IEX,118.410000,100
2019-10-29 14:45:27.162041088,2019-10-29 14:45:27.162018379,3625553,T,IEX,118.420000,2
2019-10-29 14:45:46.525093888,2019-10-29 14:45:46.525076880,3638427,T,IEX,118.465000,100
2019-10-29 14:45:52.536048896,2019-10-29 14:45:52.536030134,3641779,T,IEX,118.420000,100
2019-10-29 14:45:52.537944064,2019-10-29 14:45:52.537926010,3641783,T,IEX,118.370000,1
2019-10-29 14:45:52.916638976,2019-10-29 14:45:52.916618824,3642111,T,IEX,118.400000,4
2019-10-29 14:45:53.93907968,2019-10-29 14:45:53.93888416,3642225,T,IEX,118.405000,100
2019-10-29 14:46:06.886923008,2019-10-29 14:46:06.886904494,3651004,T,IEX,118.475000,1
2019-10-29 14:46:06.896980992,2019-10-29 14:46:06.896959694,3651011,T,IEX,118.475000,2
2019-10-29 14:46:19.995041024,2019-10-29 14:46:19.995021253,3660585,T,IEX,118.445000,100
2019-10-29 14:46:21.339668992,2019-10-29 14:46:21.339649454,3661348,T,IEX,118.440000,1
2019-10-29 14:46:21.347429888,2019-10-29 14:46:21.347409963,3661351,T,IEX,118.435000,2
2019-10-29 14:46:21.566820096,2019-10-29 14:46:21.566803128,3661634,T,IEX,118.440000,1
2019-10-29 14:47:05.408281088,2019-10-29 14:47:05.408262494,3688880,T,IEX,118.350000,100
2019-10-29 14:47:05.408295936,2019-10-29 14:47:05.408280671,3688881,T,IEX,118.350000,2
2019-10-29 14:47:28.692737024,2019-10-29 14:47:28.692714344,3704945,T,IEX,118.350000,2
2019-10-29 14:47:28.700922112,2019-10-29 14:47:28.700905011,3704948,T,IEX,118.350000,1
2019-10-29 14:47:46.840324096,2019-10-29 14:47:46.840296708,3716079,T,IEX,118.370000,100
2019-10-29 14:47:46.850016000,2019-10-29 14:47:46.849997658,3716447,T,IEX,118.410000,29
2019-10-29 14:47:47.17593088,2019-10-29 14:47:47.17575541,3720385,T,IEX,118.430000,47
2019-10-29 14:47:47.240979968,2019-10-29 14:47:47.240964135,3721918,T,IEX,118.430000,2
2019-10-29 14:47:52.606071040,2019-10-29 14:47:52.606052566,3731817,T,IEX,118.420000,1
2019-10-29 14:47:52.613509888,2019-10-29 14:47:52.613491687,3731831,T,IEX,118.420000,3
2019-10-29 14:47:57.375620096,2019-10-29 14:47:57.375601122,3737697,T,IEX,118.400000,100
2019-10-29 14:48:01.708697088,2019-10-29 14:48:01.708678041,3741942,T,IEX,118.440000,100
2019-10-29 14:48:01.716346112,2019-10-29 14:48:01.716326819,3741949,T,IEX,118.435000,1
2019-10-29 14:48:27.969860096,2019-10-29 14:48:27.969840455,3759534,T,IEX,118.380000,2
2019-10-29 14:48:27.980354048,2019-10-29 14:48:27.980336644,3759536,T,IEX,118.380000,2
2019-10-29 14:49:34.751771904,2019-10-29 14:49:34.751752263,3807002,T,IEX,118.395000,100
2019-10-29 14:49:35.54081024,2019-10-29 14:49:35.54065618,3807271,T,IEX,118.395000,1
2019-10-29 14:49:35.62338048,2019-10-29 14:49:35.62318401,3807277,T,IEX,118.395000,1
2019-10-29 14:50:30.195511040,2019-10-29 14:50:30.195494474,3844282,T,IEX,118.375000,2
2019-10-29 14:50:30.224545024,2019-10-29 14:50:30.224528323,3844295,T,IEX,118.390000,76
2019-10-29 14:50:36.373728000,2019-10-29 14:50:36.373708034,3848528,T,IEX,118.375000,1
2019-10-29 14:51:07.404761088,2019-10-29 14:51:07.404743835,3869989,T,IEX,118.380000,24
2019-10-29 14:51:07.404776960,2019-10-29 14:51:07.404761433,3869990,T,IEX,118.380000,1
2019-10-29 14:51:15.254354944,2019-10-29 14:51:15.254335071,3874501,T,IEX,118.410000,2
2019-10-29 14:51:30.970450944,2019-10-29 14:51:30.970431083,3884507,T,IEX,118.330000,100
2019-10-29 14:53:20.680268032,2019-10-29 14:53:20.680249259,3952931,T,IEX,118.270000,100
2019-10-29 14:53:38.383656960,2019-10-29 14:53:38.383637625,3963772,T,IEX,118.330000,100
2019-10-29 14:53:38.502938112,2019-10-29 14:53:38.502919608,3964026,T,IEX,118.350000,100
2019-10-29 14:53:54.835760128,2019-10-29 14:53:54.835740814,3973968,T,IEX,118.330000,100
2019-10-29 14:54:12.995806976,2019-10-29 14:54:12.995790743,3986510,T,IEX,118.320000,100
2019-10-29 14:54:53.337346048,2019-10-29 14:54:53.337327554,4008935,T,IEX,118.270000,100
2019-10-29 14:55:30.689776896,2019-10-29 14:55:30.689758046,4030540,T,IEX,118.260000,100
2019-10-29 14:55:50.114489088,2019-10-29 14:55:50.114471311,4040334,T,IEX,118.250000,100
2019-10-29 14:56:24.27848960,2019-10-29 14:56:24.27830378,4060033,T,IEX,118.230000,100
2019-10-29 14:56:35.35719936,2019-10-29 14:56:35.35699084,4065614,T,IEX,118.230000,100
2019-10-29 14:56:35.437728000,2019-10-29 14:56:35.437706421,4065740,T,IEX,118.230000,100
2019-10-29 14:57:10.36499968,2019-10-29 14:57:10.36476722,4085039,T,IEX,118.220000,37
2019-10-29 14:57:10.36558080,2019-10-29 14:57:10.36540332,4085041,T,IEX,118.220000,37
2019-10-29 14:57:14.6362880,2019-10-29 14:57:14.6345842,4087929,T,IEX,118.230000,100
2019-10-29 14:57:24.65761024,2019-10-29 14:57:24.65742646,4092881,T,IEX,118.230000,1
2019-10-29 14:57:28.998931968,2019-10-29 14:57:28.998912778,4095465,T,IEX,118.190000,100
2019-10-29 14:57:48.122840064,2019-10-29 14:57:48.122821425,4105268,T,IEX,118.195000,1
2019-10-29 14:58:17.521825024,2019-10-29 14:58:17.521804292,4120418,T,IEX,118.200000,100
2019-10-29 14:58:38.772833024,2019-10-29 14:58:38.772811813,4132688,T,IEX,118.200000,100
2019-10-29 14:58:40.115130112,2019-10-29 14:58:40.115112194,4133379,T,IEX,118.200000,100
2019-10-29 14:59:09.434244096,2019-10-29 14:59:09.434224914,4149381,T,IEX,118.185000,1
2019-10-29 14:59:19.665831936,2019-10-29 14:59:19.665812304,4157370,T,IEX,118.185000,100
2019-10-29 14:59:50.755609088,2019-10-29 14:59:50.755590816,4177848,T,IEX,118.165000,10
2019-10-29 14:59:50.819388928,2019-10-29 14:59:50.819372921,4177864,T,IEX,118.155000,100
2019-10-29 15:00:31.324747008,2019-10-29 15:00:31.324728723,4210848,T,IEX,118.145000,100
2019-10-29 15:00:35.3710976,2019-10-29 15:00:35.3694751,4213345,T,IEX,118.130000,4
2019-10-29 15:01:19.489949952,2019-10-29 15:01:19.489932149,4243326,T,IEX,118.145000,100
2019-10-29 15:01:32.422884096,2019-10-29 15:01:32.422864482,4252285,T,IEX,118.180000,100
2019-10-29 15:01:36.251975936,2019-10-29 15:01:36.251954487,4254358,T,IEX,118.160000,65
2019-10-29 15:01:36.252219904,2019-10-29 15:01:36.252205782,4254362,T,IEX,118.160000,41
2019-10-29 15:01:36.252233984,2019-10-29 15:01:36.252217763,4254363,T,IEX,118.160000,35
2019-10-29 15:02:10.144352000,2019-10-29 15:02:10.144333869,4279645,T,IEX,118.070000,200
2019-10-29 15:02:22.699483904,2019-10-29 15:02:22.699465815,4288291,T,IEX,118.080000,100
2019-10-29 15:02:25.533519872,2019-10-29 15:02:25.533500026,4290535,T,IEX,118.140000,100
2019-10-29 15:02:45.319024128,2019-10-29 15:02:45.319006535,4302357,T,IEX,118.120000,100
2019-10-29 15:02:58.908684032,2019-10-29 15:02:58.908666379,4312724,T,IEX,118.150000,100
2019-10-29 15:03:01.982927104,2019-10-29 15:03:01.982909080,4316240,T,IEX,118.140000,100
2019-10-29 15:03:41.398752000,2019-10-29 15:03:41.398732340,4345018,T,IEX,118.180000,100
2019-10-29 15:04:07.737884928,2019-10-29 15:04:07.737867045,4359491,T,IEX,118.190000,100
2019-10-29 15:04:18.206906112,2019-10-29 15:04:18.206885854,4365280,T,IEX,118.190000,27
2019-10-29 15:04:18.206990080,2019-10-29 15:04:18.206970527,4365283,T,IEX,118.190000,37
2019-10-29 15:04:18.207025920,2019-10-29 15:04:18.207005501,4365286,T,IEX,118.190000,37
2019-10-29 15:04:57.503406080,2019-10-29 15:04:57.503388463,4386367,T,IEX,118.340000,100
2019-10-29 15:05:14.67568128,2019-10-29 15:05:14.67552178,4397092,T,IEX,118.320000,4
2019-10-29 15:05:14.67589888,2019-10-29 15:05:14.67571978,4397093,T,IEX,118.310000,96
2019-10-29 15:05:14.549062912,2019-10-29 15:05:14.549041512,4397348,T,IEX,118.300000,100
2019-10-29 15:05:34.237217024,2019-10-29 15:05:34.237200279,4406778,T,IEX,118.330000,100
2019-10-29 15:05:49.667068928,2019-10-29 15:05:49.667048050,4417314,T,IEX,118.315000,100
2019-10-29 15:05:58.552940032,2019-10-29 15:05:58.552920226,4422274,T,IEX,118.310000,100
2019-10-29 15:05:58.553285120,2019-10-29 15:05:58.553266926,4422282,T,IEX,118.310000,100
2019-10-29 15:06:01.174141952,2019-10-29 15:06:01.174122129,4424845,T,IEX,118.290000,7
2019-10-29 15:06:07.901860096,2019-10-29 15:06:07.901842046,4428051,T,IEX,118.275000,100
2019-10-29 15:06:22.61412096,2019-10-29 15:06:22.61390299,4435641,T,IEX,118.270000,100
2019-10-29 15:07:15.582265088,2019-10-29 15:07:15.582247941,4463537,T,IEX,118.365000,100
2019-10-29 15:07:17.444359936,2019-10-29 15:07:17.444344390,4464454,T,IEX,118.370000,188
2019-10-29 15:09:23.220322048,2019-10-29 15:09:23.220305569,4544359,T,IEX,118.360000,1
2019-10-29 15:09:29.183674880,2019-10-29 15:09:29.183654557,4548174,T,IEX,118.360000,100
2019-10-29 15:10:16.882652928,2019-10-29 15:10:16.882634623,4578043,T,IEX,118.355000,100
2019-10-29 15:10:38.96348928,2019-10-29 15:10:38.96329087,4590481,T,IEX,118.335000,100
2019-10-29 15:10:59.282944000,2019-10-29 15:10:59.282926635,4602979,T,IEX,118.305000,100
2019-10-29 15:11:23.294626048,2019-10-29 15:11:23.294610639,4619663,T,IEX,118.300000,100
2019-10-29 15:12:35.639596032,2019-10-29 15:12:35.639580222,4665505,T,IEX,118.225000,100
2019-10-29 15:12:40.184857088,2019-10-29 15:12:40.184839655,4667781,T,IEX,118.245000,100
2019-10-29 15:12:42.400019968,2019-10-29 15:12:42.400000038,4669698,T,IEX,118.245000,100
2019-10-29 15:12:44.693507072,2019-10-29 15:12:44.693490926,4671038,T,IEX,118.240000,100
2019-10-29 15:13:41.503977984,2019-10-29 15:13:41.503958490,4709089,T,IEX,118.190000,100
2019-10-29 15:13:44.284846080,2019-10-29 15:13:44.284826190,4710896,T,IEX,118.190000,100
2019-10-29 15:14:06.73251072,2019-10-29 15:14:06.73235763,4723941,T,IEX,118.185000,100
2019-10-29 15:15:00.659794944,2019-10-29 15:15:00.659777015,4761633,T,IEX,118.125000,100
2019-10-29 15:15:21.794931968,2019-10-29 15:15:21.794913029,4776089,T,IEX,118.135000,100
2019-10-29 15:15:39.251613952,2019-10-29 15:15:39.251593247,4786349,T,IEX,118.150000,100
2019-10-29 15:15:39.251629056,2019-10-29 15:15:39.251609285,4786350,T,IEX,118.150000,100
2019-10-29 15:15:39.263450112,2019-10-29 15:15:39.263432255,4786357,T,IEX,118.150000,100
2019-10-29 15:16:43.791870976,2019-10-29 15:16:43.791851297,4823504,T,IEX,118.110000,100
2019-10-29 15:16:45.159173120,2019-10-29 15:16:45.159153867,4824122,T,IEX,118.090000,100
2019-10-29 15:17:15.638202112,2019-10-29 15:17:15.638184693,4841139,T,IEX,118.080000,100
2019-10-29 15:17:48.371763968,2019-10-29 15:17:48.371746308,4856699,T,IEX,118.075000,100
2019-10-29 15:17:50.219718912,2019-10-29 15:17:50.219698467,4857799,T,IEX,118.075000,100
2019-10-29 15:18:27.813297920,2019-10-29 15:18:27.813276373,4877366,T,IEX,118.080000,37
2019-10-29 15:18:27.813396992,2019-10-29 15:18:27.813380941,4877368,T,IEX,118.080000,37
2019-10-29 15:18:27.813434880,2019-10-29 15:18:27.813417234,4877369,T,IEX,118.080000,26
2019-10-29 15:18:31.248631040,2019-10-29 15:18:31.248611328,4878951,T,IEX,118.070000,40
2019-10-29 15:18:31.248772096,2019-10-29 15:18:31.248754356,4878959,T,IEX,118.070000,3
2019-10-29 15:18:31.248820992,2019-10-29 15:18:31.248797364,4878962,T,IEX,118.070000,37
2019-10-29 15:18:31.248851968,2019-10-29 15:18:31.248831781,4878966,T,IEX,118.070000,20
2019-10-29 15:18:32.305580032,2019-10-29 15:18:32.305558658,4879593,T,IEX,118.075000,1
2019-10-29 15:18:45.400397056,2019-10-29 15:18:45.400377517,4885631,T,IEX,118.095000,100
2019-10-29 15:19:09.171027968,2019-10-29 15:19:09.171007684,4897538,T,IEX,118.115000,100
2019-10-29 15:19:29.81677056,2019-10-29 15:19:29.81658053,4910389,T,IEX,118.045000,15
2019-10-29 15:19:30.393324032,2019-10-29 15:19:30.393305409,4911488,T,IEX,118.035000,100
2019-10-29 15:19:55.683454976,2019-10-29 15:19:55.683436220,4930265,T,IEX,118.070000,100
2019-10-29 15:19:55.684069888,2019-10-29 15:19:55.684052383,4930266,T,IEX,118.070000,100
2019-10-29 15:20:18.394121984,2019-10-29 15:20:18.394103758,4943231,T,IEX,118.090000,7
2019-10-29 15:20:18.394204928,2019-10-29 15:20:18.394185075,4943237,T,IEX,118.090000,93
2019-10-29 15:20:26.817110016,2019-10-29 15:20:26.817091828,4952740,T,IEX,118.050000,100
2019-10-29 15:21:05.490723072,2019-10-29 15:21:05.490704915,4976484,T,IEX,118.095000,100
2019-10-29 15:21:13.600763904,2019-10-29 15:21:13.600747227,4981867,T,IEX,118.095000,100
2019-10-29 15:21:22.263539968,2019-10-29 15:21:22.263521946,4988273,T,IEX,118.080000,100
2019-10-29 15:21:29.251148032,2019-10-29 15:21:29.251130010,4994241,T,IEX,118.025000,100
2019-10-29 15:21:53.408898048,2019-10-29 15:21:53.408880328,5008631,T,IEX,118.065000,100
2019-10-29 15:24:09.493728000,2019-10-29 15:24:09.493705124,5075435,T,IEX,117.985000,100
2019-10-29 15:24:58.730427904,2019-10-29 15:24:58.730411132,5102020,T,IEX,117.910000,100
2019-10-29 15:25:11.826908928,2019-10-29 15:25:11.826891995,5108992,T,IEX,117.910000,15
2019-10-29 15:25:24.562675968,2019-10-29 15:25:24.562660419,5115784,T,IEX,117.915000,100
2019-10-29 15:25:46.996606976,2019-10-29 15:25:46.996587344,5126791,T,IEX,117.935000,100
2019-10-29 15:25:50.120229120,2019-10-29 15:25:50.120211813,5128407,T,IEX,117.945000,100
2019-10-29 15:26:09.179136000,2019-10-29 15:26:09.179117307,5137889,T,IEX,117.950000,100
2019-10-29 15:27:02.871760896,2019-10-29 15:27:02.871741483,5162537,T,IEX,117.975000,100
2019-10-29 15:27:10.318716928,2019-10-29 15:27:10.318696520,5166675,T,IEX,117.975000,100
2019-10-29 15:27:32.110522880,2019-10-29 15:27:32.110503425,5178403,T,IEX,117.950000,100
2019-10-29 15:28:04.235724032,2019-10-29 15:28:04.235702069,5192617,T,IEX,117.950000,100
2019-10-29 15:28:47.601745920,2019-10-29 15:28:47.601728808,5210708,T,IEX,117.915000,100
2019-10-29 15:29:15.979184128,2019-10-29 15:29:15.979166393,5223337,T,IEX,117.950000,100
2019-10-29 15:29:19.627073024,2019-10-29 15:29:19.627054141,5225268,T,IEX,117.950000,100
2019-10-29 15:30:23.678072064,2019-10-29 15:30:23.678054437,5259054,T,IEX,117.960000,100
2019-10-29 15:30:37.259072000,2019-10-29 15:30:37.259052869,5268087,T,IEX,117.955000,100
2019-10-29 15:30:37.259087872,2019-10-29 15:30:37.259069829,5268088,T,IEX,117.950000,156
2019-10-29 15:30:37.260540928,2019-10-29 15:30:37.260522178,5268145,T,IEX,117.950000,100
2019-10-29 15:30:55.888990976,2019-10-29 15:30:55.888970960,5279415,T,IEX,117.980000,100
2019-10-29 15:31:51.961744896,2019-10-29 15:31:51.961726867,5309196,T,IEX,117.995000,100
2019-10-29 15:32:10.879780096,2019-10-29 15:32:10.879758795,5318396,T,IEX,117.910000,100
2019-10-29 15:33:21.565940992,2019-10-29 15:33:21.565923193,5354009,T,IEX,117.830000,100
2019-10-29 15:33:43.417272064,2019-10-29 15:33:43.417253347,5365230,T,IEX,117.855000,100
2019-10-29 15:33:48.103302912,2019-10-29 15:33:48.103287053,5367191,T,IEX,117.855000,100
2019-10-29 15:34:13.979292928,2019-10-29 15:34:13.979277711,5380442,T,IEX,117.880000,100
2019-10-29 15:34:31.668814080,2019-10-29 15:34:31.668795448,5388666,T,IEX,117.925000,100
2019-10-29 15:35:28.130349056,2019-10-29 15:35:28.130325462,5415719,T,IEX,117.950000,100
2019-10-29 15:35:51.376368896,2019-10-29 15:35:51.376349798,5426488,T,IEX,117.905000,100
2019-10-29 15:36:23.74855936,2019-10-29 15:36:23.74836001,5446917,T,IEX,117.885000,100
2019-10-29 15:36:23.74875904,2019-10-29 15:36:23.74857608,5446918,T,IEX,117.885000,100
2019-10-29 15:36:23.195883008,2019-10-29 15:36:23.195863483,5446962,T,IEX,117.900000,100
2019-10-29 15:36:23.718012928,2019-10-29 15:36:23.717992499,5447272,T,IEX,117.910000,100
2019-10-29 15:36:26.180888064,2019-10-29 15:36:26.180867768,5449159,T,IEX,117.935000,100
2019-10-29 15:36:36.560470016,2019-10-29 15:36:36.560452184,5453346,T,IEX,117.950000,100
2019-10-29 15:36:41.107323904,2019-10-29 15:36:41.107304847,5454859,T,IEX,117.960000,29
2019-10-29 15:37:42.420614912,2019-10-29 15:37:42.420599954,5490094,T,IEX,117.880000,100
2019-10-29 15:39:02.156102912,2019-10-29 15:39:02.156081964,5529890,T,IEX,117.840000,100
2019-10-29 15:39:25.72200960,2019-10-29 15:39:25.72183363,5539623,T,IEX,117.840000,100
2019-10-29 15:39:41.722789120,2019-10-29 15:39:41.722767520,5548899,T,IEX,117.865000,200
2019-10-29 15:40:36.160352000,2019-10-29 15:40:36.160330266,5582947,T,IEX,117.935000,100
2019-10-29 15:40:44.950821888,2019-10-29 15:40:44.950800556,5586088,T,IEX,117.910000,28
2019-10-29 15:42:06.607386880,2019-10-29 15:42:06.607371782,5627470,T,IEX,117.930000,22
2019-10-29 15:43:35.686894080,2019-10-29 15:43:35.686874162,5672409,T,IEX,117.925000,100
2019-10-29 15:43:35.688166912,2019-10-29 15:43:35.688146498,5672410,T,IEX,117.925000,100
2019-10-29 15:44:04.144233984,2019-10-29 15:44:04.144214899,5684512,T,IEX,117.885000,100
2019-10-29 15:44:10.426814976,2019-10-29 15:44:10.426795726,5687312,T,IEX,117.825000,100
2019-10-29 15:44:23.700268032,2019-10-29 15:44:23.700252173,5693859,T,IEX,117.830000,100
2019-10-29 15:45:52.837434880,2019-10-29 15:45:52.837415305,5743382,T,IEX,117.815000,100
2019-10-29 15:46:20.654906880,2019-10-29 15:46:20.654880951,5757734,T,IEX,117.840000,100
2019-10-29 15:47:20.630341888,2019-10-29 15:47:20.630326149,5787099,T,IEX,117.885000,100
2019-10-29 15:48:21.186120960,2019-10-29 15:48:21.186103235,5814132,T,IEX,117.860000,100
2019-10-29 15:49:06.584850944,2019-10-29 15:49:06.584833120,5836864,T,IEX,117.815000,100
2019-10-29 15:49:09.950269952,2019-10-29 15:49:09.950248678,5838295,T,IEX,117.805000,100
2019-10-29 15:49:46.177968128,2019-10-29 15:49:46.177947883,5853431,T,IEX,117.750000,100
2019-10-29 15:49:48.926639104,2019-10-29 15:49:48.926620140,5854703,T,IEX,117.750000,100
2019-10-29 15:50:06.598657024,2019-10-29 15:50:06.598639879,5862460,T,IEX,117.730000,18
2019-10-29 15:50:28.843944960,2019-10-29 15:50:28.843926941,5875810,T,IEX,117.725000,100
2019-10-29 15:50:46.445338112,2019-10-29 15:50:46.445320204,5885552,T,IEX,117.710000,100
2019-10-29 15:51:30.767659008,2019-10-29 15:51:30.767642662,5909950,T,IEX,117.670000,100
2019-10-29 15:51:57.616709120,2019-10-29 15:51:57.616691688,5929076,T,IEX,117.705000,100
2019-10-29 15:52:11.12922112,2019-10-29 15:52:11.12903563,5941421,T,IEX,117.690000,100
2019-10-29 15:53:16.874053120,2019-10-29 15:53:16.874035255,5978671,T,IEX,117.735000,100
2019-10-29 15:53:38.346339072,2019-10-29 15:53:38.346318787,5988076,T,IEX,117.700000,100
2019-10-29 15:55:03.331835904,2019-10-29 15:55:03.331816053,6032398,T,IEX,117.690000,100
2019-10-29 15:56:14.880964096,2019-10-29 15:56:14.880945876,6068571,T,IEX,117.680000,100
2019-10-29 15:57:24.451544064,2019-10-29 15:57:24.451524505,6104475,T,IEX,117.695000,100
2019-10-29 15:57:52.312442112,2019-10-29 15:57:52.312421694,6118813,T,IEX,117.610000,100
2019-10-29 15:57:56.745765120,2019-10-29 15:57:56.745746380,6120716,T,IEX,117.615000,100
2019-10-29 15:58:24.395350016,2019-10-29 15:58:24.395330965,6132932,T,IEX,117.570000,100
2019-10-29 15:58:32.373161984,2019-10-29 15:58:32.373144101,6137101,T,IEX,117.490000,84
2019-10-29 15:58:32.373257984,2019-10-29 15:58:32.373241884,6137102,T,IEX,117.490000,16
2019-10-29 15:58:35.947143936,2019-10-29 15:58:35.947124813,6138514,T,IEX,117.510000,100
2019-10-29 15:58:35.955762944,2019-10-29 15:58:35.955743444,6138522,T,IEX,117.510000,200
2019-10-29 15:58:38.347273984,2019-10-29 15:58:38.347254869,6140210,T,IEX,117.515000,200
2019-10-29 15:59:09.867369984,2019-10-29 15:59:09.867353918,6180689,T,IEX,117.340000,79
2019-10-29 15:59:14.123618048,2019-10-29 15:59:14.123602507,6212817,T,IEX,117.240000,100
2019-10-29 15:59:15.856947968,2019-10-29 15:59:15.856932381,6227944,T,IEX,117.310000,100
2019-10-29 15:59:31.565733120,2019-10-29 15:59:31.565716874,6293318,T,IEX,117.205000,100
2019-10-29 15:59:31.565764096,2019-10-29 15:59:31.565743306,6293319,T,IEX,117.205000,100
2019-10-29 15:59:31.565773056,2019-10-29 15:59:31.565756423,6293320,T,IEX,117.205000,100
2019-10-29 15:59:31.565797120,2019-10-29 15:59:31.565782146,6293321,T,IEX,117.205000,100
2019-10-29 16:00:02.87040,2019-10-29 16:00:02.69737,6371314,T,IEX,117.220000,100
2019-10-29 16:00:45.381639936,2019-10-29 16:00:45.381622853,6476675,T,IEX,117.300000,100
2019-10-29 16:01:24.524611072,2019-10-29 16:01:24.524591754,6531091,T,IEX,117.380000,100
2019-10-29 16:01:32.548922112,2019-10-29 16:01:32.548901688,6543623,T,IEX,117.380000,37
2019-10-29 16:01:32.548965888,2019-10-29 16:01:32.548950078,6543625,T,IEX,117.380000,22
2019-10-29 16:01:32.549005056,2019-10-29 16:01:32.548987993,6543627,T,IEX,117.380000,74
2019-10-29 16:01:32.549047040,2019-10-29 16:01:32.549029131,6543629,T,IEX,117.380000,74
2019-10-29 16:02:24.565327872,2019-10-29 16:02:24.565308842,6599208,T,IEX,117.360000,100
2019-10-29 16:03:01.501204992,2019-10-29 16:03:01.501184956,6637563,T,IEX,117.425000,100
2019-10-29 16:03:23.977723904,2019-10-29 16:03:23.977703495,6660715,T,IEX,117.400000,100
2019-10-29 16:03:43.56974080,2019-10-29 16:03:43.56956081,6674946,T,IEX,117.355000,100
2019-10-29 16:03:49.344931072,2019-10-29 16:03:49.344909044,6680971,T,IEX,117.320000,100
2019-10-29 16:03:51.522827008,2019-10-29 16:03:51.522808663,6682731,T,IEX,117.350000,31
2019-10-29 16:03:57.698537984,2019-10-29 16:03:57.698520078,6687113,T,IEX,117.345000,100
2019-10-29 16:04:15.506672128,2019-10-29 16:04:15.506652439,6704567,T,IEX,117.360000,100
2019-10-29 16:04:59.503119104,2019-10-29 16:04:59.503100487,6748451,T,IEX,117.390000,29
2019-10-29 16:04:59.521496064,2019-10-29 16:04:59.521478669,6749083,T,IEX,117.370000,100
2019-10-29 16:05:11.109212928,2019-10-29 16:05:11.109197685,6759654,T,IEX,117.370000,23
2019-10-29 16:05:23.211682048,2019-10-29 16:05:23.211661679,6767120,T,IEX,117.400000,100
2019-10-29 16:05:40.631680000,2019-10-29 16:05:40.631660256,6778007,T,IEX,117.400000,100
2019-10-29 16:05:41.949155072,2019-10-29 16:05:41.949134971,6778571,T,IEX,117.390000,100
2019-10-29 16:05:55.765799936,2019-10-29 16:05:55.765780574,6786856,T,IEX,117.360000,100
2019-10-29 16:06:06.367814912,2019-10-29 16:06:06.367797515,6794324,T,IEX,117.340000,89
2019-10-29 16:06:11.629509120,2019-10-29 16:06:11.629488786,6798239,T,IEX,117.250000,100
2019-10-29 16:06:27.186936064,2019-10-29 16:06:27.186914156,6807135,T,IEX,117.295000,100
2019-10-29 16:06:27.187949056,2019-10-29 16:06:27.187931491,6807136,T,IEX,117.295000,100
2019-10-29 16:07:12.966274048,2019-10-29 16:07:12.966253812,6845836,T,IEX,117.330000,200
2019-10-29 16:07:12.966727936,2019-10-29 16:07:12.966708901,6845851,T,IEX,117.330000,7
2019-10-29 16:07:13.58202112,2019-10-29 16:07:13.58181098,6846188,T,IEX,117.330000,100
2019-10-29 16:07:40.470105088,2019-10-29 16:07:40.470086317,6867716,T,IEX,117.280000,100
2019-10-29 16:07:45.815459072,2019-10-29 16:07:45.815439183,6870395,T,IEX,117.270000,100
2019-10-29 16:07:49.152179968,2019-10-29 16:07:49.152160656,6872661,T,IEX,117.250000,100
2019-10-29 16:08:26.331112960,2019-10-29 16:08:26.331093934,6896875,T,IEX,117.190000,100
2019-10-29 16:08:41.122774016,2019-10-29 16:08:41.122755913,6906217,T,IEX,117.235000,100
2019-10-29 16:09:08.167188992,2019-10-29 16:09:08.167172640,6921882,T,IEX,117.205000,100
2019-10-29 16:09:20.454962944,2019-10-29 16:09:20.454945345,6930050,T,IEX,117.140000,15
2019-10-29 16:09:23.684441088,2019-10-29 16:09:23.684422707,6931833,T,IEX,117.145000,100
2019-10-29 16:10:33.245944064,2019-10-29 16:10:33.245924552,6974271,T,IEX,117.200000,100
2019-10-29 16:11:07.155330048,2019-10-29 16:11:07.155314649,6992339,T,IEX,117.185000,100
2019-10-29 16:11:24.832655872,2019-10-29 16:11:24.832638371,7002941,T,IEX,117.160000,100
2019-10-29 16:12:24.861868032,2019-10-29 16:12:24.861849645,7037735,T,IEX,117.240000,100
2019-10-29 16:17:25.139204096,2019-10-29 16:17:25.139186058,7208103,T,IEX,117.400000,100
2019-10-29 16:17:46.475926016,2019-10-29 16:17:46.475905648,7223428,T,IEX,117.440000,100
2019-10-29 16:17:50.868806912,2019-10-29 16:17:50.868785541,7226421,T,IEX,117.430000,100
2019-10-29 16:22:25.357434880,2019-10-29 16:22:25.357413165,7366530,T,IEX,117.420000,100
2019-10-29 16:23:27.204172032,2019-10-29 16:23:27.204151760,7393417,T,IEX,117.420000,100
2019-10-29 16:23:31.811887104,2019-10-29 16:23:31.811868925,7395521,T,IEX,117.410000,100
2019-10-29 16:23:32.164916992,2019-10-29 16:23:32.164896558,7395658,T,IEX,117.390000,100
2019-10-29 16:23:32.164933888,2019-10-29 16:23:32.164916227,7395659,T,IEX,117.390000,100
2019-10-29 16:23:33.495503104,2019-10-29 16:23:33.495486790,7396261,T,IEX,117.335000,100
2019-10-29 16:23:33.495521024,2019-10-29 16:23:33.495503238,7396262,T,IEX,117.335000,100
2019-10-29 16:23:36.330917888,2019-10-29 16:23:36.330898080,7397909,T,IEX,117.310000,100
2019-10-29 16:23:36.330935040,2019-10-29 16:23:36.330918010,7397910,T,IEX,117.310000,300
2019-10-29 16:23:37.309822976,2019-10-29 16:23:37.309800271,7398256,T,IEX,117.310000,200
2019-10-29 16:23:43.694987008,2019-10-29 16:23:43.694970083,7400724,T,IEX,117.350000,100
2019-10-29 16:24:24.828407040,2019-10-29 16:24:24.828388071,7425020,T,IEX,117.405000,100
2019-10-29 16:24:41.812875008,2019-10-29 16:24:41.812854530,7433598,T,IEX,117.390000,100
2019-10-29 16:25:35.747726080,2019-10-29 16:25:35.747708327,7461027,T,IEX,117.410000,100
2019-10-29 16:26:08.763023104,2019-10-29 16:26:08.763004661,7479289,T,IEX,117.405000,100
2019-10-29 16:26:23.712397056,2019-10-29 16:26:23.712377392,7486032,T,IEX,117.400000,100
2019-10-29 16:26:23.821794048,2019-10-29 16:26:23.821777172,7486836,T,IEX,117.385000,100
2019-10-29 16:26:30.750631936,2019-10-29 16:26:30.750613186,7491083,T,IEX,117.375000,100
2019-10-29 16:26:31.837428992,2019-10-29 16:26:31.837412367,7491740,T,IEX,117.375000,100
2019-10-29 16:27:03.849260032,2019-10-29 16:27:03.849242975,7509068,T,IEX,117.420000,100
2019-10-29 16:27:03.876708096,2019-10-29 16:27:03.876687753,7509086,T,IEX,117.450000,100
2019-10-29 16:27:03.938885888,2019-10-29 16:27:03.938869069,7509111,T,IEX,117.470000,100
2019-10-29 16:27:03.938900992,2019-10-29 16:27:03.938884481,7509112,T,IEX,117.470000,100
2019-10-29 16:27:40.276974080,2019-10-29 16:27:40.276954601,7524976,T,IEX,117.460000,100
2019-10-29 16:29:25.528858112,2019-10-29 16:29:25.528839733,7576089,T,IEX,117.400000,1
2019-10-29 16:29:48.753012992,2019-10-29 16:29:48.752993415,7589192,T,IEX,117.390000,100
2019-10-29 16:30:01.476979968,2019-10-29 16:30:01.476961280,7599254,T,IEX,117.445000,100
2019-10-29 16:30:04.516545024,2019-10-29 16:30:04.516526814,7601671,T,IEX,117.480000,2
2019-10-29 16:30:06.39065088,2019-10-29 16:30:06.39045403,7602767,T,IEX,117.500000,100
2019-10-29 16:31:05.695714048,2019-10-29 16:31:05.695698868,7631932,T,IEX,117.530000,100
2019-10-29 16:31:17.3334912,2019-10-29 16:31:17.3315403,7635690,T,IEX,117.590000,100
2019-10-29 16:31:17.49527040,2019-10-29 16:31:17.49511510,7635709,T,IEX,117.590000,100
2019-10-29 16:31:38.802199040,2019-10-29 16:31:38.802180516,7645778,T,IEX,117.585000,8
2019-10-29 16:31:42.981758976,2019-10-29 16:31:42.981738972,7647680,T,IEX,117.600000,100
2019-10-29 16:31:46.736944896,2019-10-29 16:31:46.736925538,7649937,T,IEX,117.600000,100
2019-10-29 16:32:00.509978112,2019-10-29 16:32:00.509960033,7656237,T,IEX,117.640000,74
2019-10-29 16:32:09.572342016,2019-10-29 16:32:09.572323859,7660355,T,IEX,117.640000,100
2019-10-29 16:32:11.49678080,2019-10-29 16:32:11.49661744,7660960,T,IEX,117.640000,1
2019-10-29 16:32:13.80465920,2019-10-29 16:32:13.80450025,7661985,T,IEX,117.640000,117
2019-10-29 16:32:13.81424896,2019-10-29 16:32:13.81408961,7661990,T,IEX,117.640000,1883
2019-10-29 16:32:21.189058048,2019-10-29 16:32:21.189039432,7666028,T,IEX,117.630000,76
2019-10-29 16:32:34.650420992,2019-10-29 16:32:34.650403207,7672474,T,IEX,117.655000,100
2019-10-29 16:32:53.264160000,2019-10-29 16:32:53.264141918,7680806,T,IEX,117.655000,127
2019-10-29 16:32:53.929856000,2019-10-29 16:32:53.929836505,7681107,T,IEX,117.655000,100
2019-10-29 16:33:06.133519104,2019-10-29 16:33:06.133499505,7685984,T,IEX,117.665000,39
2019-10-29 16:35:25.863249920,2019-10-29 16:35:25.863233084,7750543,T,IEX,117.565000,100
2019-10-29 16:35:27.442880000,2019-10-29 16:35:27.442862664,7751255,T,IEX,117.580000,72
2019-10-29 16:35:27.442895872,2019-10-29 16:35:27.442880053,7751256,T,IEX,117.580000,28
2019-10-29 16:35:27.818759936,2019-10-29 16:35:27.818739088,7751414,T,IEX,117.580000,100
2019-10-29 16:35:46.912979968,2019-10-29 16:35:46.912962122,7760872,T,IEX,117.580000,100
2019-10-29 16:35:55.15357952,2019-10-29 16:35:55.15338985,7764606,T,IEX,117.580000,1
2019-10-29 16:36:05.923501056,2019-10-29 16:36:05.923481673,7769354,T,IEX,117.590000,100
2019-10-29 16:36:06.483742976,2019-10-29 16:36:06.483723350,7769579,T,IEX,117.595000,1
2019-10-29 16:36:15.556530944,2019-10-29 16:36:15.556513710,7772882,T,IEX,117.590000,1
2019-10-29 16:36:24.895319040,2019-10-29 16:36:24.895298760,7776265,T,IEX,117.590000,100
2019-10-29 16:36:28.477208064,2019-10-29 16:36:28.477187823,7777601,T,IEX,117.590000,100
2019-10-29 16:37:12.495586048,2019-10-29 16:37:12.495567250,7796664,T,IEX,117.560000,100
2019-10-29 16:37:36.369144064,2019-10-29 16:37:36.369124208,7804418,T,IEX,117.585000,100
2019-10-29 16:37:58.642642944,2019-10-29 16:37:58.642622197,7812133,T,IEX,117.590000,100
2019-10-29 16:38:15.96862976,2019-10-29 16:38:15.96842368,7819015,T,IEX,117.625000,100
2019-10-29 16:38:29.290967040,2019-10-29 16:38:29.290946684,7824973,T,IEX,117.625000,100
2019-10-29 16:42:05.455488000,2019-10-29 16:42:05.455467032,7912216,T,IEX,117.530000,1
2019-10-29 16:43:07.85491968,2019-10-29 16:43:07.85473622,7936847,T,IEX,117.560000,100
2019-10-29 16:43:22.935927040,2019-10-29 16:43:22.935907466,7942810,T,IEX,117.540000,2
2019-10-29 16:45:26.229498880,2019-10-29 16:45:26.229482116,7997005,T,IEX,117.535000,100
2019-10-29 16:45:27.59511040,2019-10-29 16:45:27.59495093,7997475,T,IEX,117.550000,100
2019-10-29 16:45:57.104614912,2019-10-29 16:45:57.104595589,8006535,T,IEX,117.540000,1
2019-10-29 16:48:25.369395968,2019-10-29 16:48:25.369374143,8058648,T,IEX,117.550000,100
2019-10-29 16:48:25.370702080,2019-10-29 16:48:25.370682183,8058649,T,IEX,117.550000,100
2019-10-29 16:50:00.614867968,2019-10-29 16:50:00.614848980,8099739,T,IEX,117.520000,1
2019-10-29 16:50:26.360483072,2019-10-29 16:50:26.360463651,8111154,T,IEX,117.520000,13
2019-10-29 16:51:13.626885888,2019-10-29 16:51:13.626868429,8128054,T,IEX,117.510000,100
2019-10-29 16:51:15.873755904,2019-10-29 16:51:15.873735857,8128887,T,IEX,117.500000,100
2019-10-29 16:51:27.612203008,2019-10-29 16:51:27.612183804,8133791,T,IEX,117.515000,100
2019-10-29 16:51:52.5385984,2019-10-29 16:51:52.5365408,8141684,T,IEX,117.515000,100
2019-10-29 16:52:01.5673984,2019-10-29 16:52:01.5652642,8145447,T,IEX,117.500000,100
2019-10-29 16:53:17.768060928,2019-10-29 16:53:17.768044801,8172755,T,IEX,117.510000,27
2019-10-29 16:54:38.856761088,2019-10-29 16:54:38.856738286,8203244,T,IEX,117.510000,2
2019-10-29 16:55:43.464623104,2019-10-29 16:55:43.464603115,8225351,T,IEX,117.450000,100
2019-10-29 16:55:43.732434944,2019-10-29 16:55:43.732415805,8226818,T,IEX,117.450000,100
2019-10-29 16:56:41.850844928,2019-10-29 16:56:41.850827778,8257922,T,IEX,117.435000,100
2019-10-29 16:57:25.618246912,2019-10-29 16:57:25.618228667,8275374,T,IEX,117.415000,100
2019-10-29 16:59:41.243570944,2019-10-29 16:59:41.243551920,8327947,T,IEX,117.400000,2
2019-10-29 16:59:41.243589888,2019-10-29 16:59:41.243572281,8327948,T,IEX,117.400000,2
2019-10-29 17:01:25.544115968,2019-10-29 17:01:25.544095894,8374427,T,IEX,117.500000,100
2019-10-29 17:04:08.439944960,2019-10-29 17:04:08.439927780,8437472,T,IEX,117.510000,100
2019-10-29 17:05:55.240803072,2019-10-29 17:05:55.240783363,8476118,T,IEX,117.555000,1
2019-10-29 17:06:44.329634048,2019-10-29 17:06:44.329615546,8493507,T,IEX,117.565000,1
2019-10-29 17:07:23.55360000,2019-10-29 17:07:23.55344533,8506482,T,IEX,117.530000,100
2019-10-29 17:07:55.323150080,2019-10-29 17:07:55.323131865,8518942,T,IEX,117.520000,1
2019-10-29 17:08:06.223844096,2019-10-29 17:08:06.223824771,8523638,T,IEX,117.535000,1
2019-10-29 17:08:06.235297024,2019-10-29 17:08:06.235277082,8523642,T,IEX,117.535000,100
2019-10-29 17:08:06.617372928,2019-10-29 17:08:06.617351245,8523764,T,IEX,117.520000,1
2019-10-29 17:08:55.81417984,2019-10-29 17:08:55.81399587,8542364,T,IEX,117.515000,1
2019-10-29 17:08:57.104659968,2019-10-29 17:08:57.104641123,8542941,T,IEX,117.510000,1
2019-10-29 17:09:19.260443904,2019-10-29 17:09:19.260424452,8551751,T,IEX,117.530000,1
2019-10-29 17:09:25.260706048,2019-10-29 17:09:25.260684386,8554357,T,IEX,117.530000,1
2019-10-29 17:09:26.263237888,2019-10-29 17:09:26.263222724,8554694,T,IEX,117.530000,100
2019-10-29 17:09:55.322617088,2019-10-29 17:09:55.322597301,8564836,T,IEX,117.535000,1
2019-10-29 17:09:57.462558976,2019-10-29 17:09:57.462537090,8565465,T,IEX,117.530000,1
2019-10-29 17:10:51.864861952,2019-10-29 17:10:51.864840515,8584407,T,IEX,117.550000,1
2019-10-29 17:12:35.486214912,2019-10-29 17:12:35.486197026,8623771,T,IEX,117.510000,1
2019-10-29 17:13:22.71823872,2019-10-29 17:13:22.71799945,8641612,T,IEX,117.500000,1
2019-10-29 17:14:07.73896960,2019-10-29 17:14:07.73874083,8658199,T,IEX,117.490000,1
2019-10-29 17:14:50.20728064,2019-10-29 17:14:50.20708888,8672000,T,IEX,117.510000,1
2019-10-29 17:15:39.124706048,2019-10-29 17:15:39.124684324,8689300,T,IEX,117.490000,1
2019-10-29 17:16:55.82268928,2019-10-29 17:16:55.82246205,8713727,T,IEX,117.520000,1
2019-10-29 17:17:10.682872064,2019-10-29 17:17:10.682853466,8719825,T,IEX,117.500000,2
2019-10-29 17:17:25.483616000,2019-10-29 17:17:25.483596147,8724906,T,IEX,117.500000,1
2019-10-29 17:17:25.683595008,2019-10-29 17:17:25.683576771,8724942,T,IEX,117.490000,1
2019-10-29 17:17:57.314854912,2019-10-29 17:17:57.314837189,8734340,T,IEX,117.490000,1
2019-10-29 17:19:35.113264896,2019-10-29 17:19:35.113246458,8764785,T,IEX,117.490000,1
2019-10-29 17:20:11.521090048,2019-10-29 17:20:11.521069698,8777367,T,IEX,117.500000,1
2019-10-29 17:20:32.95661056,2019-10-29 17:20:32.95642845,8784155,T,IEX,117.500000,100
2019-10-29 17:20:32.119915008,2019-10-29 17:20:32.119896453,8784165,T,IEX,117.510000,1
2019-10-29 17:20:51.95020032,2019-10-29 17:20:51.94998776,8790582,T,IEX,117.500000,1
2019-10-29 17:21:51.98642944,2019-10-29 17:21:51.98625402,8809372,T,IEX,117.500000,1
2019-10-29 17:22:45.699828992,2019-10-29 17:22:45.699809787,8825608,T,IEX,117.520000,1
2019-10-29 17:22:45.899784960,2019-10-29 17:22:45.899765607,8825669,T,IEX,117.510000,1
2019-10-29 17:23:44.882725120,2019-10-29 17:23:44.882703022,8844844,T,IEX,117.500000,100
2019-10-29 17:24:25.603854080,2019-10-29 17:24:25.603833778,8857120,T,IEX,117.490000,100
2019-10-29 17:24:43.108523008,2019-10-29 17:24:43.108501362,8863357,T,IEX,117.470000,100
2019-10-29 17:27:48.758866944,2019-10-29 17:27:48.758848654,8927967,T,IEX,117.470000,100
2019-10-29 17:28:00.854243072,2019-10-29 17:28:00.854222861,8930917,T,IEX,117.470000,100
2019-10-29 17:28:32.953696000,2019-10-29 17:28:32.953680066,8942609,T,IEX,117.460000,100
2019-10-29 17:28:34.237776896,2019-10-29 17:28:34.237756946,8942986,T,IEX,117.460000,100
2019-10-29 17:33:18.207648000,2019-10-29 17:33:18.207631469,9035975,T,IEX,117.480000,100
2019-10-29 17:33:50.964500992,2019-10-29 17:33:50.964480518,9046823,T,IEX,117.460000,100
2019-10-29 17:35:36.856197888,2019-10-29 17:35:36.856179490,9085475,T,IEX,117.410000,100
2019-10-29 17:35:38.875528960,2019-10-29 17:35:38.875507821,9086008,T,IEX,117.410000,100
2019-10-29 17:40:11.951886080,2019-10-29 17:40:11.951870783,9166926,T,IEX,117.460000,100
2019-10-29 17:41:11.595450112,2019-10-29 17:41:11.595428554,9185770,T,IEX,117.440000,7
2019-10-29 17:41:12.135348992,2019-10-29 17:41:12.135329808,9185993,T,IEX,117.440000,6
2019-10-29 17:44:55.164655104,2019-10-29 17:44:55.164639345,9252592,T,IEX,117.450000,100
2019-10-29 17:44:55.365502976,2019-10-29 17:44:55.365485160,9252939,T,IEX,117.450000,100
2019-10-29 17:46:35.667235072,2019-10-29 17:46:35.667214151,9287592,T,IEX,117.460000,50
2019-10-29 17:52:17.140307968,2019-10-29 17:52:17.140289912,9392141,T,IEX,117.510000,100
2019-10-29 17:52:40.164558080,2019-10-29 17:52:40.164539568,9400088,T,IEX,117.540000,100
2019-10-29 17:54:26.133434112,2019-10-29 17:54:26.133414180,9431183,T,IEX,117.560000,100
2019-10-29 17:54:26.161654016,2019-10-29 17:54:26.161637862,9431197,T,IEX,117.560000,37
2019-10-29 17:54:26.161748992,2019-10-29 17:54:26.161730381,9431199,T,IEX,117.560000,37
2019-10-29 17:54:26.161830912,2019-10-29 17:54:26.161812898,9431200,T,IEX,117.560000,26
2019-10-29 17:55:42.341480960,2019-10-29 17:55:42.341461644,9456355,T,IEX,117.560000,100
2019-10-29 17:57:21.404805888,2019-10-29 17:57:21.404786908,9485466,T,IEX,117.550000,100
2019-10-29 17:59:35.340073984,2019-10-29 17:59:35.340053353,9527595,T,IEX,117.550000,100
2019-10-29 18:00:27.498515968,2019-10-29 18:00:27.498493176,9546606,T,IEX,117.520000,100
2019-10-29 18:01:27.612011008,2019-10-29 18:01:27.611992386,9580534,T,IEX,117.490000,300
2019-10-29 18:01:31.564278016,2019-10-29 18:01:31.564230807,9582894,T,IEX,117.480000,100
2019-10-29 18:03:21.94316032,2019-10-29 18:03:21.94297062,9630764,T,IEX,117.430000,300
2019-10-29 18:04:41.111879936,2019-10-29 18:04:41.111860079,9660751,T,IEX,117.440000,300
2019-10-29 18:05:06.867185920,2019-10-29 18:05:06.867166153,9668784,T,IEX,117.430000,100
2019-10-29 18:05:27.105195008,2019-10-29 18:05:27.105177685,9675074,T,IEX,117.420000,300
2019-10-29 18:07:41.54926080,2019-10-29 18:07:41.54907911,9718967,T,IEX,117.440000,300
2019-10-29 18:08:36.624517120,2019-10-29 18:08:36.624495061,9735733,T,IEX,117.450000,100
2019-10-29 18:10:00.151981056,2019-10-29 18:10:00.151965167,9762932,T,IEX,117.490000,100
2019-10-29 18:10:08.872047104,2019-10-29 18:10:08.872029597,9766417,T,IEX,117.480000,21
2019-10-29 18:10:54.171514880,2019-10-29 18:10:54.171494225,9780721,T,IEX,117.530000,100
2019-10-29 18:11:00.915312896,2019-10-29 18:11:00.915290874,9783124,T,IEX,117.520000,100
2019-10-29 18:11:36.90272000,2019-10-29 18:11:36.90251873,9793001,T,IEX,117.495000,100
2019-10-29 18:11:39.231734016,2019-10-29 18:11:39.231715854,9793738,T,IEX,117.495000,100
2019-10-29 18:11:41.666182912,2019-10-29 18:11:41.666164734,9794472,T,IEX,117.490000,100
2019-10-29 18:13:22.208112896,2019-10-29 18:13:22.208094496,9825678,T,IEX,117.480000,100
2019-10-29 18:13:22.208129024,2019-10-29 18:13:22.208111928,9825679,T,IEX,117.480000,100
2019-10-29 18:13:22.234548992,2019-10-29 18:13:22.234530359,9825715,T,IEX,117.470000,100
2019-10-29 18:13:22.760218880,2019-10-29 18:13:22.760200582,9826017,T,IEX,117.460000,100
2019-10-29 18:13:22.786422016,2019-10-29 18:13:22.786402815,9826027,T,IEX,117.460000,100
2019-10-29 18:13:44.852175872,2019-10-29 18:13:44.852157635,9832767,T,IEX,117.425000,5
2019-10-29 18:14:36.432430080,2019-10-29 18:14:36.432412442,9848889,T,IEX,117.440000,89
2019-10-29 18:14:36.952910080,2019-10-29 18:14:36.952892574,9849036,T,IEX,117.460000,300
2019-10-29 18:16:45.185441024,2019-10-29 18:16:45.185422911,9893693,T,IEX,117.450000,100
2019-10-29 18:18:09.53905920,2019-10-29 18:18:09.53888347,9922000,T,IEX,117.460000,100
2019-10-29 18:22:01.846247936,2019-10-29 18:22:01.846231729,10007386,T,IEX,117.480000,300
2019-10-29 18:22:31.700295936,2019-10-29 18:22:31.700275220,10016942,T,IEX,117.465000,100
2019-10-29 18:22:53.73504000,2019-10-29 18:22:53.73487059,10022563,T,IEX,117.470000,100
2019-10-29 18:23:41.628451072,2019-10-29 18:23:41.628430182,10036213,T,IEX,117.410000,100
2019-10-29 18:23:43.370064896,2019-10-29 18:23:43.370046762,10036652,T,IEX,117.410000,100
2019-10-29 18:24:33.453784064,2019-10-29 18:24:33.453763573,10055751,T,IEX,117.430000,100
2019-10-29 18:25:19.803779072,2019-10-29 18:25:19.803758246,10071995,T,IEX,117.445000,20
2019-10-29 18:25:34.268186112,2019-10-29 18:25:34.268165743,10080826,T,IEX,117.460000,100
2019-10-29 18:25:52.920944896,2019-10-29 18:25:52.920925461,10088339,T,IEX,117.465000,300
2019-10-29 18:25:55.199825920,2019-10-29 18:25:55.199804032,10088915,T,IEX,117.460000,100
2019-10-29 18:26:02.120901888,2019-10-29 18:26:02.120882696,10092210,T,IEX,117.455000,100
2019-10-29 18:26:08.244222976,2019-10-29 18:26:08.244204859,10094676,T,IEX,117.450000,100
2019-10-29 18:26:11.754273024,2019-10-29 18:26:11.754254988,10096082,T,IEX,117.410000,100
2019-10-29 18:27:37.986959872,2019-10-29 18:27:37.986939560,10131551,T,IEX,117.450000,100
2019-10-29 18:27:37.986970880,2019-10-29 18:27:37.986952901,10131552,T,IEX,117.450000,100
2019-10-29 18:27:45.967376896,2019-10-29 18:27:45.967358847,10134806,T,IEX,117.450000,300
2019-10-29 18:28:04.606388992,2019-10-29 18:28:04.606371776,10142212,T,IEX,117.455000,100
2019-10-29 18:28:26.318097920,2019-10-29 18:28:26.318078620,10151814,T,IEX,117.450000,100
2019-10-29 18:28:36.332299008,2019-10-29 18:28:36.332277996,10154620,T,IEX,117.450000,100
2019-10-29 18:28:46.360805120,2019-10-29 18:28:46.360786292,10157853,T,IEX,117.410000,100
2019-10-29 18:28:46.360826880,2019-10-29 18:28:46.360809255,10157854,T,IEX,117.410000,300
2019-10-29 18:29:05.367299072,2019-10-29 18:29:05.367280974,10164465,T,IEX,117.410000,100
2019-10-29 18:29:36.992507904,2019-10-29 18:29:36.992488701,10175649,T,IEX,117.405000,300
2019-10-29 18:29:41.526652928,2019-10-29 18:29:41.526633398,10178151,T,IEX,117.410000,300
2019-10-29 18:29:41.540219904,2019-10-29 18:29:41.540202330,10178155,T,IEX,117.400000,100
2019-10-29 18:30:53.925539072,2019-10-29 18:30:53.925518660,10207430,T,IEX,117.440000,100
2019-10-29 18:31:20.341166080,2019-10-29 18:31:20.341145797,10216676,T,IEX,117.440000,100
2019-10-29 18:31:20.373763072,2019-10-29 18:31:20.373744852,10216689,T,IEX,117.440000,100
2019-10-29 18:31:20.389020928,2019-10-29 18:31:20.389000443,10216692,T,IEX,117.440000,100
2019-10-29 18:31:20.427696128,2019-10-29 18:31:20.427673469,10216704,T,IEX,117.440000,100
2019-10-29 18:31:21.327731968,2019-10-29 18:31:21.327711930,10216888,T,IEX,117.430000,100
2019-10-29 18:31:37.250621952,2019-10-29 18:31:37.250601106,10221137,T,IEX,117.410000,100
2019-10-29 18:31:38.478277120,2019-10-29 18:31:38.478261691,10221473,T,IEX,117.410000,100
2019-10-29 18:33:55.222147072,2019-10-29 18:33:55.222129472,10269342,T,IEX,117.490000,100
2019-10-29 18:33:55.222161920,2019-10-29 18:33:55.222146242,10269343,T,IEX,117.490000,200
2019-10-29 18:34:00.741199872,2019-10-29 18:34:00.741178786,10271047,T,IEX,117.490000,300
2019-10-29 18:34:09.830021888,2019-10-29 18:34:09.830003023,10274556,T,IEX,117.435000,100
2019-10-29 18:34:13.696111104,2019-10-29 18:34:13.696092249,10275635,T,IEX,117.430000,500
2019-10-29 18:34:13.706255104,2019-10-29 18:34:13.706234268,10275642,T,IEX,117.440000,300
2019-10-29 18:34:13.706269952,2019-10-29 18:34:13.706253704,10275643,T,IEX,117.440000,200
2019-10-29 18:34:25.187866880,2019-10-29 18:34:25.187848750,10279553,T,IEX,117.430000,100
2019-10-29 18:35:11.631464960,2019-10-29 18:35:11.631444822,10296741,T,IEX,117.450000,100
2019-10-29 18:35:41.631556096,2019-10-29 18:35:41.631540565,10308942,T,IEX,117.480000,100
2019-10-29 18:36:43.751112960,2019-10-29 18:36:43.751094929,10333854,T,IEX,117.440000,100
2019-10-29 18:37:44.599715072,2019-10-29 18:37:44.599695944,10355044,T,IEX,117.430000,100
2019-10-29 18:39:52.88393984,2019-10-29 18:39:52.88377931,10395227,T,IEX,117.420000,100
2019-10-29 18:40:07.906042112,2019-10-29 18:40:07.906024935,10402156,T,IEX,117.420000,50
2019-10-29 18:40:07.906878976,2019-10-29 18:40:07.906858738,10402164,T,IEX,117.420000,28
2019-10-29 18:40:07.906949888,2019-10-29 18:40:07.906931434,10402166,T,IEX,117.420000,74
2019-10-29 18:40:07.907009024,2019-10-29 18:40:07.906989861,10402168,T,IEX,117.420000,37
2019-10-29 18:40:07.907097088,2019-10-29 18:40:07.907078546,10402171,T,IEX,117.420000,100
2019-10-29 18:40:07.907190016,2019-10-29 18:40:07.907172326,10402173,T,IEX,117.420000,71
2019-10-29 18:40:07.908268032,2019-10-29 18:40:07.908251589,10402177,T,IEX,117.420000,100
2019-10-29 18:40:07.908445952,2019-10-29 18:40:07.908428974,10402179,T,IEX,117.420000,29
2019-10-29 18:40:07.925594880,2019-10-29 18:40:07.925577173,10402197,T,IEX,117.420000,37
2019-10-29 18:40:07.925702912,2019-10-29 18:40:07.925685892,10402199,T,IEX,117.420000,21
2019-10-29 18:40:07.925797120,2019-10-29 18:40:07.925779133,10402200,T,IEX,117.420000,37
2019-10-29 18:40:07.925859072,2019-10-29 18:40:07.925841609,10402201,T,IEX,117.420000,5
2019-10-29 18:42:06.226988032,2019-10-29 18:42:06.226968092,10442811,T,IEX,117.460000,300
2019-10-29 18:42:06.227000064,2019-10-29 18:42:06.226982442,10442812,T,IEX,117.460000,100
2019-10-29 18:42:46.555927040,2019-10-29 18:42:46.555909523,10454103,T,IEX,117.450000,100
2019-10-29 18:43:07.883762944,2019-10-29 18:43:07.883743787,10461201,T,IEX,117.450000,100
2019-10-29 18:44:06.792760064,2019-10-29 18:44:06.792739425,10479243,T,IEX,117.450000,10
2019-10-29 18:44:06.792770048,2019-10-29 18:44:06.792750408,10479244,T,IEX,117.450000,1
2019-10-29 18:44:06.792791040,2019-10-29 18:44:06.792771372,10479246,T,IEX,117.450000,11
2019-10-29 18:44:06.792809984,2019-10-29 18:44:06.792779912,10479248,T,IEX,117.430000,78
2019-10-29 18:44:06.795145984,2019-10-29 18:44:06.795119462,10479343,T,IEX,117.430000,22
2019-10-29 18:44:06.798053120,2019-10-29 18:44:06.798034062,10479484,T,IEX,117.440000,100
2019-10-29 18:44:43.732847104,2019-10-29 18:44:43.732829543,10499995,T,IEX,117.450000,20
2019-10-29 18:44:43.732862976,2019-10-29 18:44:43.732848103,10499996,T,IEX,117.450000,100
2019-10-29 18:48:43.966955008,2019-10-29 18:48:43.966935421,10587757,T,IEX,117.450000,100
2019-10-29 18:49:36.88678912,2019-10-29 18:49:36.88661557,10605922,T,IEX,117.460000,300
2019-10-29 18:49:57.544835072,2019-10-29 18:49:57.544817296,10612744,T,IEX,117.410000,300
2019-10-29 18:50:49.6457088,2019-10-29 18:50:49.6436332,10631718,T,IEX,117.430000,100
2019-10-29 18:50:59.732410112,2019-10-29 18:50:59.732392111,10636511,T,IEX,117.410000,100
2019-10-29 18:50:59.746959104,2019-10-29 18:50:59.746941496,10636516,T,IEX,117.410000,100
2019-10-29 18:51:03.1317888,2019-10-29 18:51:03.1301720,10638543,T,IEX,117.405000,100
2019-10-29 18:52:19.915026944,2019-10-29 18:52:19.915009552,10664175,T,IEX,117.400000,100
2019-10-29 18:53:16.574447104,2019-10-29 18:53:16.574427753,10682953,T,IEX,117.400000,3
2019-10-29 18:53:16.574892032,2019-10-29 18:53:16.574871468,10682969,T,IEX,117.400000,11
2019-10-29 18:53:16.591046912,2019-10-29 18:53:16.591027278,10683551,T,IEX,117.400000,86
2019-10-29 18:53:45.220559104,2019-10-29 18:53:45.220543647,10696037,T,IEX,117.355000,100
2019-10-29 18:53:45.220583936,2019-10-29 18:53:45.220567955,10696038,T,IEX,117.355000,100
2019-10-29 18:53:45.288588032,2019-10-29 18:53:45.288572907,10696166,T,IEX,117.355000,100
2019-10-29 18:54:02.795121920,2019-10-29 18:54:02.795102003,10702036,T,IEX,117.340000,100
2019-10-29 18:54:02.795138048,2019-10-29 18:54:02.795121230,10702037,T,IEX,117.340000,100
2019-10-29 18:54:02.862424064,2019-10-29 18:54:02.862406874,10702046,T,IEX,117.340000,132
2019-10-29 18:55:21.394108928,2019-10-29 18:55:21.394089213,10730205,T,IEX,117.320000,12
2019-10-29 18:55:30.123200000,2019-10-29 18:55:30.123180356,10733794,T,IEX,117.310000,100
2019-10-29 18:56:52.781430016,2019-10-29 18:56:52.781411253,10766847,T,IEX,117.345000,10
2019-10-29 18:57:34.406391040,2019-10-29 18:57:34.406371929,10783409,T,IEX,117.340000,1
2019-10-29 18:57:35.3806976,2019-10-29 18:57:35.3789065,10783679,T,IEX,117.340000,1
2019-10-29 18:57:39.124545024,2019-10-29 18:57:39.124527150,10785918,T,IEX,117.330000,100
2019-10-29 18:57:39.127322112,2019-10-29 18:57:39.127301684,10785920,T,IEX,117.330000,1
2019-10-29 18:57:44.164123904,2019-10-29 18:57:44.164106675,10787948,T,IEX,117.340000,79
2019-10-29 18:58:03.108883968,2019-10-29 18:58:03.108866741,10797620,T,IEX,117.340000,1
2019-10-29 18:58:05.684858112,2019-10-29 18:58:05.684839627,10799182,T,IEX,117.340000,1
2019-10-29 18:58:07.629049088,2019-10-29 18:58:07.629031219,10801368,T,IEX,117.340000,1
2019-10-29 18:58:12.410931968,2019-10-29 18:58:12.410913431,10803697,T,IEX,117.340000,5
2019-10-29 18:58:17.402160896,2019-10-29 18:58:17.402144238,10805883,T,IEX,117.350000,1
2019-10-29 18:58:59.332125952,2019-10-29 18:58:59.332101466,10825601,T,IEX,117.335000,1
2019-10-29 18:59:08.333122048,2019-10-29 18:59:08.333102178,10830599,T,IEX,117.330000,2
2019-10-29 18:59:27.859966976,2019-10-29 18:59:27.859946338,10839291,T,IEX,117.360000,1
2019-10-29 18:59:40.378269952,2019-10-29 18:59:40.378249955,10845844,T,IEX,117.350000,1
2019-10-29 18:59:49.907799040,2019-10-29 18:59:49.907779934,10851411,T,IEX,117.340000,100
2019-10-29 18:59:49.915579904,2019-10-29 18:59:49.915561077,10851677,T,IEX,117.330000,1
2019-10-29 18:59:50.145967104,2019-10-29 18:59:50.145949291,10852931,T,IEX,117.325000,3
2019-10-29 19:00:01.288705024,2019-10-29 19:00:01.288688893,10863163,T,IEX,117.350000,1
2019-10-29 19:00:04.244009984,2019-10-29 19:00:04.243990541,10865359,T,IEX,117.335000,1
2019-10-29 19:00:04.762941952,2019-10-29 19:00:04.762924048,10865644,T,IEX,117.330000,1
2019-10-29 19:00:16.955649024,2019-10-29 19:00:16.955632680,10873297,T,IEX,117.330000,1
2019-10-29 19:00:43.26803968,2019-10-29 19:00:43.26781252,10884804,T,IEX,117.330000,1
2019-10-29 19:00:55.923781888,2019-10-29 19:00:55.923762364,10890292,T,IEX,117.330000,3
2019-10-29 19:01:03.626649088,2019-10-29 19:01:03.626628810,10892733,T,IEX,117.310000,7
2019-10-29 19:01:06.149212928,2019-10-29 19:01:06.149196084,10893453,T,IEX,117.315000,1
2019-10-29 19:01:21.550022912,2019-10-29 19:01:21.550003760,10900746,T,IEX,117.325000,1
2019-10-29 19:01:42.417317120,2019-10-29 19:01:42.417298736,10909246,T,IEX,117.350000,1
2019-10-29 19:01:42.422462976,2019-10-29 19:01:42.422446037,10909248,T,IEX,117.340000,100
2019-10-29 19:01:42.422886912,2019-10-29 19:01:42.422869690,10909250,T,IEX,117.340000,100
2019-10-29 19:01:42.429175040,2019-10-29 19:01:42.429153646,10909256,T,IEX,117.340000,100
2019-10-29 19:01:43.194319104,2019-10-29 19:01:43.194300889,10909479,T,IEX,117.340000,1
2019-10-29 19:01:51.591898880,2019-10-29 19:01:51.591880764,10912842,T,IEX,117.335000,1
2019-10-29 19:01:51.599832064,2019-10-29 19:01:51.599812634,10912844,T,IEX,117.335000,1
2019-10-29 19:02:06.116030976,2019-10-29 19:02:06.116014593,10921247,T,IEX,117.320000,1
2019-10-29 19:02:33.662556928,2019-10-29 19:02:33.662541372,10930503,T,IEX,117.310000,1
2019-10-29 19:02:33.675220992,2019-10-29 19:02:33.675203289,10930505,T,IEX,117.300000,18
2019-10-29 19:02:52.413677056,2019-10-29 19:02:52.413659057,10937239,T,IEX,117.290000,1
2019-10-29 19:02:52.421445120,2019-10-29 19:02:52.421424011,10937241,T,IEX,117.310000,1
2019-10-29 19:02:55.382217984,2019-10-29 19:02:55.382200440,10938437,T,IEX,117.300000,2
2019-10-29 19:02:57.995960064,2019-10-29 19:02:57.995939514,10939237,T,IEX,117.290000,100
2019-10-29 19:02:57.996941056,2019-10-29 19:02:57.996922271,10939238,T,IEX,117.280000,100
2019-10-29 19:02:57.996953088,2019-10-29 19:02:57.996936190,10939239,T,IEX,117.280000,100
2019-10-29 19:03:03.452333056,2019-10-29 19:03:03.452313793,10941166,T,IEX,117.300000,1
2019-10-29 19:03:03.461210112,2019-10-29 19:03:03.461188842,10941168,T,IEX,117.300000,1
2019-10-29 19:03:14.984193024,2019-10-29 19:03:14.984173342,10945629,T,IEX,117.300000,1
2019-10-29 19:03:17.849069056,2019-10-29 19:03:17.849049673,10946879,T,IEX,117.290000,100
2019-10-29 19:03:17.849082880,2019-10-29 19:03:17.849065340,10946880,T,IEX,117.290000,200
2019-10-29 19:03:20.213028096,2019-10-29 19:03:20.213008873,10947745,T,IEX,117.290000,1
2019-10-29 19:03:21.764393984,2019-10-29 19:03:21.764374859,10948104,T,IEX,117.290000,1
2019-10-29 19:03:24.273021952,2019-10-29 19:03:24.273004773,10948799,T,IEX,117.290000,300
2019-10-29 19:03:30.235036928,2019-10-29 19:03:30.235017957,10950541,T,IEX,117.280000,1
2019-10-29 19:03:31.684428032,2019-10-29 19:03:31.684412165,10950903,T,IEX,117.280000,1
2019-10-29 19:03:33.632773120,2019-10-29 19:03:33.632754033,10951396,T,IEX,117.270000,100
2019-10-29 19:03:33.641581056,2019-10-29 19:03:33.641566053,10951400,T,IEX,117.280000,1
2019-10-29 19:03:33.652412928,2019-10-29 19:03:33.652394415,10951403,T,IEX,117.280000,1
2019-10-29 19:03:38.548918016,2019-10-29 19:03:38.548899062,10952692,T,IEX,117.275000,1
2019-10-29 19:03:38.549967872,2019-10-29 19:03:38.549947528,10952694,T,IEX,117.290000,11
2019-10-29 19:03:38.550022912,2019-10-29 19:03:38.550005299,10952696,T,IEX,117.290000,11
2019-10-29 19:03:38.550061056,2019-10-29 19:03:38.550042310,10952697,T,IEX,117.290000,37
2019-10-29 19:03:38.550095104,2019-10-29 19:03:38.550076182,10952698,T,IEX,117.290000,41
2019-10-29 19:03:39.385628928,2019-10-29 19:03:39.385609079,10952985,T,IEX,117.280000,2
2019-10-29 19:03:40.562511104,2019-10-29 19:03:40.562491351,10953294,T,IEX,117.280000,1
2019-10-29 19:03:42.5164032,2019-10-29 19:03:42.5146086,10953657,T,IEX,117.275000,300
2019-10-29 19:03:42.5181952,2019-10-29 19:03:42.5164550,10953658,T,IEX,117.275000,100
2019-10-29 19:03:42.5196032,2019-10-29 19:03:42.5177667,10953659,T,IEX,117.275000,100
2019-10-29 19:03:46.182556928,2019-10-29 19:03:46.182541496,10955838,T,IEX,117.290000,1
2019-10-29 19:03:46.189895936,2019-10-29 19:03:46.189873637,10955844,T,IEX,117.295000,2
2019-10-29 19:03:46.384048128,2019-10-29 19:03:46.384029364,10955943,T,IEX,117.295000,1
2019-10-29 19:03:46.793751040,2019-10-29 19:03:46.793730431,10956056,T,IEX,117.295000,1
2019-10-29 19:03:48.747827968,2019-10-29 19:03:48.747808651,10956616,T,IEX,117.260000,100
2019-10-29 19:03:49.71532032,2019-10-29 19:03:49.71513899,10956691,T,IEX,117.260000,100
2019-10-29 19:03:49.71545088,2019-10-29 19:03:49.71527244,10956692,T,IEX,117.260000,100
2019-10-29 19:03:49.71558912,2019-10-29 19:03:49.71541006,10956693,T,IEX,117.260000,100
2019-10-29 19:03:49.74126080,2019-10-29 19:03:49.74108055,10956714,T,IEX,117.260000,100
2019-10-29 19:03:49.132339968,2019-10-29 19:03:49.132319559,10956762,T,IEX,117.260000,100
2019-10-29 19:03:55.69113088,2019-10-29 19:03:55.69095109,10958586,T,IEX,117.275000,1
2019-10-29 19:04:01.415987968,2019-10-29 19:04:01.415968620,10960507,T,IEX,117.270000,6
2019-10-29 19:04:01.459309056,2019-10-29 19:04:01.459290456,10960518,T,IEX,117.280000,2
2019-10-29 19:04:02.608379904,2019-10-29 19:04:02.608363686,10960987,T,IEX,117.260000,100
2019-10-29 19:04:18.523107072,2019-10-29 19:04:18.523088912,10968160,T,IEX,117.260000,100
2019-10-29 19:04:42.649046016,2019-10-29 19:04:42.649026533,10975767,T,IEX,117.260000,1
2019-10-29 19:04:54.459521024,2019-10-29 19:04:54.459501789,10981750,T,IEX,117.290000,1
2019-10-29 19:04:54.467058944,2019-10-29 19:04:54.467040828,10981816,T,IEX,117.290000,1
2019-10-29 19:05:28.419422976,2019-10-29 19:05:28.419404941,10996221,T,IEX,117.270000,1
2019-10-29 19:06:12.21018112,2019-10-29 19:06:12.20999054,11013580,T,IEX,117.260000,100
2019-10-29 19:06:43.308515072,2019-10-29 19:06:43.308494103,11025071,T,IEX,117.255000,1
2019-10-29 19:06:43.322669056,2019-10-29 19:06:43.322645806,11025072,T,IEX,117.255000,4
2019-10-29 19:07:46.424870912,2019-10-29 19:07:46.424851169,11046712,T,IEX,117.250000,1
2019-10-29 19:08:27.222930944,2019-10-29 19:08:27.222913571,11065186,T,IEX,117.265000,1
2019-10-29 19:08:27.237114112,2019-10-29 19:08:27.237095856,11065188,T,IEX,117.265000,5
2019-10-29 19:08:33.990747904,2019-10-29 19:08:33.990729346,11066908,T,IEX,117.255000,100
2019-10-29 19:08:38.831932928,2019-10-29 19:08:38.831913578,11068277,T,IEX,117.250000,100
2019-10-29 19:08:40.960972032,2019-10-29 19:08:40.960953814,11069434,T,IEX,117.250000,100
2019-10-29 19:08:51.427454976,2019-10-29 19:08:51.427437476,11073244,T,IEX,117.250000,1
2019-10-29 19:09:12.287750912,2019-10-29 19:09:12.287732270,11082638,T,IEX,117.235000,2
2019-10-29 19:09:13.574810880,2019-10-29 19:09:13.574792496,11083775,T,IEX,117.260000,1
2019-10-29 19:09:13.582894080,2019-10-29 19:09:13.582876362,11083781,T,IEX,117.260000,2
2019-10-29 19:09:53.463781120,2019-10-29 19:09:53.463761753,11097952,T,IEX,117.250000,100
2019-10-29 19:09:53.466494976,2019-10-29 19:09:53.466475769,11097954,T,IEX,117.245000,1
2019-10-29 19:10:12.517017088,2019-10-29 19:10:12.516999614,11103474,T,IEX,117.260000,1
2019-10-29 19:10:12.524212992,2019-10-29 19:10:12.524193696,11103477,T,IEX,117.265000,3
2019-10-29 19:10:28.919091968,2019-10-29 19:10:28.919072010,11110636,T,IEX,117.275000,1
2019-10-29 19:10:44.432142080,2019-10-29 19:10:44.432120509,11116203,T,IEX,117.280000,1
2019-10-29 19:11:12.744065024,2019-10-29 19:11:12.744046040,11126419,T,IEX,117.275000,1
2019-10-29 19:11:12.756376064,2019-10-29 19:11:12.756356003,11126426,T,IEX,117.275000,1
2019-10-29 19:11:14.764322048,2019-10-29 19:11:14.764302978,11127020,T,IEX,117.265000,1
2019-10-29 19:11:14.777340928,2019-10-29 19:11:14.777322610,11127023,T,IEX,117.265000,1
2019-10-29 19:11:15.271089920,2019-10-29 19:11:15.271071833,11127204,T,IEX,117.260000,100
2019-10-29 19:11:43.797728000,2019-10-29 19:11:43.797711830,11135890,T,IEX,117.260000,1
2019-10-29 19:11:43.830321920,2019-10-29 19:11:43.830306427,11136021,T,IEX,117.260000,3
2019-10-29 19:11:44.740794880,2019-10-29 19:11:44.740773336,11136815,T,IEX,117.260000,100
2019-10-29 19:12:51.823830016,2019-10-29 19:12:51.823812743,11161285,T,IEX,117.265000,300
2019-10-29 19:12:52.864280064,2019-10-29 19:12:52.864259635,11161812,T,IEX,117.265000,1
2019-10-29 19:12:52.882352896,2019-10-29 19:12:52.882336852,11161820,T,IEX,117.265000,1
2019-10-29 19:12:57.658653952,2019-10-29 19:12:57.658635025,11163298,T,IEX,117.265000,1
2019-10-29 19:13:07.104660992,2019-10-29 19:13:07.104639982,11166577,T,IEX,117.260000,100
2019-10-29 19:13:07.104673024,2019-10-29 19:13:07.104656139,11166578,T,IEX,117.260000,100
2019-10-29 19:13:07.150490880,2019-10-29 19:13:07.150473334,11166589,T,IEX,117.260000,1
2019-10-29 19:13:23.480816896,2019-10-29 19:13:23.480799164,11171859,T,IEX,117.255000,1
2019-10-29 19:13:23.498819072,2019-10-29 19:13:23.498799819,11171862,T,IEX,117.255000,2
2019-10-29 19:13:31.17754112,2019-10-29 19:13:31.17736141,11174274,T,IEX,117.250000,100
2019-10-29 19:13:32.942011904,2019-10-29 19:13:32.941992014,11174866,T,IEX,117.255000,1
2019-10-29 19:13:33.219261952,2019-10-29 19:13:33.219242800,11174988,T,IEX,117.250000,100
2019-10-29 19:13:39.609580032,2019-10-29 19:13:39.609558455,11176685,T,IEX,117.235000,100
2019-10-29 19:13:39.609592064,2019-10-29 19:13:39.609576282,11176686,T,IEX,117.235000,100
2019-10-29 19:13:39.609607936,2019-10-29 19:13:39.609591909,11176687,T,IEX,117.235000,100
2019-10-29 19:13:41.595358976,2019-10-29 19:13:41.595338625,11177370,T,IEX,117.235000,300
2019-10-29 19:13:46.7301888,2019-10-29 19:13:46.7280230,11178699,T,IEX,117.230000,100
2019-10-29 19:13:51.545181952,2019-10-29 19:13:51.545163882,11180498,T,IEX,117.220000,100
2019-10-29 19:13:52.821830912,2019-10-29 19:13:52.821813053,11180867,T,IEX,117.220000,100
2019-10-29 19:13:55.127794944,2019-10-29 19:13:55.127778332,11181516,T,IEX,117.220000,2
2019-10-29 19:14:09.900167936,2019-10-29 19:14:09.900152406,11186127,T,IEX,117.240000,100
2019-10-29 19:14:10.440802048,2019-10-29 19:14:10.440781763,11186869,T,IEX,117.240000,1
2019-10-29 19:14:27.802128896,2019-10-29 19:14:27.802108549,11193440,T,IEX,117.250000,3
2019-10-29 19:14:27.810040064,2019-10-29 19:14:27.809860754,11193442,T,IEX,117.255000,2
2019-10-29 19:15:17.265541888,2019-10-29 19:15:17.265523889,11210103,T,IEX,117.245000,100
2019-10-29 19:15:18.575433984,2019-10-29 19:15:18.575418792,11210902,T,IEX,117.250000,1
2019-10-29 19:16:53.802284032,2019-10-29 19:16:53.802265721,11248489,T,IEX,117.230000,100
2019-10-29 19:16:54.304378112,2019-10-29 19:16:54.304362297,11248668,T,IEX,117.220000,100
2019-10-29 19:18:03.128719104,2019-10-29 19:18:03.128700836,11277018,T,IEX,117.190000,100
2019-10-29 19:18:18.94195968,2019-10-29 19:18:18.94178120,11281659,T,IEX,117.190000,54
2019-10-29 19:18:18.94212096,2019-10-29 19:18:18.94196634,11281660,T,IEX,117.180000,46
2019-10-29 19:18:21.450617088,2019-10-29 19:18:21.450600330,11283295,T,IEX,117.180000,100
2019-10-29 19:19:31.578064896,2019-10-29 19:19:31.578046784,11311614,T,IEX,117.170000,100
2019-10-29 19:19:33.516384000,2019-10-29 19:19:33.516365305,11312510,T,IEX,117.170000,100
2019-10-29 19:19:57.230934016,2019-10-29 19:19:57.230914818,11322653,T,IEX,117.205000,100
2019-10-29 19:19:57.230952960,2019-10-29 19:19:57.230935688,11322654,T,IEX,117.205000,100
2019-10-29 19:19:58.227091968,2019-10-29 19:19:58.227073957,11323007,T,IEX,117.205000,100
2019-10-29 19:19:58.227109888,2019-10-29 19:19:58.227093887,11323008,T,IEX,117.205000,100
2019-10-29 19:19:58.227123968,2019-10-29 19:19:58.227106463,11323009,T,IEX,117.205000,125
2019-10-29 19:19:58.621199104,2019-10-29 19:19:58.621182314,11323152,T,IEX,117.200000,100
2019-10-29 19:19:58.621212928,2019-10-29 19:19:58.621195787,11323153,T,IEX,117.200000,100
2019-10-29 19:19:58.622940928,2019-10-29 19:19:58.622923726,11323160,T,IEX,117.190000,100
2019-10-29 19:19:58.622953984,2019-10-29 19:19:58.622937121,11323161,T,IEX,117.190000,100
2019-10-29 19:20:28.465874944,2019-10-29 19:20:28.465857165,11340253,T,IEX,117.200000,100
2019-10-29 19:20:49.455463936,2019-10-29 19:20:49.455443796,11351050,T,IEX,117.200000,100
2019-10-29 19:22:00.11503104,2019-10-29 19:22:00.11483978,11377297,T,IEX,117.220000,100
2019-10-29 19:22:00.433892096,2019-10-29 19:22:00.433873972,11377519,T,IEX,117.225000,100
2019-10-29 19:23:11.166192128,2019-10-29 19:23:11.166174856,11404269,T,IEX,117.250000,100
2019-10-29 19:23:45.243019008,2019-10-29 19:23:45.243000696,11417327,T,IEX,117.265000,244
2019-10-29 19:23:53.611055104,2019-10-29 19:23:53.611037015,11421384,T,IEX,117.240000,100
2019-10-29 19:24:35.929807104,2019-10-29 19:24:35.929785453,11438752,T,IEX,117.190000,100
2019-10-29 19:24:35.958226944,2019-10-29 19:24:35.958207610,11438758,T,IEX,117.190000,100
2019-10-29 19:25:00.356804096,2019-10-29 19:25:00.356787771,11448544,T,IEX,117.210000,100
2019-10-29 19:25:25.287588096,2019-10-29 19:25:25.287568209,11459395,T,IEX,117.210000,100
2019-10-29 19:25:36.78925056,2019-10-29 19:25:36.78907548,11463982,T,IEX,117.220000,4
2019-10-29 19:25:36.497372928,2019-10-29 19:25:36.497357265,11464396,T,IEX,117.235000,100
2019-10-29 19:25:39.544151040,2019-10-29 19:25:39.544134183,11465553,T,IEX,117.240000,100
2019-10-29 19:25:43.782329088,2019-10-29 19:25:43.782311064,11467216,T,IEX,117.240000,100
2019-10-29 19:25:45.245437952,2019-10-29 19:25:45.245419969,11467922,T,IEX,117.240000,100
2019-10-29 19:25:50.66092032,2019-10-29 19:25:50.66069836,11470128,T,IEX,117.235000,150
2019-10-29 19:26:25.365711104,2019-10-29 19:26:25.365691918,11485484,T,IEX,117.255000,100
2019-10-29 19:26:36.795544064,2019-10-29 19:26:36.795526319,11489390,T,IEX,117.260000,100
2019-10-29 19:26:39.741420032,2019-10-29 19:26:39.741400849,11490394,T,IEX,117.260000,100
2019-10-29 19:26:59.179776000,2019-10-29 19:26:59.179756094,11498279,T,IEX,117.250000,19
2019-10-29 19:27:07.955088896,2019-10-29 19:27:07.955071506,11502687,T,IEX,117.250000,100
2019-10-29 19:28:07.874054912,2019-10-29 19:28:07.874036298,11529500,T,IEX,117.240000,100
2019-10-29 19:29:18.877934080,2019-10-29 19:29:18.877914637,11561733,T,IEX,117.245000,300
2019-10-29 19:29:28.918181120,2019-10-29 19:29:28.918161480,11565587,T,IEX,117.240000,100
2019-10-29 19:29:39.604534016,2019-10-29 19:29:39.604519391,11570318,T,IEX,117.240000,10
2019-10-29 19:29:40.553500928,2019-10-29 19:29:40.553483887,11570707,T,IEX,117.250000,1
2019-10-29 19:30:54.206008064,2019-10-29 19:30:54.205990024,11610430,T,IEX,117.275000,100
2019-10-29 19:30:54.214022912,2019-10-29 19:30:54.214005117,11610432,T,IEX,117.275000,700
2019-10-29 19:31:05.496465920,2019-10-29 19:31:05.496447318,11617012,T,IEX,117.260000,100
2019-10-29 19:31:15.567966976,2019-10-29 19:31:15.567947522,11624382,T,IEX,117.270000,100
2019-10-29 19:31:28.927769088,2019-10-29 19:31:28.927749202,11630620,T,IEX,117.265000,100
2019-10-29 19:31:36.297483008,2019-10-29 19:31:36.297462955,11634305,T,IEX,117.260000,100
2019-10-29 19:31:36.345347072,2019-10-29 19:31:36.345331229,11635501,T,IEX,117.250000,100
2019-10-29 19:32:10.385772032,2019-10-29 19:32:10.385753996,11656732,T,IEX,117.205000,100
2019-10-29 19:32:19.625562880,2019-10-29 19:32:19.625542887,11660840,T,IEX,117.210000,200
2019-10-29 19:32:24.475320064,2019-10-29 19:32:24.475300742,11663868,T,IEX,117.215000,100
2019-10-29 19:32:35.53722880,2019-10-29 19:32:35.53701675,11668928,T,IEX,117.225000,100
2019-10-29 19:32:40.279374080,2019-10-29 19:32:40.279354275,11671438,T,IEX,117.220000,1
2019-10-29 19:32:45.501739008,2019-10-29 19:32:45.501720274,11673344,T,IEX,117.210000,50
2019-10-29 19:32:49.480165888,2019-10-29 19:32:49.480145334,11676110,T,IEX,117.215000,100
2019-10-29 19:33:03.332773888,2019-10-29 19:33:03.332751379,11681580,T,IEX,117.215000,100
2019-10-29 19:33:59.197916928,2019-10-29 19:33:59.197898762,11711756,T,IEX,117.220000,100
2019-10-29 19:34:58.737630976,2019-10-29 19:34:58.737614086,11740379,T,IEX,117.210000,100
2019-10-29 19:35:28.671682048,2019-10-29 19:35:28.671665739,11757079,T,IEX,117.220000,200
2019-10-29 19:35:28.738438912,2019-10-29 19:35:28.738418882,11757091,T,IEX,117.220000,300
2019-10-29 19:35:28.798629120,2019-10-29 19:35:28.798612358,11757110,T,IEX,117.220000,200
2019-10-29 19:35:45.781306880,2019-10-29 19:35:45.781288936,11765023,T,IEX,117.215000,100
2019-10-29 19:35:50.273833984,2019-10-29 19:35:50.273816028,11768062,T,IEX,117.210000,100
2019-10-29 19:35:52.733585920,2019-10-29 19:35:52.733567188,11769243,T,IEX,117.210000,100
2019-10-29 19:36:08.21640960,2019-10-29 19:36:08.21619064,11779074,T,IEX,117.220000,100
2019-10-29 19:36:20.794107904,2019-10-29 19:36:20.794087806,11784843,T,IEX,117.210000,37
2019-10-29 19:36:20.809297920,2019-10-29 19:36:20.809281418,11784882,T,IEX,117.205000,106
2019-10-29 19:36:22.111013120,2019-10-29 19:36:22.110990834,11785626,T,IEX,117.205000,100
2019-10-29 19:36:27.930084096,2019-10-29 19:36:27.930068371,11788016,T,IEX,117.200000,100
2019-10-29 19:36:42.95369984,2019-10-29 19:36:42.95351232,11796879,T,IEX,117.200000,100
2019-10-29 19:36:52.87411968,2019-10-29 19:36:52.87391072,11802140,T,IEX,117.190000,4
2019-10-29 19:37:12.95995904,2019-10-29 19:37:12.95978735,11812998,T,IEX,117.160000,100
2019-10-29 19:37:25.438808064,2019-10-29 19:37:25.438789816,11819347,T,IEX,117.155000,107
2019-10-29 19:37:32.841652992,2019-10-29 19:37:32.841635576,11824280,T,IEX,117.160000,3
2019-10-29 19:38:21.298500096,2019-10-29 19:38:21.298484404,11849477,T,IEX,117.140000,100
2019-10-29 19:38:38.778951936,2019-10-29 19:38:38.778933265,11856993,T,IEX,117.120000,100
2019-10-29 19:39:00.210725888,2019-10-29 19:39:00.210703557,11865279,T,IEX,117.125000,100
2019-10-29 19:39:01.90544896,2019-10-29 19:39:01.90528227,11865945,T,IEX,117.120000,100
2019-10-29 19:39:01.108922112,2019-10-29 19:39:01.108903886,11865976,T,IEX,117.110000,900
2019-10-29 19:39:21.300805888,2019-10-29 19:39:21.300788615,11878128,T,IEX,117.090000,100
2019-10-29 19:40:22.668313088,2019-10-29 19:40:22.668291190,11908780,T,IEX,117.080000,100
2019-10-29 19:41:00.23981056,2019-10-29 19:41:00.23963106,11924821,T,IEX,117.095000,100
2019-10-29 19:41:00.23997952,2019-10-29 19:41:00.23980160,11924822,T,IEX,117.095000,300
2019-10-29 19:41:00.25008896,2019-10-29 19:41:00.24986913,11924823,T,IEX,117.095000,200
2019-10-29 19:41:00.25020928,2019-10-29 19:41:00.25005743,11924824,T,IEX,117.095000,200
2019-10-29 19:41:00.25039104,2019-10-29 19:41:00.25024162,11924825,T,IEX,117.095000,300
2019-10-29 19:41:12.830916096,2019-10-29 19:41:12.830895407,11930914,T,IEX,117.085000,100
2019-10-29 19:41:17.294735104,2019-10-29 19:41:17.294717937,11932585,T,IEX,117.080000,200
2019-10-29 19:41:17.294749952,2019-10-29 19:41:17.294731480,11932586,T,IEX,117.080000,100
2019-10-29 19:41:29.943958016,2019-10-29 19:41:29.943940718,11939669,T,IEX,117.090000,3
2019-10-29 19:41:52.620620032,2019-10-29 19:41:52.620602808,11954969,T,IEX,117.100000,100
2019-10-29 19:42:21.718262016,2019-10-29 19:42:21.718237063,11972192,T,IEX,117.105000,30
2019-10-29 19:42:34.558478080,2019-10-29 19:42:34.558455498,11977755,T,IEX,117.115000,100
2019-10-29 19:42:43.961848064,2019-10-29 19:42:43.961831665,11984100,T,IEX,117.150000,100
2019-10-29 19:43:01.200435968,2019-10-29 19:43:01.200404679,11993283,T,IEX,117.160000,100
2019-10-29 19:44:01.67544064,2019-10-29 19:44:01.67524713,12029172,T,IEX,117.190000,100
2019-10-29 19:44:01.181901056,2019-10-29 19:44:01.181881674,12029236,T,IEX,117.190000,100
2019-10-29 19:44:01.181912064,2019-10-29 19:44:01.181894610,12029237,T,IEX,117.190000,100
2019-10-29 19:44:01.181927936,2019-10-29 19:44:01.181909930,12029238,T,IEX,117.190000,700
2019-10-29 19:44:24.118972928,2019-10-29 19:44:24.118952977,12041846,T,IEX,117.215000,100
2019-10-29 19:45:26.726427904,2019-10-29 19:45:26.726410665,12081265,T,IEX,117.240000,3
2019-10-29 19:46:57.142008064,2019-10-29 19:46:57.141988568,12132945,T,IEX,117.260000,100
2019-10-29 19:46:57.159309056,2019-10-29 19:46:57.159289749,12132953,T,IEX,117.260000,100
2019-10-29 19:46:57.159322880,2019-10-29 19:46:57.159305822,12132954,T,IEX,117.260000,400
2019-10-29 19:46:57.159342080,2019-10-29 19:46:57.159324330,12132955,T,IEX,117.260000,100
2019-10-29 19:46:58.34586112,2019-10-29 19:46:58.34570233,12133511,T,IEX,117.260000,200
2019-10-29 19:47:01.74151936,2019-10-29 19:47:01.74134237,12135716,T,IEX,117.270000,200
2019-10-29 19:47:25.434128896,2019-10-29 19:47:25.434113250,12152981,T,IEX,117.300000,100
2019-10-29 19:48:00.343012096,2019-10-29 19:48:00.342993840,12173078,T,IEX,117.285000,100
2019-10-29 19:48:00.343023104,2019-10-29 19:48:00.343005703,12173079,T,IEX,117.285000,100
2019-10-29 19:48:00.343036928,2019-10-29 19:48:00.343020613,12173080,T,IEX,117.285000,100
2019-10-29 19:48:00.347468032,2019-10-29 19:48:00.347450952,12173083,T,IEX,117.285000,200
2019-10-29 19:48:00.351450880,2019-10-29 19:48:00.351431836,12173088,T,IEX,117.285000,100
2019-10-29 19:48:22.512177920,2019-10-29 19:48:22.512157837,12191148,T,IEX,117.260000,100
2019-10-29 19:48:45.805940992,2019-10-29 19:48:45.805923405,12204667,T,IEX,117.260000,1
2019-10-29 19:49:28.671970048,2019-10-29 19:49:28.671950881,12240206,T,IEX,117.255000,100
2019-10-29 19:49:55.668646912,2019-10-29 19:49:55.668629394,12259422,T,IEX,117.240000,100
2019-10-29 19:49:57.622426112,2019-10-29 19:49:57.622408741,12262035,T,IEX,117.250000,100
2019-10-29 19:49:57.622448128,2019-10-29 19:49:57.622431792,12262036,T,IEX,117.250000,100
2019-10-29 19:49:57.634767104,2019-10-29 19:49:57.634748605,12262077,T,IEX,117.250000,100
2019-10-29 19:50:09.296571904,2019-10-29 19:50:09.296555207,12281357,T,IEX,117.240000,100
2019-10-29 19:50:29.839961088,2019-10-29 19:50:29.839944297,12308281,T,IEX,117.190000,100
2019-10-29 19:50:32.854812928,2019-10-29 19:50:32.854793361,12315520,T,IEX,117.200000,3
2019-10-29 19:50:35.125427968,2019-10-29 19:50:35.125406286,12317233,T,IEX,117.210000,100
2019-10-29 19:50:37.541831936,2019-10-29 19:50:37.541814403,12319097,T,IEX,117.230000,100
2019-10-29 19:50:38.319725056,2019-10-29 19:50:38.319705375,12319634,T,IEX,117.250000,37
2019-10-29 19:50:39.753390080,2019-10-29 19:50:39.753371859,12320885,T,IEX,117.260000,63
2019-10-29 19:50:51.590285056,2019-10-29 19:50:51.590268868,12333493,T,IEX,117.310000,100
2019-10-29 19:50:51.592250112,2019-10-29 19:50:51.592232597,12333523,T,IEX,117.310000,100
2019-10-29 19:50:51.592413952,2019-10-29 19:50:51.592396311,12333526,T,IEX,117.310000,8
2019-10-29 19:51:31.439618048,2019-10-29 19:51:31.439600093,12369931,T,IEX,117.290000,2
2019-10-29 19:51:32.569649920,2019-10-29 19:51:32.569633391,12370937,T,IEX,117.300000,1
2019-10-29 19:51:45.332939008,2019-10-29 19:51:45.332920806,12382066,T,IEX,117.315000,122
2019-10-29 19:51:50.146164992,2019-10-29 19:51:50.146140132,12390296,T,IEX,117.280000,1
2019-10-29 19:52:26.46619904,2019-10-29 19:52:26.46600856,12424037,T,IEX,117.320000,100
2019-10-29 19:52:26.46631936,2019-10-29 19:52:26.46614024,12424038,T,IEX,117.320000,100
2019-10-29 19:52:26.46648064,2019-10-29 19:52:26.46633012,12424039,T,IEX,117.320000,100
2019-10-29 19:53:41.712393984,2019-10-29 19:53:41.712378164,12482842,T,IEX,117.370000,100
2019-10-29 19:54:02.142185984,2019-10-29 19:54:02.142167010,12506123,T,IEX,117.400000,3
2019-10-29 19:54:07.818643968,2019-10-29 19:54:07.818626041,12512439,T,IEX,117.400000,100
2019-10-29 19:54:11.575915008,2019-10-29 19:54:11.575897113,12516662,T,IEX,117.395000,100
2019-10-29 19:54:26.382193920,2019-10-29 19:54:26.382169000,12527310,T,IEX,117.400000,100
2019-10-29 19:54:42.440719104,2019-10-29 19:54:42.440699758,12539582,T,IEX,117.400000,98
2019-10-29 19:54:51.521672960,2019-10-29 19:54:51.521654228,12552385,T,IEX,117.400000,100
2019-10-29 19:55:10.696443904,2019-10-29 19:55:10.696424951,12580721,T,IEX,117.385000,100
2019-10-29 19:55:12.688881920,2019-10-29 19:55:12.688865033,12583327,T,IEX,117.380000,100
2019-10-29 19:55:22.53192960,2019-10-29 19:55:22.53174727,12592496,T,IEX,117.370000,100
2019-10-29 19:55:22.124000000,2019-10-29 19:55:22.123984843,12592565,T,IEX,117.370000,100
2019-10-29 19:55:22.185549056,2019-10-29 19:55:22.185532652,12592624,T,IEX,117.370000,100
2019-10-29 19:55:29.398042880,2019-10-29 19:55:29.398020790,12599941,T,IEX,117.420000,2
2019-10-29 19:55:46.534493952,2019-10-29 19:55:46.534474175,12618562,T,IEX,117.420000,100
2019-10-29 19:55:55.539095040,2019-10-29 19:55:55.539077147,12628052,T,IEX,117.430000,104
2019-10-29 19:56:03.186132992,2019-10-29 19:56:03.186116873,12636858,T,IEX,117.425000,300
2019-10-29 19:56:05.629669120,2019-10-29 19:56:05.629650490,12639488,T,IEX,117.410000,100
2019-10-29 19:56:11.657329920,2019-10-29 19:56:11.657314931,12647334,T,IEX,117.390000,100
2019-10-29 19:56:31.98637056,2019-10-29 19:56:31.98619613,12667680,T,IEX,117.390000,100
2019-10-29 19:56:42.536794112,2019-10-29 19:56:42.536776460,12679865,T,IEX,117.400000,2
2019-10-29 19:56:52.692317952,2019-10-29 19:56:52.692300806,12691727,T,IEX,117.440000,100
2019-10-29 19:57:11.231774976,2019-10-29 19:57:11.231753849,12715575,T,IEX,117.420000,100
2019-10-29 19:57:24.794966016,2019-10-29 19:57:24.794947964,12729153,T,IEX,117.430000,100
2019-10-29 19:57:24.795949056,2019-10-29 19:57:24.795930342,12729156,T,IEX,117.430000,19
2019-10-29 19:57:24.885755904,2019-10-29 19:57:24.885735132,12729242,T,IEX,117.425000,100
2019-10-29 19:57:31.643629056,2019-10-29 19:57:31.643610673,12735697,T,IEX,117.430000,98
2019-10-29 19:57:32.708741120,2019-10-29 19:57:32.708723822,12737062,T,IEX,117.440000,2
2019-10-29 19:57:32.708763904,2019-10-29 19:57:32.708746014,12737063,T,IEX,117.440000,2
2019-10-29 19:57:38.612090112,2019-10-29 19:57:38.612070147,12743745,T,IEX,117.470000,100
2019-10-29 19:57:45.707704064,2019-10-29 19:57:45.707687822,12751494,T,IEX,117.415000,100
2019-10-29 19:57:45.919432960,2019-10-29 19:57:45.919411606,12751723,T,IEX,117.425000,100
2019-10-29 19:57:53.806665984,2019-10-29 19:57:53.806650798,12759943,T,IEX,117.420000,100
2019-10-29 19:57:56.112267008,2019-10-29 19:57:56.112246355,12763136,T,IEX,117.415000,100
2019-10-29 19:58:03.611805952,2019-10-29 19:58:03.611788143,12773698,T,IEX,117.400000,100
2019-10-29 19:58:09.342109952,2019-10-29 19:58:09.342091654,12781153,T,IEX,117.415000,100
2019-10-29 19:58:09.561691904,2019-10-29 19:58:09.561675114,12781411,T,IEX,117.420000,3
2019-10-29 19:58:13.377184000,2019-10-29 19:58:13.377167414,12786320,T,IEX,117.405000,100
2019-10-29 19:58:16.796887040,2019-10-29 19:58:16.796867954,12790180,T,IEX,117.420000,100
2019-10-29 19:58:25.452411904,2019-10-29 19:58:25.452396227,12800598,T,IEX,117.405000,100
2019-10-29 19:58:26.17686016,2019-10-29 19:58:26.17669158,12801144,T,IEX,117.405000,100
2019-10-29 19:58:26.261289984,2019-10-29 19:58:26.261272882,12801950,T,IEX,117.395000,100
2019-10-29 19:58:31.183049984,2019-10-29 19:58:31.183034218,12808493,T,IEX,117.400000,100
2019-10-29 19:58:32.899977984,2019-10-29 19:58:32.899959190,12810616,T,IEX,117.405000,100
2019-10-29 19:58:34.422164992,2019-10-29 19:58:34.422147097,12812151,T,IEX,117.410000,3
2019-10-29 19:58:44.609568000,2019-10-29 19:58:44.609551795,12824602,T,IEX,117.400000,2
2019-10-29 19:58:47.32069120,2019-10-29 19:58:47.32051813,12827653,T,IEX,117.395000,100
2019-10-29 19:58:51.347292928,2019-10-29 19:58:51.347278323,12832921,T,IEX,117.395000,100
2019-10-29 19:58:54.386897920,2019-10-29 19:58:54.386880243,12836471,T,IEX,117.400000,100
2019-10-29 19:59:13.255243008,2019-10-29 19:59:13.255224199,12867832,T,IEX,117.400000,100
2019-10-29 19:59:15.733616896,2019-10-29 19:59:15.733600809,12871675,T,IEX,117.410000,100
2019-10-29 19:59:15.972943104,2019-10-29 19:59:15.972923866,12872115,T,IEX,117.410000,100
2019-10-29 19:59:17.238748928,2019-10-29 19:59:17.238730650,12874101,T,IEX,117.420000,6
2019-10-29 19:59:17.242028032,2019-10-29 19:59:17.242012186,12874107,T,IEX,117.420000,94
2019-10-29 19:59:18.173412096,2019-10-29 19:59:18.173396205,12875446,T,IEX,117.415000,100
2019-10-29 19:59:19.159268096,2019-10-29 19:59:19.159251313,12876998,T,IEX,117.420000,100
2019-10-29 19:59:19.589761024,2019-10-29 19:59:19.589741968,12877495,T,IEX,117.425000,100
2019-10-29 19:59:20.292004096,2019-10-29 19:59:20.291985256,12878351,T,IEX,117.430000,100
2019-10-29 19:59:22.598444032,2019-10-29 19:59:22.598427314,12881295,T,IEX,117.435000,100
2019-10-29 19:59:27.6104064,2019-10-29 19:59:27.6084226,12887916,T,IEX,117.435000,5
2019-10-29 19:59:39.979011072,2019-10-29 19:59:39.978993600,12937491,T,IEX,117.475000,100
2019-10-29 19:59:40.978554112,2019-10-29 19:59:40.978534884,12944473,T,IEX,117.480000,98
2019-10-29 19:59:49.697697024,2019-10-29 19:59:49.697679677,12985975,T,IEX,117.480000,98
2019-10-29 19:59:49.697714944,2019-10-29 19:59:49.697696845,12985976,T,IEX,117.470000,100
2019-10-29 19:59:49.697732096,2019-10-29 19:59:49.697711587,12985977,T,IEX,117.470000,98
2019-10-29 19:59:54.8268032,2019-10-29 19:59:54.8250045,13015134,T,IEX,117.440000,100
2019-10-29 19:59:59.815843072,2019-10-29 19:59:59.815827210,13062616,T,IEX,117.420000,28
