2019-10-18 13:30:05.356314880,2019-10-18 13:30:05.356290524,106858,T,IEX,236.290000,20
2019-10-18 13:32:47.528945920,2019-10-18 13:32:47.528924298,295474,T,IEX,236.880000,100
2019-10-18 13:33:18.35691008,2019-10-18 13:33:18.35669914,329790,T,IEX,237.140000,89
2019-10-18 13:33:46.983805952,2019-10-18 13:33:46.983786946,358683,T,IEX,236.930000,100
2019-10-18 13:34:21.563659008,2019-10-18 13:34:21.563639159,389768,T,IEX,237.245000,100
2019-10-18 13:34:28.579058944,2019-10-18 13:34:28.579039135,394894,T,IEX,237.245000,100
2019-10-18 13:34:29.36788992,2019-10-18 13:34:29.36770819,395129,T,IEX,237.200000,100
2019-10-18 13:34:49.617082880,2019-10-18 13:34:49.617063675,415825,T,IEX,237.040000,100
2019-10-18 13:34:53.88839936,2019-10-18 13:34:53.88820974,419049,T,IEX,237.040000,100
2019-10-18 13:35:04.21125120,2019-10-18 13:35:04.21106353,433697,T,IEX,236.975000,100
2019-10-18 13:35:04.302384128,2019-10-18 13:35:04.302366595,433990,T,IEX,236.960000,100
2019-10-18 13:35:08.143894016,2019-10-18 13:35:08.143876047,438524,T,IEX,236.940000,100
2019-10-18 13:35:12.166203904,2019-10-18 13:35:12.166185348,443681,T,IEX,236.850000,100
2019-10-18 13:35:12.166938112,2019-10-18 13:35:12.166920557,443683,T,IEX,236.850000,100
2019-10-18 13:35:22.443788032,2019-10-18 13:35:22.443769427,455193,T,IEX,236.920000,100
2019-10-18 13:35:23.107440128,2019-10-18 13:35:23.107422484,455762,T,IEX,236.890000,100
2019-10-18 13:35:23.495266048,2019-10-18 13:35:23.495250750,456149,T,IEX,236.890000,100
2019-10-18 13:35:27.472487936,2019-10-18 13:35:27.472472773,460429,T,IEX,236.820000,100
2019-10-18 13:35:28.144463872,2019-10-18 13:35:28.144445669,461166,T,IEX,236.795000,200
2019-10-18 13:35:28.231848960,2019-10-18 13:35:28.231831282,461908,T,IEX,236.800000,100
2019-10-18 13:35:28.289818112,2019-10-18 13:35:28.289798680,462094,T,IEX,236.870000,29
2019-10-18 13:35:30.362092032,2019-10-18 13:35:30.362073607,465937,T,IEX,236.935000,8
2019-10-18 13:35:30.383851008,2019-10-18 13:35:30.383830691,465998,T,IEX,236.935000,100
2019-10-18 13:35:36.986639872,2019-10-18 13:35:36.986621360,474005,T,IEX,236.810000,100
2019-10-18 13:36:00.70853888,2019-10-18 13:36:00.70835917,495792,T,IEX,236.945000,100
2019-10-18 13:36:04.925757952,2019-10-18 13:36:04.925739606,502363,T,IEX,236.845000,100
2019-10-18 13:36:07.568766976,2019-10-18 13:36:07.568747022,505598,T,IEX,236.670000,100
2019-10-18 13:36:37.344965120,2019-10-18 13:36:37.344944724,546743,T,IEX,236.580000,100
2019-10-18 13:36:38.467162880,2019-10-18 13:36:38.467145204,547415,T,IEX,236.580000,100
2019-10-18 13:36:44.24338944,2019-10-18 13:36:44.24319898,551885,T,IEX,236.695000,100
2019-10-18 13:36:53.164784128,2019-10-18 13:36:53.164765932,561441,T,IEX,236.770000,100
2019-10-18 13:36:53.164859904,2019-10-18 13:36:53.164844384,561442,T,IEX,236.770000,100
2019-10-18 13:36:55.27172096,2019-10-18 13:36:55.27154000,563376,T,IEX,236.750000,100
2019-10-18 13:38:48.982782976,2019-10-18 13:38:48.982763124,660458,T,IEX,236.810000,100
2019-10-18 13:38:49.95346944,2019-10-18 13:38:49.95330740,660557,T,IEX,236.810000,400
2019-10-18 13:38:49.115857920,2019-10-18 13:38:49.115841326,660569,T,IEX,236.810000,100
2019-10-18 13:38:49.123109888,2019-10-18 13:38:49.123091598,660589,T,IEX,236.810000,100
2019-10-18 13:38:49.190827008,2019-10-18 13:38:49.190807169,660637,T,IEX,236.810000,200
2019-10-18 13:39:02.316008960,2019-10-18 13:39:02.315991166,671731,T,IEX,236.785000,100
2019-10-18 13:39:08.183105024,2019-10-18 13:39:08.183084655,677985,T,IEX,236.795000,100
2019-10-18 13:39:49.530949888,2019-10-18 13:39:49.530933325,712580,T,IEX,236.775000,100
2019-10-18 13:40:45.23919104,2019-10-18 13:40:45.23898187,764148,T,IEX,236.645000,1
2019-10-18 13:40:46.953504000,2019-10-18 13:40:46.953486612,765819,T,IEX,236.645000,20
2019-10-18 13:42:05.395565056,2019-10-18 13:42:05.395548678,833112,T,IEX,236.650000,1
2019-10-18 13:42:05.643715072,2019-10-18 13:42:05.643694175,833554,T,IEX,236.625000,100
2019-10-18 13:42:06.61486080,2019-10-18 13:42:06.61470524,833814,T,IEX,236.620000,100
2019-10-18 13:42:32.814872064,2019-10-18 13:42:32.814853011,853872,T,IEX,236.610000,100
2019-10-18 13:42:32.815895040,2019-10-18 13:42:32.815878851,853874,T,IEX,236.610000,1
2019-10-18 13:42:41.892398080,2019-10-18 13:42:41.892381452,859632,T,IEX,236.640000,1
2019-10-18 13:42:51.518782976,2019-10-18 13:42:51.518762109,866599,T,IEX,236.675000,1
2019-10-18 13:45:03.635289088,2019-10-18 13:45:03.635248846,966183,T,IEX,236.935000,1
2019-10-18 13:46:12.219985920,2019-10-18 13:46:12.219966812,1023867,T,IEX,237.150000,100
2019-10-18 13:46:39.815749120,2019-10-18 13:46:39.815729541,1048166,T,IEX,237.210000,300
2019-10-18 13:46:51.366320896,2019-10-18 13:46:51.366300762,1058414,T,IEX,237.220000,100
2019-10-18 13:47:31.546595072,2019-10-18 13:47:31.546577367,1096903,T,IEX,237.190000,1
2019-10-18 13:48:54.855057920,2019-10-18 13:48:54.855041013,1178160,T,IEX,237.510000,1
2019-10-18 13:48:55.919734016,2019-10-18 13:48:55.919715357,1178885,T,IEX,237.545000,100
2019-10-18 13:48:55.926610944,2019-10-18 13:48:55.926593630,1178895,T,IEX,237.545000,200
2019-10-18 13:49:17.787849984,2019-10-18 13:49:17.787829107,1198037,T,IEX,237.380000,1
2019-10-18 13:50:23.404653056,2019-10-18 13:50:23.404632428,1257220,T,IEX,236.960000,3
2019-10-18 13:51:37.340492032,2019-10-18 13:51:37.340477342,1316815,T,IEX,237.195000,100
2019-10-18 13:52:34.393895936,2019-10-18 13:52:34.393875661,1364705,T,IEX,237.205000,100
2019-10-18 13:52:34.424791040,2019-10-18 13:52:34.424771182,1364719,T,IEX,237.205000,100
2019-10-18 13:52:50.830277120,2019-10-18 13:52:50.830259413,1379967,T,IEX,237.160000,100
2019-10-18 13:52:50.831470080,2019-10-18 13:52:50.831451649,1379981,T,IEX,237.160000,100
2019-10-18 13:53:36.756504064,2019-10-18 13:53:36.756484205,1418106,T,IEX,237.145000,100
2019-10-18 13:53:37.243811072,2019-10-18 13:53:37.243791680,1418535,T,IEX,237.105000,100
2019-10-18 13:53:46.621820928,2019-10-18 13:53:46.621801302,1425721,T,IEX,237.070000,100
2019-10-18 13:53:51.649530880,2019-10-18 13:53:51.649511854,1428580,T,IEX,237.065000,100
2019-10-18 13:55:44.321197056,2019-10-18 13:55:44.321178614,1524580,T,IEX,237.210000,2
2019-10-18 13:56:53.6027008,2019-10-18 13:56:53.6003412,1578961,T,IEX,237.320000,199
2019-10-18 13:59:10.921236992,2019-10-18 13:59:10.921220474,1699168,T,IEX,237.305000,100
2019-10-18 13:59:18.682608128,2019-10-18 13:59:18.682587291,1705851,T,IEX,237.350000,100
2019-10-18 13:59:19.261217024,2019-10-18 13:59:19.261201448,1706427,T,IEX,237.365000,2
2019-10-18 13:59:22.711808000,2019-10-18 13:59:22.711787544,1709435,T,IEX,237.410000,100
2019-10-18 13:59:27.206162944,2019-10-18 13:59:27.206142493,1712511,T,IEX,237.425000,100
2019-10-18 13:59:27.215559936,2019-10-18 13:59:27.215543380,1712527,T,IEX,237.410000,200
2019-10-18 13:59:27.216658944,2019-10-18 13:59:27.216640765,1712530,T,IEX,237.410000,100
2019-10-18 13:59:40.958472960,2019-10-18 13:59:40.958456938,1726157,T,IEX,237.455000,100
2019-10-18 13:59:55.362731008,2019-10-18 13:59:55.362712342,1738008,T,IEX,237.480000,1
2019-10-18 14:00:04.269564928,2019-10-18 14:00:04.269543617,1745834,T,IEX,237.455000,4
2019-10-18 14:00:04.269579008,2019-10-18 14:00:04.269563188,1745835,T,IEX,237.455000,19
2019-10-18 14:03:05.492555008,2019-10-18 14:03:05.492537250,1910940,T,IEX,237.190000,1
2019-10-18 14:05:00.631326976,2019-10-18 14:05:00.631308285,2038549,T,IEX,236.955000,100
2019-10-18 14:05:01.819378944,2019-10-18 14:05:01.819363208,2039579,T,IEX,236.910000,600
2019-10-18 14:05:48.986967040,2019-10-18 14:05:48.986946914,2082023,T,IEX,236.800000,100
2019-10-18 14:05:48.987983872,2019-10-18 14:05:48.987967613,2082026,T,IEX,236.800000,100
2019-10-18 14:05:48.997608960,2019-10-18 14:05:48.997591956,2082035,T,IEX,236.800000,100
2019-10-18 14:08:38.294915072,2019-10-18 14:08:38.294895279,2222005,T,IEX,236.860000,10
2019-10-18 14:08:39.121922048,2019-10-18 14:08:39.121904789,2222508,T,IEX,236.860000,70
2019-10-18 14:09:35.223492096,2019-10-18 14:09:35.223476491,2266402,T,IEX,236.930000,100
2019-10-18 14:10:11.749465088,2019-10-18 14:10:11.749447506,2299791,T,IEX,236.965000,100
2019-10-18 14:10:11.750951936,2019-10-18 14:10:11.750933260,2299794,T,IEX,236.965000,100
2019-10-18 14:13:20.176523008,2019-10-18 14:13:20.176504639,2458792,T,IEX,236.830000,4
2019-10-18 14:15:03.715942912,2019-10-18 14:15:03.715923100,2546048,T,IEX,236.850000,10
2019-10-18 14:17:51.785020928,2019-10-18 14:17:51.784999988,2701917,T,IEX,236.890000,100
2019-10-18 14:17:58.862390016,2019-10-18 14:17:58.862375439,2708813,T,IEX,236.880000,100
2019-10-18 14:17:58.869977088,2019-10-18 14:17:58.869959716,2708826,T,IEX,236.880000,100
2019-10-18 14:18:42.461938944,2019-10-18 14:18:42.461923749,2739695,T,IEX,236.960000,200
2019-10-18 14:18:45.847371008,2019-10-18 14:18:45.847350914,2742736,T,IEX,236.980000,684
2019-10-18 14:18:45.847474944,2019-10-18 14:18:45.847458449,2742738,T,IEX,236.980000,16
2019-10-18 14:18:45.847930880,2019-10-18 14:18:45.847913878,2742739,T,IEX,236.980000,37
2019-10-18 14:19:49.679268096,2019-10-18 14:19:49.679248603,2795048,T,IEX,236.905000,1
2019-10-18 14:20:00.919155968,2019-10-18 14:20:00.919140957,2802768,T,IEX,236.920000,100
2019-10-18 14:20:18.288923904,2019-10-18 14:20:18.288904053,2816590,T,IEX,236.940000,100
2019-10-18 14:21:22.848718080,2019-10-18 14:21:22.848696799,2878994,T,IEX,236.930000,15
2019-10-18 14:21:22.852174080,2019-10-18 14:21:22.852156399,2879022,T,IEX,236.930000,85
2019-10-18 14:23:16.674490880,2019-10-18 14:23:16.674469927,2959604,T,IEX,236.915000,10
2019-10-18 14:23:40.237977088,2019-10-18 14:23:40.237957678,2975471,T,IEX,236.960000,11
2019-10-18 14:23:42.524211968,2019-10-18 14:23:42.524196960,2977990,T,IEX,237.005000,22
2019-10-18 14:24:05.165097984,2019-10-18 14:24:05.165078304,2992328,T,IEX,237.000000,50
2019-10-18 14:24:07.874288128,2019-10-18 14:24:07.874271016,2995170,T,IEX,236.970000,25
2019-10-18 14:24:11.399623936,2019-10-18 14:24:11.399608715,2998204,T,IEX,236.940000,100
2019-10-18 14:24:41.328754944,2019-10-18 14:24:41.328738092,3019489,T,IEX,237.020000,9
2019-10-18 14:24:55.466456064,2019-10-18 14:24:55.466435471,3027730,T,IEX,237.005000,100
2019-10-18 14:24:56.12889088,2019-10-18 14:24:56.12872240,3027913,T,IEX,237.005000,300
2019-10-18 14:25:01.13048064,2019-10-18 14:25:01.13030116,3030024,T,IEX,237.020000,100
2019-10-18 14:25:01.18790912,2019-10-18 14:25:01.18772182,3030027,T,IEX,237.020000,500
2019-10-18 14:25:39.579642112,2019-10-18 14:25:39.579622436,3059975,T,IEX,236.970000,100
2019-10-18 14:25:50.563077888,2019-10-18 14:25:50.563059109,3069067,T,IEX,236.955000,100
2019-10-18 14:26:28.19443968,2019-10-18 14:26:28.19422536,3095272,T,IEX,236.960000,75
2019-10-18 14:28:01.104306944,2019-10-18 14:28:01.104288631,3163674,T,IEX,236.810000,70
2019-10-18 14:28:23.873712896,2019-10-18 14:28:23.873690383,3183108,T,IEX,236.920000,1
2019-10-18 14:28:54.552176896,2019-10-18 14:28:54.552158230,3202789,T,IEX,236.960000,29
2019-10-18 14:28:54.556436992,2019-10-18 14:28:54.556416218,3202791,T,IEX,236.965000,53
2019-10-18 14:29:50.27131904,2019-10-18 14:29:50.27114526,3238677,T,IEX,237.100000,100
2019-10-18 14:29:53.716037120,2019-10-18 14:29:53.716017955,3244565,T,IEX,237.130000,100
2019-10-18 14:30:56.278763008,2019-10-18 14:30:56.278743046,3310313,T,IEX,237.220000,100
2019-10-18 14:31:30.569832960,2019-10-18 14:31:30.569815091,3339969,T,IEX,237.180000,100
2019-10-18 14:31:30.572891904,2019-10-18 14:31:30.572876502,3339977,T,IEX,237.180000,100
2019-10-18 14:32:23.280416000,2019-10-18 14:32:23.280399329,3382144,T,IEX,237.260000,100
2019-10-18 14:32:23.871870976,2019-10-18 14:32:23.871850404,3382609,T,IEX,237.270000,300
2019-10-18 14:32:23.871887104,2019-10-18 14:32:23.871870355,3382610,T,IEX,237.270000,100
2019-10-18 14:32:23.880926976,2019-10-18 14:32:23.880907539,3382615,T,IEX,237.270000,200
2019-10-18 14:32:23.889241088,2019-10-18 14:32:23.889225624,3382636,T,IEX,237.270000,100
2019-10-18 14:32:40.987467008,2019-10-18 14:32:40.987450035,3395740,T,IEX,237.240000,500
2019-10-18 14:32:40.994170880,2019-10-18 14:32:40.994148812,3395745,T,IEX,237.240000,300
2019-10-18 14:32:41.267181056,2019-10-18 14:32:41.267163297,3395943,T,IEX,237.240000,500
2019-10-18 14:32:41.754162944,2019-10-18 14:32:41.754142456,3396197,T,IEX,237.240000,300
2019-10-18 14:33:24.17870080,2019-10-18 14:33:24.17847503,3439892,T,IEX,237.250000,100
2019-10-18 14:33:24.568800000,2019-10-18 14:33:24.568781131,3440523,T,IEX,237.285000,100
2019-10-18 14:33:29.535281920,2019-10-18 14:33:29.535264457,3446057,T,IEX,237.275000,100
2019-10-18 14:33:38.400513024,2019-10-18 14:33:38.400494023,3454113,T,IEX,237.260000,25
2019-10-18 14:34:48.984246016,2019-10-18 14:34:48.984224711,3506167,T,IEX,237.330000,49
2019-10-18 14:35:00.409630976,2019-10-18 14:35:00.409608774,3519822,T,IEX,237.260000,100
2019-10-18 14:35:24.859574016,2019-10-18 14:35:24.859553556,3540261,T,IEX,237.355000,100
2019-10-18 14:36:03.533373952,2019-10-18 14:36:03.533350768,3570002,T,IEX,237.445000,200
2019-10-18 14:36:05.168102912,2019-10-18 14:36:05.168085809,3571538,T,IEX,237.460000,150
2019-10-18 14:36:15.334860032,2019-10-18 14:36:15.334841961,3578361,T,IEX,237.515000,3
2019-10-18 14:36:48.355750912,2019-10-18 14:36:48.355730690,3606953,T,IEX,237.520000,250
2019-10-18 14:38:11.541289984,2019-10-18 14:38:11.541274382,3683143,T,IEX,237.685000,100
2019-10-18 14:38:17.633186048,2019-10-18 14:38:17.633166941,3687719,T,IEX,237.710000,100
2019-10-18 14:38:17.634844928,2019-10-18 14:38:17.634828329,3687721,T,IEX,237.710000,100
2019-10-18 14:38:35.635559936,2019-10-18 14:38:35.635453408,3701246,T,IEX,237.770000,100
2019-10-18 14:38:35.637107968,2019-10-18 14:38:35.637090044,3701249,T,IEX,237.770000,100
2019-10-18 14:40:01.646081024,2019-10-18 14:40:01.646061400,3758812,T,IEX,237.690000,10
2019-10-18 14:41:09.51968000,2019-10-18 14:41:09.51949922,3818999,T,IEX,237.580000,100
2019-10-18 14:42:12.9984,2019-10-18 14:42:11.999991318,3857776,T,IEX,237.650000,100
2019-10-18 14:42:37.402816000,2019-10-18 14:42:37.402798460,3877729,T,IEX,237.655000,100
2019-10-18 14:43:27.481440000,2019-10-18 14:43:27.481422352,3932500,T,IEX,237.465000,100
2019-10-18 14:44:06.405946112,2019-10-18 14:44:06.405929090,3972734,T,IEX,237.460000,100
2019-10-18 14:44:08.443891968,2019-10-18 14:44:08.443874775,3975877,T,IEX,237.480000,100
2019-10-18 14:44:42.752880128,2019-10-18 14:44:42.752861867,4004437,T,IEX,237.600000,100
2019-10-18 14:46:56.148322048,2019-10-18 14:46:56.148300247,4111454,T,IEX,237.585000,100
2019-10-18 14:47:07.391820032,2019-10-18 14:47:07.391802937,4120017,T,IEX,237.530000,35
2019-10-18 14:48:07.500478976,2019-10-18 14:48:07.500458757,4166068,T,IEX,237.430000,100
2019-10-18 14:50:08.870263040,2019-10-18 14:50:08.870247992,4246622,T,IEX,237.590000,100
2019-10-18 14:50:15.328539904,2019-10-18 14:50:15.328525716,4252631,T,IEX,237.635000,200
2019-10-18 14:50:21.551419904,2019-10-18 14:50:21.551399219,4258573,T,IEX,237.630000,100
2019-10-18 14:50:27.497318912,2019-10-18 14:50:27.497302893,4263893,T,IEX,237.640000,200
2019-10-18 14:50:29.59162880,2019-10-18 14:50:29.59145209,4264891,T,IEX,237.640000,100
2019-10-18 14:50:43.944061952,2019-10-18 14:50:43.944039264,4274882,T,IEX,237.605000,100
2019-10-18 14:50:45.241843968,2019-10-18 14:50:45.241824876,4275812,T,IEX,237.580000,100
2019-10-18 14:50:45.243353088,2019-10-18 14:50:45.243332948,4275863,T,IEX,237.580000,100
2019-10-18 14:52:07.46107904,2019-10-18 14:52:07.46090565,4343656,T,IEX,237.530000,100
2019-10-18 14:52:19.816112896,2019-10-18 14:52:19.816090895,4352413,T,IEX,237.530000,20
2019-10-18 14:52:34.30264064,2019-10-18 14:52:34.30243323,4363842,T,IEX,237.560000,10
2019-10-18 14:52:38.156092928,2019-10-18 14:52:38.156074538,4366062,T,IEX,237.610000,100
2019-10-18 14:53:45.44408064,2019-10-18 14:53:45.44386839,4404004,T,IEX,237.540000,100
2019-10-18 14:53:52.961033984,2019-10-18 14:53:52.961016787,4409456,T,IEX,237.540000,25
2019-10-18 14:53:53.343552000,2019-10-18 14:53:53.343535935,4411115,T,IEX,237.580000,100
2019-10-18 14:54:16.530448896,2019-10-18 14:54:16.530432246,4426007,T,IEX,237.510000,100
2019-10-18 14:55:23.944566016,2019-10-18 14:55:23.944547575,4469139,T,IEX,237.535000,100
2019-10-18 14:56:55.440995072,2019-10-18 14:56:55.440977145,4517090,T,IEX,237.460000,8
2019-10-18 14:57:02.12503040,2019-10-18 14:57:02.12483712,4521272,T,IEX,237.440000,20
2019-10-18 14:57:02.65957888,2019-10-18 14:57:02.65942828,4521682,T,IEX,237.420000,50
2019-10-18 14:57:56.416026880,2019-10-18 14:57:56.416009401,4552231,T,IEX,237.580000,28
2019-10-18 14:57:56.418344960,2019-10-18 14:57:56.418327513,4552268,T,IEX,237.580000,33
2019-10-18 14:57:56.418447872,2019-10-18 14:57:56.418430665,4552271,T,IEX,237.580000,36
2019-10-18 14:57:56.418679040,2019-10-18 14:57:56.418660165,4552274,T,IEX,237.580000,62
2019-10-18 14:57:57.84884992,2019-10-18 14:57:57.84867520,4552655,T,IEX,237.580000,100
2019-10-18 14:58:35.975419904,2019-10-18 14:58:35.975398234,4575360,T,IEX,237.720000,100
2019-10-18 14:58:46.76144128,2019-10-18 14:58:46.76127946,4579729,T,IEX,237.675000,100
2019-10-18 14:58:52.600915968,2019-10-18 14:58:52.600898933,4583855,T,IEX,237.675000,100
2019-10-18 14:58:52.603273984,2019-10-18 14:58:52.603256326,4583857,T,IEX,237.675000,100
2019-10-18 14:59:31.398176000,2019-10-18 14:59:31.398155482,4604136,T,IEX,237.670000,200
2019-10-18 15:00:23.565402112,2019-10-18 15:00:23.565382714,4643433,T,IEX,237.525000,1
2019-10-18 15:01:42.930347008,2019-10-18 15:01:42.930328986,4697023,T,IEX,237.510000,2
2019-10-18 15:01:49.872829952,2019-10-18 15:01:49.872805495,4705093,T,IEX,237.580000,15
2019-10-18 15:02:12.87802880,2019-10-18 15:02:12.87785605,4721551,T,IEX,237.600000,85
2019-10-18 15:02:17.434771968,2019-10-18 15:02:17.434752172,4726168,T,IEX,237.625000,100
2019-10-18 15:06:52.40814080,2019-10-18 15:06:52.40795862,4900116,T,IEX,237.510000,100
2019-10-18 15:06:52.40857088,2019-10-18 15:06:52.40839930,4900117,T,IEX,237.510000,100
2019-10-18 15:07:53.6651904,2019-10-18 15:07:53.6631169,4938378,T,IEX,237.585000,200
2019-10-18 15:08:41.922810112,2019-10-18 15:08:41.922792432,4969484,T,IEX,237.490000,100
2019-10-18 15:10:02.972091904,2019-10-18 15:10:02.972076200,5018750,T,IEX,237.510000,300
2019-10-18 15:10:02.975863040,2019-10-18 15:10:02.975844638,5018761,T,IEX,237.510000,200
2019-10-18 15:10:36.169596928,2019-10-18 15:10:36.169578597,5042338,T,IEX,237.580000,100
2019-10-18 15:10:39.354321920,2019-10-18 15:10:39.354302224,5043605,T,IEX,237.580000,100
2019-10-18 15:10:45.895332096,2019-10-18 15:10:45.895313421,5048067,T,IEX,237.580000,100
2019-10-18 15:11:29.7264000,2019-10-18 15:11:29.7242777,5076273,T,IEX,237.590000,100
2019-10-18 15:11:32.222512128,2019-10-18 15:11:32.222493746,5078282,T,IEX,237.605000,26
2019-10-18 15:11:55.475845120,2019-10-18 15:11:55.475826226,5089662,T,IEX,237.590000,100
2019-10-18 15:12:14.379844096,2019-10-18 15:12:14.379826024,5102405,T,IEX,237.615000,100
2019-10-18 15:12:15.544514048,2019-10-18 15:12:15.544496595,5103096,T,IEX,237.615000,100
2019-10-18 15:15:06.892105984,2019-10-18 15:15:06.892087709,5216594,T,IEX,237.635000,100
2019-10-18 15:15:41.562646016,2019-10-18 15:15:41.562625541,5238235,T,IEX,237.660000,100
2019-10-18 15:18:15.145548032,2019-10-18 15:18:15.145528668,5315800,T,IEX,237.650000,12
2019-10-18 15:20:59.743130880,2019-10-18 15:20:59.743110972,5408192,T,IEX,237.730000,100
2019-10-18 15:22:22.616226048,2019-10-18 15:22:22.616209042,5449496,T,IEX,237.740000,3
2019-10-18 15:22:22.616296960,2019-10-18 15:22:22.616280649,5449498,T,IEX,237.740000,97
2019-10-18 15:23:08.380446976,2019-10-18 15:23:08.380429922,5469281,T,IEX,237.790000,2
2019-10-18 15:26:29.792448000,2019-10-18 15:26:29.792430695,5575301,T,IEX,237.780000,3
2019-10-18 15:27:43.408090112,2019-10-18 15:27:43.408071863,5612412,T,IEX,237.790000,100
2019-10-18 15:29:27.359968000,2019-10-18 15:29:27.359948752,5672411,T,IEX,237.805000,1
2019-10-18 15:30:01.238304000,2019-10-18 15:30:01.238285111,5691760,T,IEX,237.855000,100
2019-10-18 15:30:08.564973056,2019-10-18 15:30:08.564954563,5699969,T,IEX,237.880000,35
2019-10-18 15:30:16.265556992,2019-10-18 15:30:16.265541503,5707524,T,IEX,237.865000,100
2019-10-18 15:30:18.468307968,2019-10-18 15:30:18.468291519,5710026,T,IEX,237.880000,65
2019-10-18 15:30:44.457438976,2019-10-18 15:30:44.457419350,5726771,T,IEX,237.900000,100
2019-10-18 15:31:47.140690944,2019-10-18 15:31:47.140669370,5763997,T,IEX,237.785000,100
2019-10-18 15:31:47.151411968,2019-10-18 15:31:47.151393192,5764001,T,IEX,237.765000,100
2019-10-18 15:32:13.191177984,2019-10-18 15:32:13.191162940,5777859,T,IEX,237.820000,38
2019-10-18 15:33:47.680705024,2019-10-18 15:33:47.680686000,5848980,T,IEX,237.740000,100
2019-10-18 15:34:29.596986112,2019-10-18 15:34:29.596967977,5880744,T,IEX,237.775000,10
2019-10-18 15:35:41.102337024,2019-10-18 15:35:41.102318349,5930521,T,IEX,237.805000,100
2019-10-18 15:42:17.245100032,2019-10-18 15:42:17.245080859,6154866,T,IEX,237.925000,100
2019-10-18 15:42:18.846024960,2019-10-18 15:42:18.846006054,6155210,T,IEX,237.935000,12
2019-10-18 15:43:06.355710976,2019-10-18 15:43:06.355690579,6187569,T,IEX,237.800000,100
2019-10-18 15:43:06.355719936,2019-10-18 15:43:06.355699413,6187570,T,IEX,237.800000,100
2019-10-18 15:43:26.751449088,2019-10-18 15:43:26.751431703,6212849,T,IEX,237.815000,100
2019-10-18 15:44:31.107900928,2019-10-18 15:44:31.107880357,6251173,T,IEX,237.835000,100
2019-10-18 15:45:28.638723072,2019-10-18 15:45:28.638698546,6284617,T,IEX,237.810000,100
2019-10-18 15:45:34.527769088,2019-10-18 15:45:34.527748695,6288730,T,IEX,237.815000,100
2019-10-18 15:46:05.326981888,2019-10-18 15:46:05.326961687,6305926,T,IEX,237.760000,43
2019-10-18 15:46:28.298904064,2019-10-18 15:46:28.298885512,6320260,T,IEX,237.735000,100
2019-10-18 15:47:27.277084928,2019-10-18 15:47:27.277067519,6348269,T,IEX,237.745000,100
2019-10-18 15:48:22.266222080,2019-10-18 15:48:22.266205832,6374687,T,IEX,237.700000,100
2019-10-18 15:49:09.279678976,2019-10-18 15:49:09.279658050,6398753,T,IEX,237.730000,200
2019-10-18 15:49:11.543848960,2019-10-18 15:49:11.543827020,6399619,T,IEX,237.730000,100
2019-10-18 15:49:24.102519040,2019-10-18 15:49:24.102501223,6405634,T,IEX,237.735000,100
2019-10-18 15:50:09.295748096,2019-10-18 15:50:09.295728584,6428057,T,IEX,237.710000,300
2019-10-18 15:50:31.780480000,2019-10-18 15:50:31.780462766,6442031,T,IEX,237.660000,3
2019-10-18 15:51:10.319866112,2019-10-18 15:51:10.319847582,6473085,T,IEX,237.650000,100
2019-10-18 15:51:10.319874048,2019-10-18 15:51:10.319857171,6473086,T,IEX,237.650000,100
2019-10-18 15:51:10.319892992,2019-10-18 15:51:10.319876594,6473087,T,IEX,237.650000,400
2019-10-18 15:51:20.948960000,2019-10-18 15:51:20.948938910,6479111,T,IEX,237.680000,100
2019-10-18 15:51:57.45622016,2019-10-18 15:51:57.45601040,6497916,T,IEX,237.635000,100
2019-10-18 15:52:11.72337920,2019-10-18 15:52:11.72319801,6507632,T,IEX,237.615000,100
2019-10-18 15:52:11.73342976,2019-10-18 15:52:11.73322726,6507633,T,IEX,237.615000,100
2019-10-18 15:52:11.74492928,2019-10-18 15:52:11.74474366,6507634,T,IEX,237.615000,100
2019-10-18 15:52:48.632536064,2019-10-18 15:52:48.632514604,6531290,T,IEX,237.610000,4
2019-10-18 15:53:08.697426944,2019-10-18 15:53:08.697409230,6542920,T,IEX,237.505000,100
2019-10-18 15:53:39.693406976,2019-10-18 15:53:39.693384443,6563076,T,IEX,237.470000,100
2019-10-18 15:53:39.693413120,2019-10-18 15:53:39.693393075,6563077,T,IEX,237.470000,100
2019-10-18 15:53:57.410407936,2019-10-18 15:53:57.410389328,6577422,T,IEX,237.475000,100
2019-10-18 15:55:24.71529984,2019-10-18 15:55:24.71512346,6633279,T,IEX,237.530000,96
2019-10-18 15:57:32.291883008,2019-10-18 15:57:32.291865550,6711627,T,IEX,237.550000,300
2019-10-18 15:57:32.293636096,2019-10-18 15:57:32.293617749,6711692,T,IEX,237.550000,50
2019-10-18 15:58:05.474502912,2019-10-18 15:58:05.474484537,6734295,T,IEX,237.535000,100
2019-10-18 15:58:05.482014976,2019-10-18 15:58:05.481998315,6734336,T,IEX,237.520000,200
2019-10-18 15:58:05.483515904,2019-10-18 15:58:05.483497067,6734350,T,IEX,237.520000,100
2019-10-18 15:58:34.44260096,2019-10-18 15:58:34.44244988,6754776,T,IEX,237.540000,100
2019-10-18 15:58:53.92604928,2019-10-18 15:58:53.92589266,6766402,T,IEX,237.505000,100
2019-10-18 15:59:00.601521920,2019-10-18 15:59:00.601505647,6770310,T,IEX,237.505000,100
2019-10-18 15:59:24.513626112,2019-10-18 15:59:24.513604493,6789299,T,IEX,237.470000,2
2019-10-18 15:59:57.675628032,2019-10-18 15:59:57.675611934,6802988,T,IEX,237.440000,100
2019-10-18 16:00:00.951876096,2019-10-18 16:00:00.951852356,6806189,T,IEX,237.380000,100
2019-10-18 16:00:00.952873984,2019-10-18 16:00:00.952854168,6806221,T,IEX,237.380000,100
2019-10-18 16:03:12.967324928,2019-10-18 16:03:12.967302640,6950511,T,IEX,237.440000,3
2019-10-18 16:04:27.816496896,2019-10-18 16:04:27.816476815,6983685,T,IEX,237.450000,2
2019-10-18 16:05:08.637458944,2019-10-18 16:05:08.637435772,7001572,T,IEX,237.430000,100
2019-10-18 16:09:03.53096960,2019-10-18 16:09:03.53079977,7122856,T,IEX,237.480000,100
2019-10-18 16:14:37.652781056,2019-10-18 16:14:37.652762589,7267007,T,IEX,237.460000,48
2019-10-18 16:15:14.318891008,2019-10-18 16:15:14.318873807,7287299,T,IEX,237.395000,50
2019-10-18 16:18:18.356636928,2019-10-18 16:18:18.356617263,7419990,T,IEX,237.300000,100
2019-10-18 16:18:46.301626112,2019-10-18 16:18:46.301605209,7435926,T,IEX,237.330000,100
2019-10-18 16:19:17.304389120,2019-10-18 16:19:17.304369390,7453433,T,IEX,237.320000,100
2019-10-18 16:19:43.166170112,2019-10-18 16:19:43.166151624,7476731,T,IEX,237.265000,100
2019-10-18 16:19:55.972930048,2019-10-18 16:19:55.972910566,7482246,T,IEX,237.285000,100
2019-10-18 16:19:55.972946944,2019-10-18 16:19:55.972930538,7482247,T,IEX,237.285000,200
2019-10-18 16:20:53.17318912,2019-10-18 16:20:53.17298510,7588625,T,IEX,237.120000,100
2019-10-18 16:20:53.18273024,2019-10-18 16:20:53.18253557,7588626,T,IEX,237.120000,100
2019-10-18 16:21:23.243560960,2019-10-18 16:21:23.243543275,7624348,T,IEX,237.180000,3
2019-10-18 16:22:01.244877056,2019-10-18 16:22:01.244859125,7658922,T,IEX,237.210000,100
2019-10-18 16:22:57.216612096,2019-10-18 16:22:57.216590036,7696157,T,IEX,237.270000,100
2019-10-18 16:25:01.282265088,2019-10-18 16:25:01.282244847,7773825,T,IEX,237.100000,4
2019-10-18 16:27:57.666063872,2019-10-18 16:27:57.666045497,7884185,T,IEX,237.205000,100
2019-10-18 16:29:05.185721088,2019-10-18 16:29:05.185696378,7926691,T,IEX,237.150000,100
2019-10-18 16:29:06.947904000,2019-10-18 16:29:06.947881798,7928508,T,IEX,237.150000,100
2019-10-18 16:29:06.971485952,2019-10-18 16:29:06.971469785,7929050,T,IEX,237.165000,100
2019-10-18 16:29:50.932574976,2019-10-18 16:29:50.932556193,7953136,T,IEX,237.130000,800
2019-10-18 16:30:01.330163968,2019-10-18 16:30:01.330148129,7959392,T,IEX,237.120000,100
2019-10-18 16:30:01.333517056,2019-10-18 16:30:01.333499414,7959400,T,IEX,237.120000,100
2019-10-18 16:30:02.357147904,2019-10-18 16:30:02.357131600,7960160,T,IEX,237.120000,177
2019-10-18 16:30:07.947514880,2019-10-18 16:30:07.947496014,7967581,T,IEX,237.105000,100
2019-10-18 16:30:35.642114048,2019-10-18 16:30:35.642091054,7983495,T,IEX,237.135000,100
2019-10-18 16:33:59.126550016,2019-10-18 16:33:59.126531740,8094992,T,IEX,237.275000,100
2019-10-18 16:34:05.829980928,2019-10-18 16:34:05.829962549,8100312,T,IEX,237.350000,93
2019-10-18 16:34:09.772382976,2019-10-18 16:34:09.772365763,8102831,T,IEX,237.330000,100
2019-10-18 16:37:42.301829120,2019-10-18 16:37:42.301811227,8213935,T,IEX,237.470000,47
2019-10-18 16:37:47.384224000,2019-10-18 16:37:47.384195992,8217269,T,IEX,237.500000,150
2019-10-18 16:37:47.384384000,2019-10-18 16:37:47.384365643,8217277,T,IEX,237.500000,100
2019-10-18 16:37:52.114717952,2019-10-18 16:37:52.114696843,8221038,T,IEX,237.530000,6
2019-10-18 16:38:07.311411968,2019-10-18 16:38:07.311392733,8228971,T,IEX,237.485000,100
2019-10-18 16:38:56.925421056,2019-10-18 16:38:56.925401571,8249596,T,IEX,237.490000,100
2019-10-18 16:39:02.981572096,2019-10-18 16:39:02.981552902,8252297,T,IEX,237.510000,200
2019-10-18 16:39:28.56346112,2019-10-18 16:39:28.56324778,8262510,T,IEX,237.540000,100
2019-10-18 16:42:06.50077952,2019-10-18 16:42:06.50057351,8333490,T,IEX,237.675000,100
2019-10-18 16:42:06.637960960,2019-10-18 16:42:06.637943139,8333715,T,IEX,237.700000,100
2019-10-18 16:42:29.788546048,2019-10-18 16:42:29.788531022,8344622,T,IEX,237.680000,100
2019-10-18 16:43:05.697219072,2019-10-18 16:43:05.697202461,8361558,T,IEX,237.625000,100
2019-10-18 16:44:08.389051904,2019-10-18 16:44:08.389033447,8391294,T,IEX,237.765000,100
2019-10-18 16:44:49.242115072,2019-10-18 16:44:49.242099122,8418268,T,IEX,237.755000,100
2019-10-18 16:44:58.48316928,2019-10-18 16:44:58.48295388,8426437,T,IEX,237.800000,200
2019-10-18 16:45:04.665239040,2019-10-18 16:45:04.665218949,8435547,T,IEX,237.725000,100
2019-10-18 16:45:04.665282048,2019-10-18 16:45:04.665264515,8435548,T,IEX,237.725000,100
2019-10-18 16:45:47.502713088,2019-10-18 16:45:47.502692056,8462825,T,IEX,237.705000,100
2019-10-18 16:46:50.506778112,2019-10-18 16:46:50.506760531,8499329,T,IEX,237.805000,100
2019-10-18 16:46:50.795888128,2019-10-18 16:46:50.795867893,8499387,T,IEX,237.780000,2
2019-10-18 16:47:10.391951872,2019-10-18 16:47:10.391930976,8508582,T,IEX,237.825000,200
2019-10-18 16:47:48.511190016,2019-10-18 16:47:48.511170402,8531727,T,IEX,237.800000,100
2019-10-18 16:47:50.327275008,2019-10-18 16:47:50.327255952,8533063,T,IEX,237.800000,10
2019-10-18 16:48:01.875891968,2019-10-18 16:48:01.875872123,8541725,T,IEX,237.795000,600
2019-10-18 16:48:48.479393024,2019-10-18 16:48:48.479373284,8569255,T,IEX,237.805000,100
2019-10-18 16:49:54.738778880,2019-10-18 16:49:54.738762495,8601712,T,IEX,237.775000,100
2019-10-18 16:50:24.499056128,2019-10-18 16:50:24.499039728,8617636,T,IEX,237.695000,1568
2019-10-18 16:50:24.509376000,2019-10-18 16:50:24.509358484,8617676,T,IEX,237.695000,700
2019-10-18 16:50:42.320786944,2019-10-18 16:50:42.320769429,8626928,T,IEX,237.650000,300
2019-10-18 16:52:48.564013056,2019-10-18 16:52:48.563990511,8686309,T,IEX,237.520000,4
2019-10-18 16:58:20.664547072,2019-10-18 16:58:20.664528957,8837872,T,IEX,237.670000,100
2019-10-18 16:59:30.629709056,2019-10-18 16:59:30.629690147,8864999,T,IEX,237.685000,1
2019-10-18 17:00:00.572017920,2019-10-18 17:00:00.571998457,8874271,T,IEX,237.715000,200
2019-10-18 17:00:48.376613120,2019-10-18 17:00:48.376595594,8896760,T,IEX,237.640000,100
2019-10-18 17:01:07.860557056,2019-10-18 17:01:07.860541846,8905738,T,IEX,237.705000,100
2019-10-18 17:01:07.860576000,2019-10-18 17:01:07.860560969,8905739,T,IEX,237.705000,100
2019-10-18 17:01:08.134874112,2019-10-18 17:01:08.134856980,8905894,T,IEX,237.705000,100
2019-10-18 17:01:52.380205056,2019-10-18 17:01:52.380185329,8932548,T,IEX,237.720000,100
2019-10-18 17:03:20.382231040,2019-10-18 17:03:20.382215356,8981722,T,IEX,237.730000,100
2019-10-18 17:05:43.340750080,2019-10-18 17:05:43.340734226,9035972,T,IEX,237.780000,24
2019-10-18 17:05:49.792215040,2019-10-18 17:05:49.792195973,9037981,T,IEX,237.785000,24
2019-10-18 17:05:52.30128896,2019-10-18 17:05:52.30109945,9039229,T,IEX,237.785000,20
2019-10-18 17:06:22.263862016,2019-10-18 17:06:22.263841250,9048161,T,IEX,237.780000,4
2019-10-18 17:06:27.868819968,2019-10-18 17:06:27.868803115,9049997,T,IEX,237.805000,2
2019-10-18 17:06:52.798841088,2019-10-18 17:06:52.798821988,9060691,T,IEX,237.800000,24
2019-10-18 17:07:09.716512000,2019-10-18 17:07:09.716495397,9068906,T,IEX,237.800000,2
2019-10-18 17:09:21.667890944,2019-10-18 17:09:21.667872826,9138185,T,IEX,237.770000,169
2019-10-18 17:09:21.668869888,2019-10-18 17:09:21.668852738,9138186,T,IEX,237.770000,331
2019-10-18 17:09:37.814095104,2019-10-18 17:09:37.814077185,9144364,T,IEX,237.695000,3
2019-10-18 17:10:08.529852928,2019-10-18 17:10:08.529834311,9157836,T,IEX,237.770000,1
2019-10-18 17:10:12.530603008,2019-10-18 17:10:12.530584600,9159805,T,IEX,237.770000,1
2019-10-18 17:10:24.385974016,2019-10-18 17:10:24.385954612,9165389,T,IEX,237.835000,1
2019-10-18 17:10:48.715852032,2019-10-18 17:10:48.715831664,9174059,T,IEX,237.835000,1
2019-10-18 17:10:50.785521920,2019-10-18 17:10:50.785502155,9174599,T,IEX,237.835000,2
2019-10-18 17:10:56.712496896,2019-10-18 17:10:56.712481074,9176508,T,IEX,237.830000,1
2019-10-18 17:11:50.711578112,2019-10-18 17:11:50.711561149,9200902,T,IEX,237.790000,1
2019-10-18 17:12:44.870658048,2019-10-18 17:12:44.870641505,9222156,T,IEX,237.820000,1
2019-10-18 17:13:06.205268992,2019-10-18 17:13:06.205252944,9229733,T,IEX,237.840000,1
2019-10-18 17:13:36.320867072,2019-10-18 17:13:36.320847768,9240042,T,IEX,237.870000,1
2019-10-18 17:13:49.13579008,2019-10-18 17:13:49.13562429,9243762,T,IEX,237.885000,1
2019-10-18 17:14:10.52845056,2019-10-18 17:14:10.52825289,9253023,T,IEX,237.905000,1
2019-10-18 17:14:10.679923968,2019-10-18 17:14:10.679903541,9253225,T,IEX,237.920000,1
2019-10-18 17:14:28.262127104,2019-10-18 17:14:28.262111043,9259444,T,IEX,237.920000,1
2019-10-18 17:14:58.282534912,2019-10-18 17:14:58.282515495,9273334,T,IEX,237.920000,1
2019-10-18 17:15:22.691054080,2019-10-18 17:15:22.691036251,9285923,T,IEX,237.930000,1
2019-10-18 17:15:23.159385088,2019-10-18 17:15:23.159365849,9286087,T,IEX,237.945000,1
2019-10-18 17:16:11.817117952,2019-10-18 17:16:11.817097429,9307621,T,IEX,237.955000,1
2019-10-18 17:17:00.126074880,2019-10-18 17:17:00.126055865,9336837,T,IEX,237.975000,1
2019-10-18 17:17:01.360517888,2019-10-18 17:17:01.360499781,9337578,T,IEX,237.990000,6
2019-10-18 17:17:20.129470976,2019-10-18 17:17:20.129449704,9349377,T,IEX,237.980000,1
2019-10-18 17:17:53.487921920,2019-10-18 17:17:53.487904091,9364759,T,IEX,237.960000,9
2019-10-18 17:17:53.985185024,2019-10-18 17:17:53.985164331,9364833,T,IEX,237.950000,1
2019-10-18 17:17:54.9505024,2019-10-18 17:17:54.9483968,9364836,T,IEX,237.940000,1
2019-10-18 17:18:32.794169088,2019-10-18 17:18:32.794150562,9381673,T,IEX,237.925000,1
2019-10-18 17:18:47.475630080,2019-10-18 17:18:47.475611961,9388739,T,IEX,237.970000,1
2019-10-18 17:18:47.630927872,2019-10-18 17:18:47.630910025,9389146,T,IEX,238.010000,1
2019-10-18 17:18:57.770881024,2019-10-18 17:18:57.770861242,9392310,T,IEX,238.045000,1
2019-10-18 17:19:01.882865920,2019-10-18 17:19:01.882847660,9394884,T,IEX,238.055000,1
2019-10-18 17:19:22.526210048,2019-10-18 17:19:22.526188710,9405413,T,IEX,238.020000,1
2019-10-18 17:19:22.548297984,2019-10-18 17:19:22.548276292,9405431,T,IEX,238.040000,1
2019-10-18 17:19:44.596346880,2019-10-18 17:19:44.596329349,9413759,T,IEX,238.040000,1
2019-10-18 17:20:25.539371008,2019-10-18 17:20:25.539353392,9427211,T,IEX,238.035000,1
2019-10-18 17:20:29.692616960,2019-10-18 17:20:29.692599005,9429793,T,IEX,238.030000,1
2019-10-18 17:20:43.35546880,2019-10-18 17:20:43.35531370,9434718,T,IEX,238.010000,1
2019-10-18 17:20:51.618590976,2019-10-18 17:20:51.618576090,9438490,T,IEX,238.015000,1
2019-10-18 17:20:55.46824960,2019-10-18 17:20:55.46805408,9439777,T,IEX,238.000000,14
2019-10-18 17:21:36.858857984,2019-10-18 17:21:36.858839081,9456853,T,IEX,238.000000,1
2019-10-18 17:22:02.924400896,2019-10-18 17:22:02.924380014,9466541,T,IEX,238.020000,1
2019-10-18 17:22:07.103784960,2019-10-18 17:22:07.103765832,9467986,T,IEX,238.035000,1
2019-10-18 17:22:30.320389120,2019-10-18 17:22:30.320369475,9476383,T,IEX,238.050000,1
2019-10-18 17:22:31.424528896,2019-10-18 17:22:31.424508913,9476877,T,IEX,238.065000,1
2019-10-18 17:22:59.389975040,2019-10-18 17:22:59.389952529,9485423,T,IEX,238.065000,1
2019-10-18 17:23:34.44683008,2019-10-18 17:23:34.44663775,9497611,T,IEX,238.030000,1
2019-10-18 17:24:14.924496896,2019-10-18 17:24:14.924476954,9513982,T,IEX,238.080000,1
2019-10-18 17:25:01.415677952,2019-10-18 17:25:01.415660138,9532793,T,IEX,238.040000,2
2019-10-18 17:25:57.35760896,2019-10-18 17:25:57.35743590,9552234,T,IEX,238.005000,2
2019-10-18 17:25:58.342332928,2019-10-18 17:25:58.342312182,9552702,T,IEX,238.020000,2
2019-10-18 17:26:17.869436928,2019-10-18 17:26:17.869415708,9559580,T,IEX,237.990000,1
2019-10-18 17:27:10.6076928,2019-10-18 17:27:10.6055385,9577962,T,IEX,237.990000,1
2019-10-18 17:27:13.124175104,2019-10-18 17:27:13.124157224,9578948,T,IEX,237.965000,1
2019-10-18 17:27:17.289883904,2019-10-18 17:27:17.289864416,9580898,T,IEX,237.955000,1
2019-10-18 17:27:44.739171072,2019-10-18 17:27:44.739151028,9590303,T,IEX,237.935000,1
2019-10-18 17:28:00.886812928,2019-10-18 17:28:00.886790391,9596049,T,IEX,237.945000,1
2019-10-18 17:28:51.812090880,2019-10-18 17:28:51.812074221,9614010,T,IEX,237.975000,1
2019-10-18 17:29:00.239286016,2019-10-18 17:29:00.239270194,9616824,T,IEX,237.980000,1
2019-10-18 17:29:40.227984896,2019-10-18 17:29:40.227967015,9630727,T,IEX,237.995000,1
2019-10-18 17:29:45.257165056,2019-10-18 17:29:45.257144099,9632500,T,IEX,237.995000,1
2019-10-18 17:30:01.76651008,2019-10-18 17:30:01.76633189,9637391,T,IEX,238.005000,1
2019-10-18 17:30:04.217039872,2019-10-18 17:30:04.217021061,9639373,T,IEX,238.000000,1
2019-10-18 17:30:48.797822976,2019-10-18 17:30:48.797800909,9656394,T,IEX,238.020000,1
2019-10-18 17:30:49.592993024,2019-10-18 17:30:49.592974926,9656764,T,IEX,238.030000,1
2019-10-18 17:31:40.767307008,2019-10-18 17:31:40.767284997,9671358,T,IEX,238.110000,28
2019-10-18 17:31:47.325580032,2019-10-18 17:31:47.325559158,9672638,T,IEX,238.090000,15
2019-10-18 17:32:38.734777088,2019-10-18 17:32:38.734755254,9689204,T,IEX,238.110000,3
2019-10-18 17:36:49.496993024,2019-10-18 17:36:49.496971933,9781678,T,IEX,238.080000,100
2019-10-18 17:37:33.365303040,2019-10-18 17:37:33.365284705,9795588,T,IEX,238.130000,1
2019-10-18 17:39:25.252912128,2019-10-18 17:39:25.252892719,9833069,T,IEX,238.075000,2
2019-10-18 17:43:57.97878016,2019-10-18 17:43:57.97859994,9925167,T,IEX,238.220000,29
2019-10-18 17:45:20.38789120,2019-10-18 17:45:20.38772292,9962587,T,IEX,238.230000,1
2019-10-18 17:46:39.558173952,2019-10-18 17:46:39.558155054,9995387,T,IEX,238.260000,1
2019-10-18 17:47:55.374108928,2019-10-18 17:47:55.374089214,10026781,T,IEX,238.360000,100
2019-10-18 17:50:12.841490944,2019-10-18 17:50:12.841474136,10075661,T,IEX,238.430000,7
2019-10-18 17:50:16.297112064,2019-10-18 17:50:16.297091987,10076778,T,IEX,238.390000,10
2019-10-18 17:51:09.599514880,2019-10-18 17:51:09.599496280,10094014,T,IEX,238.385000,100
2019-10-18 17:51:13.939184128,2019-10-18 17:51:13.939162537,10096203,T,IEX,238.410000,100
2019-10-18 17:51:29.209378048,2019-10-18 17:51:29.209359104,10103200,T,IEX,238.440000,1
2019-10-18 17:51:33.726778112,2019-10-18 17:51:33.726758536,10109546,T,IEX,238.430000,100
2019-10-18 17:51:56.430807040,2019-10-18 17:51:56.430787802,10117947,T,IEX,238.420000,100
2019-10-18 17:52:13.929925120,2019-10-18 17:52:13.929905526,10125300,T,IEX,238.440000,3
2019-10-18 17:56:04.957537024,2019-10-18 17:56:04.957515950,10203865,T,IEX,238.375000,1
2019-10-18 17:56:22.661687040,2019-10-18 17:56:22.661669384,10211972,T,IEX,238.465000,900
2019-10-18 17:57:47.228017920,2019-10-18 17:57:47.227999817,10239359,T,IEX,238.410000,1
2019-10-18 17:58:00.782492928,2019-10-18 17:58:00.782477228,10242507,T,IEX,238.420000,300
2019-10-18 17:59:48.945488896,2019-10-18 17:59:48.945469801,10280675,T,IEX,238.425000,1
2019-10-18 17:59:48.945506048,2019-10-18 17:59:48.945489827,10280676,T,IEX,238.425000,1
2019-10-18 17:59:57.376243968,2019-10-18 17:59:57.376226312,10283515,T,IEX,238.450000,10
2019-10-18 17:59:57.810832896,2019-10-18 17:59:57.810814672,10284259,T,IEX,238.465000,1
2019-10-18 18:00:16.201595904,2019-10-18 18:00:16.201581726,10297278,T,IEX,238.530000,1
2019-10-18 18:01:02.222610944,2019-10-18 18:01:02.222593098,10316722,T,IEX,238.465000,300
2019-10-18 18:01:20.240557056,2019-10-18 18:01:20.240539295,10331551,T,IEX,238.435000,1
2019-10-18 18:01:34.553850112,2019-10-18 18:01:34.553832809,10337368,T,IEX,238.425000,4
2019-10-18 18:02:29.12747008,2019-10-18 18:02:29.12726908,10356564,T,IEX,238.450000,200
2019-10-18 18:02:32.798362112,2019-10-18 18:02:32.798343802,10358807,T,IEX,238.450000,1
2019-10-18 18:03:04.403236096,2019-10-18 18:03:04.403215797,10372407,T,IEX,238.410000,100
2019-10-18 18:03:04.406419968,2019-10-18 18:03:04.406403944,10372410,T,IEX,238.400000,102
2019-10-18 18:03:04.407371008,2019-10-18 18:03:04.407351814,10372411,T,IEX,238.400000,317
2019-10-18 18:03:04.407382016,2019-10-18 18:03:04.407365198,10372412,T,IEX,238.400000,119
2019-10-18 18:03:04.408325888,2019-10-18 18:03:04.408306949,10372413,T,IEX,238.400000,300
2019-10-18 18:03:55.857910016,2019-10-18 18:03:55.857890965,10396650,T,IEX,238.345000,100
2019-10-18 18:04:01.83734016,2019-10-18 18:04:01.83715036,10399047,T,IEX,238.370000,6
2019-10-18 18:04:09.955126016,2019-10-18 18:04:09.955106411,10403952,T,IEX,238.390000,36
2019-10-18 18:04:40.823657984,2019-10-18 18:04:40.823639333,10417415,T,IEX,238.300000,100
2019-10-18 18:04:47.852176896,2019-10-18 18:04:47.852155129,10419619,T,IEX,238.270000,100
2019-10-18 18:04:49.195145984,2019-10-18 18:04:49.195127061,10420544,T,IEX,238.270000,1
2019-10-18 18:04:52.712367104,2019-10-18 18:04:52.712346924,10421509,T,IEX,238.250000,12
2019-10-18 18:04:54.406127104,2019-10-18 18:04:54.406108260,10421908,T,IEX,238.250000,100
2019-10-18 18:04:57.407020032,2019-10-18 18:04:57.407000458,10422578,T,IEX,238.250000,215
2019-10-18 18:05:13.915720960,2019-10-18 18:05:13.915700155,10431139,T,IEX,238.270000,950
2019-10-18 18:06:10.510424064,2019-10-18 18:06:10.510405998,10450376,T,IEX,238.280000,100
2019-10-18 18:06:12.583988992,2019-10-18 18:06:12.583971638,10451233,T,IEX,238.250000,5
2019-10-18 18:06:53.895867904,2019-10-18 18:06:53.895850385,10466570,T,IEX,238.255000,9
2019-10-18 18:08:00.151993088,2019-10-18 18:08:00.151972692,10496518,T,IEX,238.300000,1
2019-10-18 18:08:54.497478912,2019-10-18 18:08:54.497461316,10516350,T,IEX,238.245000,3
2019-10-18 18:09:04.975848960,2019-10-18 18:09:04.975829721,10520729,T,IEX,238.280000,2
2019-10-18 18:09:04.991990016,2019-10-18 18:09:04.991968713,10520737,T,IEX,238.290000,1
2019-10-18 18:09:29.328840960,2019-10-18 18:09:29.328822371,10530823,T,IEX,238.250000,100
2019-10-18 18:09:45.190470912,2019-10-18 18:09:45.190449136,10540108,T,IEX,238.250000,1
2019-10-18 18:10:10.637457920,2019-10-18 18:10:10.637435657,10550153,T,IEX,238.255000,1
2019-10-18 18:10:45.361679104,2019-10-18 18:10:45.361662508,10567273,T,IEX,238.260000,2
2019-10-18 18:11:42.871931904,2019-10-18 18:11:42.871915131,10589758,T,IEX,238.320000,32
2019-10-18 18:11:45.117907968,2019-10-18 18:11:45.117888845,10590669,T,IEX,238.310000,2
2019-10-18 18:12:45.327332096,2019-10-18 18:12:45.327312833,10616049,T,IEX,238.420000,5
2019-10-18 18:13:28.109267968,2019-10-18 18:13:28.109249774,10630271,T,IEX,238.355000,2
2019-10-18 18:13:29.689149952,2019-10-18 18:13:29.689130125,10630638,T,IEX,238.360000,1
2019-10-18 18:13:38.110535936,2019-10-18 18:13:38.110520575,10633738,T,IEX,238.375000,1
2019-10-18 18:14:45.440205056,2019-10-18 18:14:45.440188350,10658352,T,IEX,238.305000,1
2019-10-18 18:15:04.349975040,2019-10-18 18:15:04.349955290,10665692,T,IEX,238.240000,1
2019-10-18 18:15:12.290537984,2019-10-18 18:15:12.290518257,10671430,T,IEX,238.310000,1
2019-10-18 18:15:22.900260096,2019-10-18 18:15:22.900244429,10676085,T,IEX,238.335000,1
2019-10-18 18:15:40.74385920,2019-10-18 18:15:40.74369199,10681696,T,IEX,238.370000,1
2019-10-18 18:16:02.415696896,2019-10-18 18:16:02.415679757,10690423,T,IEX,238.385000,1
2019-10-18 18:16:06.687550976,2019-10-18 18:16:06.687529679,10692477,T,IEX,238.400000,1
2019-10-18 18:16:33.940219904,2019-10-18 18:16:33.940199856,10702575,T,IEX,238.430000,1
2019-10-18 18:17:19.77113088,2019-10-18 18:17:19.77093707,10718707,T,IEX,238.475000,1
2019-10-18 18:17:21.22272000,2019-10-18 18:17:21.22257290,10719918,T,IEX,238.530000,1
2019-10-18 18:17:30.619577088,2019-10-18 18:17:30.619558410,10724317,T,IEX,238.500000,1
2019-10-18 18:17:36.113516032,2019-10-18 18:17:36.113496492,10725968,T,IEX,238.480000,2
2019-10-18 18:18:18.5584896,2019-10-18 18:18:18.5569108,10740888,T,IEX,238.485000,1
2019-10-18 18:18:21.21085952,2019-10-18 18:18:21.21064369,10741732,T,IEX,238.460000,100
2019-10-18 18:18:23.108623104,2019-10-18 18:18:23.108603267,10742666,T,IEX,238.415000,2
2019-10-18 18:18:25.184910080,2019-10-18 18:18:25.184891464,10743269,T,IEX,238.290000,6
2019-10-18 18:18:25.186060032,2019-10-18 18:18:25.186041973,10743270,T,IEX,238.290000,100
2019-10-18 18:18:25.187164928,2019-10-18 18:18:25.187147440,10743272,T,IEX,238.290000,94
2019-10-18 18:18:25.210642944,2019-10-18 18:18:25.210625772,10743282,T,IEX,238.340000,4
2019-10-18 18:18:26.231083008,2019-10-18 18:18:26.231062715,10743571,T,IEX,238.320000,100
2019-10-18 18:18:26.232030976,2019-10-18 18:18:26.232012113,10743572,T,IEX,238.320000,1230
2019-10-18 18:18:27.625682944,2019-10-18 18:18:27.625665715,10743831,T,IEX,238.310000,100
2019-10-18 18:18:27.626632960,2019-10-18 18:18:27.626616264,10743834,T,IEX,238.310000,1570
2019-10-18 18:18:29.893338112,2019-10-18 18:18:29.893320429,10745598,T,IEX,238.310000,5
2019-10-18 18:18:29.900876032,2019-10-18 18:18:29.900859764,10745602,T,IEX,238.310000,4
2019-10-18 18:18:31.694004992,2019-10-18 18:18:31.693984059,10746285,T,IEX,238.300000,80
2019-10-18 18:18:31.706492928,2019-10-18 18:18:31.706471836,10746288,T,IEX,238.280000,1
2019-10-18 18:18:31.722264064,2019-10-18 18:18:31.722242516,10746292,T,IEX,238.240000,100
2019-10-18 18:18:31.819025920,2019-10-18 18:18:31.819006356,10746302,T,IEX,238.260000,1
2019-10-18 18:18:33.469530880,2019-10-18 18:18:33.469515466,10746649,T,IEX,238.210000,34
2019-10-18 18:18:33.490311936,2019-10-18 18:18:33.490292609,10746653,T,IEX,238.220000,1
2019-10-18 18:18:38.39447040,2019-10-18 18:18:38.39427605,10747574,T,IEX,238.275000,2
2019-10-18 18:18:38.287667968,2019-10-18 18:18:38.287647116,10747637,T,IEX,238.315000,4
2019-10-18 18:18:39.69944064,2019-10-18 18:18:39.69926911,10747797,T,IEX,238.360000,1
2019-10-18 18:18:39.142590976,2019-10-18 18:18:39.142571724,10747811,T,IEX,238.355000,5
2019-10-18 18:18:39.157148928,2019-10-18 18:18:39.157131953,10747824,T,IEX,238.380000,1
2019-10-18 18:18:39.703632896,2019-10-18 18:18:39.703617457,10748114,T,IEX,238.380000,1
2019-10-18 18:18:45.806173952,2019-10-18 18:18:45.806150952,10750145,T,IEX,238.335000,3
2019-10-18 18:18:59.155407104,2019-10-18 18:18:59.155386254,10753225,T,IEX,238.340000,4
2019-10-18 18:19:10.900826112,2019-10-18 18:19:10.900803197,10756826,T,IEX,238.380000,100
2019-10-18 18:19:10.913118976,2019-10-18 18:19:10.913096582,10756827,T,IEX,238.370000,300
2019-10-18 18:19:10.915715072,2019-10-18 18:19:10.915694376,10756828,T,IEX,238.350000,200
2019-10-18 18:19:10.924165888,2019-10-18 18:19:10.924146142,10756829,T,IEX,238.370000,300
2019-10-18 18:19:45.861934080,2019-10-18 18:19:45.861917222,10768635,T,IEX,238.380000,1
2019-10-18 18:19:52.649123072,2019-10-18 18:19:52.649105912,10771411,T,IEX,238.370000,6
2019-10-18 18:20:09.962326016,2019-10-18 18:20:09.962308120,10778238,T,IEX,238.390000,1
2019-10-18 18:20:45.363203072,2019-10-18 18:20:45.363185441,10806820,T,IEX,238.430000,2
2019-10-18 18:20:45.391507968,2019-10-18 18:20:45.391487782,10806844,T,IEX,238.430000,3
2019-10-18 18:21:41.928099072,2019-10-18 18:21:41.928080147,10831814,T,IEX,238.550000,1
2019-10-18 18:21:49.535055872,2019-10-18 18:21:49.535038703,10835219,T,IEX,238.555000,3
2019-10-18 18:22:07.561064960,2019-10-18 18:22:07.561045069,10842606,T,IEX,238.545000,1
2019-10-18 18:22:18.508205056,2019-10-18 18:22:18.508186774,10847987,T,IEX,238.550000,1
2019-10-18 18:22:23.420046080,2019-10-18 18:22:23.420024458,10850442,T,IEX,238.610000,68
2019-10-18 18:22:40.139110912,2019-10-18 18:22:40.139088634,10855404,T,IEX,238.575000,1
2019-10-18 18:23:36.221413120,2019-10-18 18:23:36.221385757,10877375,T,IEX,238.480000,1
2019-10-18 18:26:43.523164928,2019-10-18 18:26:43.523146982,10945921,T,IEX,238.460000,1
2019-10-18 18:27:15.96869888,2019-10-18 18:27:15.96851195,10960285,T,IEX,238.465000,1
2019-10-18 18:27:24.99443968,2019-10-18 18:27:24.99425415,10962218,T,IEX,238.530000,1
2019-10-18 18:27:36.616079104,2019-10-18 18:27:36.616059186,10966622,T,IEX,238.540000,1
2019-10-18 18:27:39.110960896,2019-10-18 18:27:39.110942993,10967656,T,IEX,238.520000,1
2019-10-18 18:27:43.610477056,2019-10-18 18:27:43.610460050,10969943,T,IEX,238.515000,1
2019-10-18 18:27:45.278351104,2019-10-18 18:27:45.278333309,10970871,T,IEX,238.500000,1
2019-10-18 18:27:45.415212032,2019-10-18 18:27:45.415190617,10970975,T,IEX,238.505000,1
2019-10-18 18:27:46.901804032,2019-10-18 18:27:46.901782575,10971527,T,IEX,238.490000,1
2019-10-18 18:28:28.74592000,2019-10-18 18:28:28.74572349,10987140,T,IEX,238.560000,61
2019-10-18 18:28:28.95516928,2019-10-18 18:28:28.95498188,10987272,T,IEX,238.530000,1
2019-10-18 18:28:28.96634112,2019-10-18 18:28:28.96615607,10987317,T,IEX,238.560000,50
2019-10-18 18:28:28.920131072,2019-10-18 18:28:28.920112564,10988121,T,IEX,238.555000,1
2019-10-18 18:28:46.121103872,2019-10-18 18:28:46.121086778,10996419,T,IEX,238.525000,1
2019-10-18 18:29:01.682397952,2019-10-18 18:29:01.682376240,11001951,T,IEX,238.570000,25
2019-10-18 18:29:11.272800000,2019-10-18 18:29:11.272780255,11005099,T,IEX,238.565000,29
2019-10-18 18:29:14.911542016,2019-10-18 18:29:14.911523111,11006349,T,IEX,238.585000,1
2019-10-18 18:29:14.920489984,2019-10-18 18:29:14.920474390,11006354,T,IEX,238.590000,2
2019-10-18 18:29:19.865585920,2019-10-18 18:29:19.865564826,11007830,T,IEX,238.570000,1
2019-10-18 18:29:19.965626880,2019-10-18 18:29:19.965609396,11007879,T,IEX,238.560000,1
2019-10-18 18:29:45.342078976,2019-10-18 18:29:45.342060304,11020125,T,IEX,238.625000,1
2019-10-18 18:30:24.516929024,2019-10-18 18:30:24.516910469,11037820,T,IEX,238.605000,1
2019-10-18 18:30:50.474792960,2019-10-18 18:30:50.474773574,11045444,T,IEX,238.615000,1
2019-10-18 18:31:09.948357120,2019-10-18 18:31:09.948338932,11051672,T,IEX,238.675000,1
2019-10-18 18:31:36.65755904,2019-10-18 18:31:36.65737875,11060379,T,IEX,238.685000,1
2019-10-18 18:31:43.974834944,2019-10-18 18:31:43.974815995,11066348,T,IEX,238.700000,1
2019-10-18 18:32:22.590725888,2019-10-18 18:32:22.590702901,11080763,T,IEX,238.730000,1
2019-10-18 18:32:59.292497920,2019-10-18 18:32:59.292480371,11093203,T,IEX,238.660000,1
2019-10-18 18:33:37.346817024,2019-10-18 18:33:37.346798074,11106420,T,IEX,238.610000,2
2019-10-18 18:33:37.359584000,2019-10-18 18:33:37.359565372,11106424,T,IEX,238.630000,2
2019-10-18 18:33:50.946264064,2019-10-18 18:33:50.946245787,11110661,T,IEX,238.625000,1
2019-10-18 18:34:09.858627072,2019-10-18 18:34:09.858607699,11117451,T,IEX,238.600000,1
2019-10-18 18:34:16.740569088,2019-10-18 18:34:16.740551198,11121054,T,IEX,238.590000,1
2019-10-18 18:34:45.592045056,2019-10-18 18:34:45.592024127,11133490,T,IEX,238.600000,1
2019-10-18 18:35:07.248888064,2019-10-18 18:35:07.248870084,11140378,T,IEX,238.610000,1
2019-10-18 18:35:29.261591040,2019-10-18 18:35:29.261569457,11146604,T,IEX,238.580000,1
2019-10-18 18:36:05.625612032,2019-10-18 18:36:05.625593987,11158740,T,IEX,238.580000,100
2019-10-18 18:36:10.746434048,2019-10-18 18:36:10.746416007,11163013,T,IEX,238.585000,1
2019-10-18 18:36:12.752710912,2019-10-18 18:36:12.752691570,11163729,T,IEX,238.585000,4
2019-10-18 18:36:35.489605120,2019-10-18 18:36:35.489584167,11173223,T,IEX,238.605000,1
2019-10-18 18:36:38.183364096,2019-10-18 18:36:38.183345344,11174394,T,IEX,238.600000,100
2019-10-18 18:36:43.398097920,2019-10-18 18:36:43.398082455,11176453,T,IEX,238.570000,1
2019-10-18 18:38:01.512058112,2019-10-18 18:38:01.512037908,11205425,T,IEX,238.550000,1447
2019-10-18 18:39:20.987497984,2019-10-18 18:39:20.987478810,11233617,T,IEX,238.490000,5
2019-10-18 18:39:24.538305024,2019-10-18 18:39:24.538282754,11235473,T,IEX,238.465000,300
2019-10-18 18:40:19.627715072,2019-10-18 18:40:19.627694866,11255242,T,IEX,238.460000,100
2019-10-18 18:41:03.296152064,2019-10-18 18:41:03.296134211,11272464,T,IEX,238.460000,50
2019-10-18 18:41:42.383205888,2019-10-18 18:41:42.383185398,11287012,T,IEX,238.500000,3
2019-10-18 18:41:42.383219968,2019-10-18 18:41:42.383204951,11287013,T,IEX,238.500000,2
2019-10-18 18:41:52.269501952,2019-10-18 18:41:52.269483926,11290907,T,IEX,238.480000,100
2019-10-18 18:44:00.793942016,2019-10-18 18:44:00.793921056,11331931,T,IEX,238.440000,100
2019-10-18 18:44:00.795438080,2019-10-18 18:44:00.795418573,11331932,T,IEX,238.440000,100
2019-10-18 18:44:02.118872064,2019-10-18 18:44:02.118852405,11332356,T,IEX,238.440000,1100
2019-10-18 18:44:40.262499072,2019-10-18 18:44:40.262478121,11344726,T,IEX,238.390000,300
2019-10-18 18:47:45.814686976,2019-10-18 18:47:45.814671594,11404699,T,IEX,238.390000,1
2019-10-18 18:48:55.286383104,2019-10-18 18:48:55.286367845,11431289,T,IEX,238.335000,30
2019-10-18 18:49:23.63038976,2019-10-18 18:49:23.63020752,11439908,T,IEX,238.310000,200
2019-10-18 18:49:37.481221888,2019-10-18 18:49:37.481201454,11446181,T,IEX,238.260000,200
2019-10-18 18:50:31.377815040,2019-10-18 18:50:31.377797863,11465831,T,IEX,238.390000,100
2019-10-18 18:51:00.86172928,2019-10-18 18:51:00.86153144,11476579,T,IEX,238.330000,100
2019-10-18 18:51:01.739438080,2019-10-18 18:51:01.739420963,11477316,T,IEX,238.320000,700
2019-10-18 18:51:01.758246912,2019-10-18 18:51:01.758229336,11477321,T,IEX,238.320000,600
2019-10-18 18:51:03.155350016,2019-10-18 18:51:03.155329267,11477709,T,IEX,238.270000,200
2019-10-18 18:51:18.502226944,2019-10-18 18:51:18.502208605,11482507,T,IEX,238.330000,100
2019-10-18 18:52:33.595684096,2019-10-18 18:52:33.595666483,11513636,T,IEX,238.510000,100
2019-10-18 18:52:40.268750080,2019-10-18 18:52:40.268728934,11516445,T,IEX,238.480000,100
2019-10-18 18:53:37.947330048,2019-10-18 18:53:37.947308060,11540325,T,IEX,238.490000,2
2019-10-18 18:53:52.859169024,2019-10-18 18:53:52.859151768,11545414,T,IEX,238.460000,100
2019-10-18 18:54:00.95581952,2019-10-18 18:54:00.95566366,11548762,T,IEX,238.440000,100
2019-10-18 18:54:00.97206016,2019-10-18 18:54:00.97186522,11548763,T,IEX,238.440000,100
2019-10-18 18:54:09.360470016,2019-10-18 18:54:09.360450490,11553793,T,IEX,238.415000,200
2019-10-18 18:55:09.953118976,2019-10-18 18:55:09.953099354,11575605,T,IEX,238.345000,100
2019-10-18 18:55:37.188942080,2019-10-18 18:55:37.188924115,11585351,T,IEX,238.390000,2
2019-10-18 18:55:37.188989952,2019-10-18 18:55:37.188972573,11585352,T,IEX,238.390000,1
2019-10-18 18:56:30.853690880,2019-10-18 18:56:30.853673275,11606453,T,IEX,238.415000,2900
2019-10-18 18:57:48.953699072,2019-10-18 18:57:48.953679914,11635795,T,IEX,238.455000,3100
2019-10-18 18:57:48.958288896,2019-10-18 18:57:48.958270240,11635800,T,IEX,238.455000,1400
2019-10-18 18:59:50.533042944,2019-10-18 18:59:50.533025739,11680809,T,IEX,238.425000,1
2019-10-18 18:59:50.734951936,2019-10-18 18:59:50.734933823,11680973,T,IEX,238.440000,10
2019-10-18 18:59:59.851731968,2019-10-18 18:59:59.851713151,11687251,T,IEX,238.440000,90
2019-10-18 19:00:01.389044992,2019-10-18 19:00:01.389016242,11693624,T,IEX,238.505000,100
2019-10-18 19:00:17.349741056,2019-10-18 19:00:17.349722225,11706831,T,IEX,238.550000,2
2019-10-18 19:00:20.996269056,2019-10-18 19:00:20.996249112,11710564,T,IEX,238.565000,13
2019-10-18 19:00:33.243780096,2019-10-18 19:00:33.243758148,11716975,T,IEX,238.610000,100
2019-10-18 19:03:08.99677952,2019-10-18 19:03:08.99658477,11772690,T,IEX,238.440000,3
2019-10-18 19:03:30.888443904,2019-10-18 19:03:30.888426435,11781877,T,IEX,238.440000,10
2019-10-18 19:04:45.742947072,2019-10-18 19:04:45.742929331,11808331,T,IEX,238.485000,2100
2019-10-18 19:06:03.812176896,2019-10-18 19:06:03.812156468,11832504,T,IEX,238.490000,200
2019-10-18 19:06:11.365810944,2019-10-18 19:06:11.365793530,11835906,T,IEX,238.490000,300
2019-10-18 19:06:55.207929088,2019-10-18 19:06:55.207911818,11849227,T,IEX,238.520000,100
2019-10-18 19:07:05.842225920,2019-10-18 19:07:05.842208684,11853381,T,IEX,238.460000,300
2019-10-18 19:08:49.233573120,2019-10-18 19:08:49.233552113,11900865,T,IEX,238.510000,100
2019-10-18 19:09:33.956112896,2019-10-18 19:09:33.956093670,11916787,T,IEX,238.550000,5
2019-10-18 19:10:35.30764032,2019-10-18 19:10:35.30744961,11941101,T,IEX,238.500000,100
2019-10-18 19:11:16.713568000,2019-10-18 19:11:16.713549845,11954679,T,IEX,238.500000,100
2019-10-18 19:11:17.249310976,2019-10-18 19:11:17.249295602,11954784,T,IEX,238.515000,100
2019-10-18 19:11:24.352801024,2019-10-18 19:11:24.352783683,11956445,T,IEX,238.515000,100
2019-10-18 19:12:05.97513984,2019-10-18 19:12:05.97495902,11971704,T,IEX,238.500000,2
2019-10-18 19:12:25.917967104,2019-10-18 19:12:25.917947154,11978653,T,IEX,238.450000,100
2019-10-18 19:13:19.396126976,2019-10-18 19:13:19.396101409,11996010,T,IEX,238.400000,100
2019-10-18 19:13:22.372306944,2019-10-18 19:13:22.372287157,11996586,T,IEX,238.385000,100
2019-10-18 19:13:22.374353920,2019-10-18 19:13:22.374335029,11996587,T,IEX,238.385000,100
2019-10-18 19:13:27.398471936,2019-10-18 19:13:27.398443713,11998819,T,IEX,238.390000,100
2019-10-18 19:13:27.398522112,2019-10-18 19:13:27.398506366,11998820,T,IEX,238.390000,100
2019-10-18 19:14:00.704812032,2019-10-18 19:14:00.704790786,12011399,T,IEX,238.390000,2
2019-10-18 19:14:00.707872000,2019-10-18 19:14:00.707854515,12011497,T,IEX,238.390000,100
2019-10-18 19:14:00.941460992,2019-10-18 19:14:00.941446310,12012362,T,IEX,238.400000,100
2019-10-18 19:14:10.924568064,2019-10-18 19:14:10.924549270,12019070,T,IEX,238.410000,100
2019-10-18 19:14:10.925798912,2019-10-18 19:14:10.925780654,12019116,T,IEX,238.410000,100
2019-10-18 19:14:42.970222080,2019-10-18 19:14:42.970205930,12036636,T,IEX,238.420000,100
2019-10-18 19:14:42.987586048,2019-10-18 19:14:42.987567134,12036671,T,IEX,238.420000,400
2019-10-18 19:14:42.987795968,2019-10-18 19:14:42.987778605,12036673,T,IEX,238.420000,300
2019-10-18 19:14:42.991158016,2019-10-18 19:14:42.991139340,12036681,T,IEX,238.420000,100
2019-10-18 19:14:43.71527936,2019-10-18 19:14:43.71511399,12036959,T,IEX,238.415000,100
2019-10-18 19:14:43.71543040,2019-10-18 19:14:43.71524401,12036960,T,IEX,238.415000,100
2019-10-18 19:14:43.71556096,2019-10-18 19:14:43.71540985,12036961,T,IEX,238.415000,100
2019-10-18 19:14:43.73405952,2019-10-18 19:14:43.73386932,12036972,T,IEX,238.415000,100
2019-10-18 19:14:43.73445888,2019-10-18 19:14:43.73430417,12036973,T,IEX,238.415000,100
2019-10-18 19:14:43.74693120,2019-10-18 19:14:43.74677356,12036977,T,IEX,238.415000,100
2019-10-18 19:14:56.373884928,2019-10-18 19:14:56.373864099,12045645,T,IEX,238.410000,100
2019-10-18 19:14:56.373901056,2019-10-18 19:14:56.373883620,12045646,T,IEX,238.410000,100
2019-10-18 19:14:56.376163072,2019-10-18 19:14:56.376143398,12045647,T,IEX,238.410000,100
2019-10-18 19:14:56.377691904,2019-10-18 19:14:56.377670282,12045649,T,IEX,238.410000,100
2019-10-18 19:14:56.473106944,2019-10-18 19:14:56.473085728,12045687,T,IEX,238.410000,100
2019-10-18 19:14:56.474594048,2019-10-18 19:14:56.474574684,12045688,T,IEX,238.410000,100
2019-10-18 19:14:56.479732992,2019-10-18 19:14:56.479714078,12045693,T,IEX,238.410000,100
2019-10-18 19:14:56.573080064,2019-10-18 19:14:56.573060405,12045737,T,IEX,238.410000,100
2019-10-18 19:14:56.574617088,2019-10-18 19:14:56.574597957,12045738,T,IEX,238.410000,100
2019-10-18 19:14:58.810161920,2019-10-18 19:14:58.810146100,12047511,T,IEX,238.390000,100
2019-10-18 19:15:05.192077056,2019-10-18 19:15:05.192055876,12051521,T,IEX,238.380000,100
2019-10-18 19:15:08.935165952,2019-10-18 19:15:08.935144445,12054897,T,IEX,238.350000,100
2019-10-18 19:15:12.857844992,2019-10-18 19:15:12.857822938,12058251,T,IEX,238.330000,100
2019-10-18 19:15:12.857854976,2019-10-18 19:15:12.857838349,12058252,T,IEX,238.330000,100
2019-10-18 19:15:22.171845888,2019-10-18 19:15:22.171827391,12062512,T,IEX,238.300000,100
2019-10-18 19:15:22.171930880,2019-10-18 19:15:22.171914624,12062513,T,IEX,238.300000,100
2019-10-18 19:15:24.437170944,2019-10-18 19:15:24.437152877,12064202,T,IEX,238.290000,100
2019-10-18 19:15:45.390392064,2019-10-18 19:15:45.390370334,12074949,T,IEX,238.305000,100
2019-10-18 19:15:47.458778880,2019-10-18 19:15:47.458761886,12075572,T,IEX,238.305000,100
2019-10-18 19:16:04.864226048,2019-10-18 19:16:04.864205220,12084034,T,IEX,238.285000,100
2019-10-18 19:16:06.468090880,2019-10-18 19:16:06.468074213,12085165,T,IEX,238.285000,100
2019-10-18 19:16:17.699752960,2019-10-18 19:16:17.699733249,12090598,T,IEX,238.330000,100
2019-10-18 19:18:08.383316992,2019-10-18 19:18:08.383300598,12132396,T,IEX,238.375000,100
2019-10-18 19:18:38.235020032,2019-10-18 19:18:38.235004016,12143927,T,IEX,238.400000,100
2019-10-18 19:19:40.941221888,2019-10-18 19:19:40.941206399,12164206,T,IEX,238.375000,100
2019-10-18 19:19:40.941236992,2019-10-18 19:19:40.941222174,12164207,T,IEX,238.375000,100
2019-10-18 19:21:06.224194048,2019-10-18 19:21:06.224149373,12199244,T,IEX,238.480000,100
2019-10-18 19:21:38.943888896,2019-10-18 19:21:38.943867889,12216430,T,IEX,238.440000,100
2019-10-18 19:22:12.472649984,2019-10-18 19:22:12.472627832,12230111,T,IEX,238.390000,22
2019-10-18 19:22:39.159988992,2019-10-18 19:22:39.159968001,12243527,T,IEX,238.380000,89
2019-10-18 19:22:39.181464064,2019-10-18 19:22:39.181443385,12243531,T,IEX,238.380000,11
2019-10-18 19:23:55.705250048,2019-10-18 19:23:55.705227767,12273658,T,IEX,238.405000,100
2019-10-18 19:23:55.705259008,2019-10-18 19:23:55.705241092,12273659,T,IEX,238.405000,100
2019-10-18 19:24:04.73679872,2019-10-18 19:24:04.73655742,12276967,T,IEX,238.425000,1
2019-10-18 19:24:04.624289024,2019-10-18 19:24:04.624270282,12277166,T,IEX,238.440000,100
2019-10-18 19:24:15.356987904,2019-10-18 19:24:15.356967973,12281836,T,IEX,238.400000,100
2019-10-18 19:24:15.356999936,2019-10-18 19:24:15.356983199,12281837,T,IEX,238.400000,200
2019-10-18 19:27:58.819675904,2019-10-18 19:27:58.819659859,12365510,T,IEX,238.280000,100
2019-10-18 19:29:33.366519040,2019-10-18 19:29:33.366503040,12406193,T,IEX,238.200000,100
2019-10-18 19:29:41.55023104,2019-10-18 19:29:41.55005399,12409051,T,IEX,238.195000,200
2019-10-18 19:30:55.703165952,2019-10-18 19:30:55.703147185,12451639,T,IEX,238.250000,37
2019-10-18 19:30:55.703363072,2019-10-18 19:30:55.703344121,12451646,T,IEX,238.250000,63
2019-10-18 19:33:20.883293952,2019-10-18 19:33:20.883277284,12522101,T,IEX,238.310000,2
2019-10-18 19:33:21.203537920,2019-10-18 19:33:21.203516271,12522196,T,IEX,238.310000,4
2019-10-18 19:33:23.794949888,2019-10-18 19:33:23.794932699,12523475,T,IEX,238.305000,100
2019-10-18 19:34:07.721114112,2019-10-18 19:34:07.721091362,12542030,T,IEX,238.310000,200
2019-10-18 19:35:43.158660096,2019-10-18 19:35:43.158641619,12591900,T,IEX,238.270000,24
2019-10-18 19:35:43.160784896,2019-10-18 19:35:43.160765186,12591915,T,IEX,238.270000,76
2019-10-18 19:35:56.922499072,2019-10-18 19:35:56.922478495,12599302,T,IEX,238.290000,15
2019-10-18 19:35:56.957399040,2019-10-18 19:35:56.957376745,12599310,T,IEX,238.290000,85
2019-10-18 19:36:17.539368960,2019-10-18 19:36:17.539352561,12610890,T,IEX,238.320000,100
2019-10-18 19:37:45.556142080,2019-10-18 19:37:45.556123321,12649357,T,IEX,238.195000,100
2019-10-18 19:38:12.407950080,2019-10-18 19:38:12.407931431,12661748,T,IEX,238.190000,100
2019-10-18 19:41:44.145643008,2019-10-18 19:41:44.145625743,12781586,T,IEX,238.170000,70
2019-10-18 19:42:11.543618048,2019-10-18 19:42:11.543599023,12796259,T,IEX,238.190000,100
2019-10-18 19:42:15.156165888,2019-10-18 19:42:15.156146129,12798176,T,IEX,238.210000,3
2019-10-18 19:43:24.687365120,2019-10-18 19:43:24.687345936,12828677,T,IEX,238.140000,100
2019-10-18 19:43:28.137801984,2019-10-18 19:43:28.137780495,12830035,T,IEX,238.125000,100
2019-10-18 19:43:28.137816064,2019-10-18 19:43:28.137799604,12830036,T,IEX,238.125000,100
2019-10-18 19:43:40.695196928,2019-10-18 19:43:40.695182150,12835137,T,IEX,238.140000,100
2019-10-18 19:43:59.449477120,2019-10-18 19:43:59.449457657,12843322,T,IEX,238.190000,100
2019-10-18 19:44:02.375364096,2019-10-18 19:44:02.375327457,12846484,T,IEX,238.190000,100
2019-10-18 19:44:28.721437952,2019-10-18 19:44:28.721419235,12860119,T,IEX,238.160000,46
2019-10-18 19:44:29.230096896,2019-10-18 19:44:29.230079275,12860378,T,IEX,238.130000,100
2019-10-18 19:44:29.232078080,2019-10-18 19:44:29.232058760,12860380,T,IEX,238.130000,100
2019-10-18 19:44:29.245404928,2019-10-18 19:44:29.245384446,12860393,T,IEX,238.130000,100
2019-10-18 19:44:29.246420992,2019-10-18 19:44:29.246405395,12860397,T,IEX,238.130000,100
2019-10-18 19:44:29.257858048,2019-10-18 19:44:29.257838788,12860413,T,IEX,238.120000,100
2019-10-18 19:45:49.251781120,2019-10-18 19:45:49.251764273,12908589,T,IEX,238.105000,100
2019-10-18 19:47:05.996901120,2019-10-18 19:47:05.996881315,12951613,T,IEX,238.140000,71
2019-10-18 19:47:05.997332992,2019-10-18 19:47:05.997317475,12951615,T,IEX,238.130000,100
2019-10-18 19:47:06.45373952,2019-10-18 19:47:06.45356560,12951672,T,IEX,238.130000,800
2019-10-18 19:47:06.47491072,2019-10-18 19:47:06.47474753,12951677,T,IEX,238.130000,200
2019-10-18 19:47:23.945924096,2019-10-18 19:47:23.945902744,12962495,T,IEX,238.110000,100
2019-10-18 19:48:03.155691008,2019-10-18 19:48:03.155674764,12988372,T,IEX,238.120000,1
2019-10-18 19:48:03.155712000,2019-10-18 19:48:03.155694798,12988373,T,IEX,238.120000,10
2019-10-18 19:48:21.31151104,2019-10-18 19:48:21.31132875,12997933,T,IEX,238.120000,2
2019-10-18 19:48:21.31162112,2019-10-18 19:48:21.31144553,12997934,T,IEX,238.140000,98
2019-10-18 19:48:21.511353088,2019-10-18 19:48:21.511333971,12998896,T,IEX,238.130000,100
2019-10-18 19:48:34.58654976,2019-10-18 19:48:34.58637092,13006980,T,IEX,238.150000,100
2019-10-18 19:48:57.185673984,2019-10-18 19:48:57.185655644,13022151,T,IEX,238.130000,100
2019-10-18 19:49:14.160162048,2019-10-18 19:49:14.160142170,13039166,T,IEX,238.125000,100
2019-10-18 19:49:41.820589056,2019-10-18 19:49:41.820569127,13059105,T,IEX,238.170000,100
2019-10-18 19:50:00.807868928,2019-10-18 19:50:00.807850849,13074293,T,IEX,238.200000,3
2019-10-18 19:50:01.605037056,2019-10-18 19:50:01.605018018,13078056,T,IEX,238.220000,20
2019-10-18 19:50:01.875043072,2019-10-18 19:50:01.875027415,13080646,T,IEX,238.230000,50
2019-10-18 19:50:05.838183936,2019-10-18 19:50:05.838154725,13086532,T,IEX,238.210000,100
2019-10-18 19:51:04.596478976,2019-10-18 19:51:04.596458772,13132420,T,IEX,238.185000,100
2019-10-18 19:51:29.109326080,2019-10-18 19:51:29.109309838,13149147,T,IEX,238.180000,100
2019-10-18 19:51:31.581282048,2019-10-18 19:51:31.581260106,13152082,T,IEX,238.165000,100
2019-10-18 19:51:32.254701056,2019-10-18 19:51:32.254684953,13152511,T,IEX,238.165000,200
2019-10-18 19:51:32.256250880,2019-10-18 19:51:32.256230774,13152515,T,IEX,238.165000,100
2019-10-18 19:51:41.167089920,2019-10-18 19:51:41.167067736,13158905,T,IEX,238.140000,100
2019-10-18 19:51:59.175427072,2019-10-18 19:51:59.175408917,13169131,T,IEX,238.130000,100
2019-10-18 19:52:24.532489984,2019-10-18 19:52:24.532470700,13187798,T,IEX,238.080000,100
2019-10-18 19:52:25.238740992,2019-10-18 19:52:25.238723226,13188173,T,IEX,238.080000,100
2019-10-18 19:52:27.868475904,2019-10-18 19:52:27.868456489,13190082,T,IEX,238.090000,100
2019-10-18 19:52:38.183842048,2019-10-18 19:52:38.183818708,13195866,T,IEX,238.085000,200
2019-10-18 19:52:38.183848960,2019-10-18 19:52:38.183825049,13195867,T,IEX,238.085000,190
2019-10-18 19:52:41.893268992,2019-10-18 19:52:41.893246788,13197847,T,IEX,238.090000,100
2019-10-18 19:52:41.894788096,2019-10-18 19:52:41.894770413,13197849,T,IEX,238.090000,100
2019-10-18 19:52:41.895972096,2019-10-18 19:52:41.895951302,13197850,T,IEX,238.090000,100
2019-10-18 19:53:08.739584000,2019-10-18 19:53:08.739566172,13214359,T,IEX,238.070000,2
2019-10-18 19:53:09.396026112,2019-10-18 19:53:09.396005061,13214686,T,IEX,238.070000,98
2019-10-18 19:53:09.396100096,2019-10-18 19:53:09.396082370,13214687,T,IEX,238.070000,400
2019-10-18 19:53:10.856979968,2019-10-18 19:53:10.856957348,13215451,T,IEX,238.070000,100
2019-10-18 19:53:42.611196928,2019-10-18 19:53:42.611177249,13233361,T,IEX,238.100000,100
2019-10-18 19:53:43.967991040,2019-10-18 19:53:43.967969720,13234185,T,IEX,238.100000,100
2019-10-18 19:53:48.647347968,2019-10-18 19:53:48.647329107,13237370,T,IEX,238.100000,100
2019-10-18 19:53:59.581965056,2019-10-18 19:53:59.581946214,13245772,T,IEX,238.130000,3
2019-10-18 19:53:59.849197056,2019-10-18 19:53:59.849179837,13246064,T,IEX,238.130000,97
2019-10-18 19:54:23.425231104,2019-10-18 19:54:23.425213752,13283465,T,IEX,238.230000,100
2019-10-18 19:54:34.545817088,2019-10-18 19:54:34.545799250,13294035,T,IEX,238.220000,100
2019-10-18 19:54:36.169207040,2019-10-18 19:54:36.169185286,13295262,T,IEX,238.220000,100
2019-10-18 19:54:43.159933952,2019-10-18 19:54:43.159913604,13300563,T,IEX,238.180000,2
2019-10-18 19:54:43.618444032,2019-10-18 19:54:43.618423649,13300854,T,IEX,238.180000,98
2019-10-18 19:54:47.736628992,2019-10-18 19:54:47.736607004,13304001,T,IEX,238.200000,100
2019-10-18 19:55:00.52969984,2019-10-18 19:55:00.52946136,13316541,T,IEX,238.110000,100
2019-10-18 19:55:00.140803072,2019-10-18 19:55:00.140783505,13318903,T,IEX,238.050000,25
2019-10-18 19:55:00.147616000,2019-10-18 19:55:00.147594631,13319063,T,IEX,238.050000,13
2019-10-18 19:55:01.188404992,2019-10-18 19:55:01.188388563,13326671,T,IEX,238.080000,100
2019-10-18 19:55:07.395019008,2019-10-18 19:55:07.394999547,13345994,T,IEX,238.040000,100
2019-10-18 19:55:08.741850880,2019-10-18 19:55:08.741829580,13349978,T,IEX,238.080000,30
2019-10-18 19:55:18.689351936,2019-10-18 19:55:18.689334576,13369256,T,IEX,238.100000,100
2019-10-18 19:55:35.815277056,2019-10-18 19:55:35.815256937,13388310,T,IEX,238.110000,100
2019-10-18 19:55:35.824237056,2019-10-18 19:55:35.824218760,13388314,T,IEX,238.100000,800
2019-10-18 19:55:35.825200896,2019-10-18 19:55:35.825182540,13388315,T,IEX,238.100000,200
2019-10-18 19:55:43.497052928,2019-10-18 19:55:43.497031436,13395704,T,IEX,238.115000,100
2019-10-18 19:55:50.621970944,2019-10-18 19:55:50.621952186,13405962,T,IEX,238.080000,100
2019-10-18 19:55:57.303952896,2019-10-18 19:55:57.303934399,13412661,T,IEX,238.070000,100
2019-10-18 19:56:06.280851968,2019-10-18 19:56:06.280832314,13421394,T,IEX,238.100000,100
2019-10-18 19:56:46.866030080,2019-10-18 19:56:46.866009308,13469029,T,IEX,238.100000,100
2019-10-18 19:56:53.805223936,2019-10-18 19:56:53.805208205,13474984,T,IEX,238.095000,100
2019-10-18 19:57:06.561358080,2019-10-18 19:57:06.561338484,13489814,T,IEX,238.080000,100
2019-10-18 19:57:08.441008128,2019-10-18 19:57:08.440987996,13491991,T,IEX,238.045000,100
2019-10-18 19:57:31.689931008,2019-10-18 19:57:31.689912033,13516931,T,IEX,238.060000,100
2019-10-18 19:57:36.699407872,2019-10-18 19:57:36.699392648,13524595,T,IEX,238.085000,100
2019-10-18 19:57:45.505096960,2019-10-18 19:57:45.505081083,13533729,T,IEX,238.100000,100
2019-10-18 19:58:14.149897984,2019-10-18 19:58:14.149878077,13565989,T,IEX,238.150000,100
2019-10-18 19:58:17.607164928,2019-10-18 19:58:17.607147646,13570289,T,IEX,238.145000,100
2019-10-18 19:58:23.94068992,2019-10-18 19:58:23.94044708,13577139,T,IEX,238.140000,100
2019-10-18 19:58:32.935877888,2019-10-18 19:58:32.935862233,13587711,T,IEX,238.130000,100
2019-10-18 19:58:33.487439872,2019-10-18 19:58:33.487420715,13588410,T,IEX,238.120000,100
2019-10-18 19:58:34.474494976,2019-10-18 19:58:34.474479699,13589523,T,IEX,238.090000,100
2019-10-18 19:58:35.277684992,2019-10-18 19:58:35.277668487,13590292,T,IEX,238.085000,100
2019-10-18 19:58:42.471397120,2019-10-18 19:58:42.471376147,13599562,T,IEX,238.080000,100
2019-10-18 19:58:42.472389888,2019-10-18 19:58:42.472370362,13599612,T,IEX,238.080000,100
2019-10-18 19:58:48.575122944,2019-10-18 19:58:48.575102394,13607633,T,IEX,238.120000,100
2019-10-18 19:58:49.890865920,2019-10-18 19:58:49.890847189,13609341,T,IEX,238.120000,100
2019-10-18 19:58:49.910194944,2019-10-18 19:58:49.910176411,13609370,T,IEX,238.100000,100
2019-10-18 19:58:49.960126976,2019-10-18 19:58:49.960109025,13609456,T,IEX,238.090000,100
2019-10-18 19:59:10.200820992,2019-10-18 19:59:10.200802742,13640908,T,IEX,238.070000,31
2019-10-18 19:59:11.971800064,2019-10-18 19:59:11.971784520,13644322,T,IEX,238.055000,100
2019-10-18 19:59:11.973348096,2019-10-18 19:59:11.973328910,13644328,T,IEX,238.050000,100
2019-10-18 19:59:11.974476032,2019-10-18 19:59:11.974453928,13644329,T,IEX,238.050000,100
2019-10-18 19:59:11.975962880,2019-10-18 19:59:11.975945117,13644335,T,IEX,238.050000,100
2019-10-18 19:59:16.419642112,2019-10-18 19:59:16.419622877,13653259,T,IEX,238.060000,100
2019-10-18 19:59:16.419997952,2019-10-18 19:59:16.419980314,13653261,T,IEX,238.060000,100
2019-10-18 19:59:16.420791040,2019-10-18 19:59:16.420773769,13653262,T,IEX,238.060000,100
2019-10-18 19:59:16.560856064,2019-10-18 19:59:16.560837548,13653660,T,IEX,238.060000,100
2019-10-18 19:59:19.801816064,2019-10-18 19:59:19.801791689,13659915,T,IEX,238.080000,100
2019-10-18 19:59:19.802083072,2019-10-18 19:59:19.802064835,13659922,T,IEX,238.080000,100
2019-10-18 19:59:26.565765120,2019-10-18 19:59:26.565746280,13669856,T,IEX,238.070000,5
2019-10-18 19:59:29.257594880,2019-10-18 19:59:29.257574423,13673713,T,IEX,238.060000,100
2019-10-18 19:59:29.399617024,2019-10-18 19:59:29.399598755,13674155,T,IEX,238.040000,100
2019-10-18 19:59:30.64167936,2019-10-18 19:59:30.64140389,13676674,T,IEX,238.060000,100
2019-10-18 19:59:31.703034112,2019-10-18 19:59:31.703015552,13687913,T,IEX,238.030000,100
2019-10-18 19:59:32.38255104,2019-10-18 19:59:32.38217354,13690991,T,IEX,238.070000,100
2019-10-18 19:59:32.38582016,2019-10-18 19:59:32.38564520,13691032,T,IEX,238.070000,100
2019-10-18 19:59:32.38599936,2019-10-18 19:59:32.38581302,13691033,T,IEX,238.070000,100
2019-10-18 19:59:32.101946880,2019-10-18 19:59:32.101928146,13692897,T,IEX,238.060000,1
2019-10-18 19:59:35.619464960,2019-10-18 19:59:35.619450083,13715258,T,IEX,238.075000,100
2019-10-18 19:59:38.66941952,2019-10-18 19:59:38.66923349,13730580,T,IEX,238.060000,100
2019-10-18 19:59:42.803831040,2019-10-18 19:59:42.803810001,13767664,T,IEX,238.050000,75
2019-10-18 19:59:43.520798976,2019-10-18 19:59:43.520784323,13772231,T,IEX,238.040000,100
2019-10-18 19:59:43.567488000,2019-10-18 19:59:43.567466274,13772384,T,IEX,238.060000,100
2019-10-18 19:59:45.20508928,2019-10-18 19:59:45.20470947,13781833,T,IEX,238.090000,100
2019-10-18 19:59:48.873751040,2019-10-18 19:59:48.873686498,13810882,T,IEX,238.090000,100
2019-10-18 19:59:55.726066944,2019-10-18 19:59:55.726042632,13858853,T,IEX,238.035000,100
