2019-10-07 13:30:07.284464896,2019-10-07 13:30:07.284439139,91436,T,IEX,54.340000,5
2019-10-07 13:30:07.603024896,2019-10-07 13:30:07.603000620,92109,T,IEX,54.330000,100
2019-10-07 13:30:08.405438976,2019-10-07 13:30:08.405413074,93519,T,IEX,54.340000,100
2019-10-07 13:30:21.178206976,2019-10-07 13:30:21.178184208,111067,T,IEX,54.330000,100
2019-10-07 13:30:29.778935040,2019-10-07 13:30:29.778911999,120046,T,IEX,54.350000,100
2019-10-07 13:30:45.496142080,2019-10-07 13:30:45.496118853,136164,T,IEX,54.345000,100
2019-10-07 13:30:55.164335104,2019-10-07 13:30:55.164311182,145374,T,IEX,54.350000,100
2019-10-07 13:30:58.445628928,2019-10-07 13:30:58.445605698,149478,T,IEX,54.350000,100
2019-10-07 13:30:58.457959936,2019-10-07 13:30:58.457936096,149525,T,IEX,54.340000,300
2019-10-07 13:31:17.892232960,2019-10-07 13:31:17.892204968,170238,T,IEX,54.330000,100
2019-10-07 13:31:17.892628992,2019-10-07 13:31:17.892607857,170240,T,IEX,54.330000,100
2019-10-07 13:31:24.673794048,2019-10-07 13:31:24.673769647,176008,T,IEX,54.330000,45
2019-10-07 13:31:43.203215872,2019-10-07 13:31:43.203190096,192634,T,IEX,54.290000,100
2019-10-07 13:32:12.147325952,2019-10-07 13:32:12.147300587,220932,T,IEX,54.230000,93
2019-10-07 13:32:58.384190976,2019-10-07 13:32:58.384166307,269425,T,IEX,54.270000,93
2019-10-07 13:33:31.771808000,2019-10-07 13:33:31.771786568,310050,T,IEX,54.250000,100
2019-10-07 13:33:41.5906944,2019-10-07 13:33:41.5884121,317340,T,IEX,54.240000,100
2019-10-07 13:33:49.240365056,2019-10-07 13:33:49.240341049,324935,T,IEX,54.190000,5
2019-10-07 13:34:30.548251904,2019-10-07 13:34:30.548236294,371687,T,IEX,54.240000,100
2019-10-07 13:34:32.333319936,2019-10-07 13:34:32.333301029,373094,T,IEX,54.220000,100
2019-10-07 13:34:54.713391104,2019-10-07 13:34:54.713370999,392383,T,IEX,54.205000,200
2019-10-07 13:34:55.243300096,2019-10-07 13:34:55.243284483,392679,T,IEX,54.190000,5
2019-10-07 13:34:56.414693888,2019-10-07 13:34:56.414674831,393314,T,IEX,54.200000,100
2019-10-07 13:34:56.440900096,2019-10-07 13:34:56.440879565,393338,T,IEX,54.190000,100
2019-10-07 13:35:00.62450944,2019-10-07 13:35:00.62427780,396472,T,IEX,54.190000,100
2019-10-07 13:35:06.352786944,2019-10-07 13:35:06.352769103,406702,T,IEX,54.180000,100
2019-10-07 13:35:10.28357888,2019-10-07 13:35:10.28340199,410681,T,IEX,54.190000,29
2019-10-07 13:36:09.333167104,2019-10-07 13:36:09.333148908,474153,T,IEX,54.160000,5
2019-10-07 13:37:07.183264000,2019-10-07 13:37:07.183248352,528741,T,IEX,54.160000,100
2019-10-07 13:37:21.492672000,2019-10-07 13:37:21.492652118,541996,T,IEX,54.140000,3
2019-10-07 13:37:36.139475968,2019-10-07 13:37:36.139456737,555566,T,IEX,54.140000,3
2019-10-07 13:37:59.185552896,2019-10-07 13:37:59.185533524,572093,T,IEX,54.150000,3
2019-10-07 13:37:59.185667072,2019-10-07 13:37:59.185651631,572095,T,IEX,54.150000,4
2019-10-07 13:37:59.185808896,2019-10-07 13:37:59.185790927,572096,T,IEX,54.150000,93
2019-10-07 13:38:28.136025088,2019-10-07 13:38:28.136007209,593168,T,IEX,54.135000,3
2019-10-07 13:38:48.255791104,2019-10-07 13:38:48.255771330,609172,T,IEX,54.150000,5
2019-10-07 13:40:06.383508992,2019-10-07 13:40:06.383490203,671194,T,IEX,54.150000,100
2019-10-07 13:40:33.207299072,2019-10-07 13:40:33.207283080,693601,T,IEX,54.180000,100
2019-10-07 13:43:53.672432896,2019-10-07 13:43:53.672413682,847989,T,IEX,54.195000,100
2019-10-07 13:44:00.17112064,2019-10-07 13:44:00.17093601,853370,T,IEX,54.195000,58
2019-10-07 13:44:00.17135104,2019-10-07 13:44:00.17119782,853371,T,IEX,54.195000,42
2019-10-07 13:44:05.777399040,2019-10-07 13:44:05.777378514,857852,T,IEX,54.195000,58
2019-10-07 13:44:05.777419008,2019-10-07 13:44:05.777402816,857853,T,IEX,54.195000,42
2019-10-07 13:45:32.121250048,2019-10-07 13:45:32.121229835,932014,T,IEX,54.150000,100
2019-10-07 13:45:52.330575872,2019-10-07 13:45:52.330557421,947649,T,IEX,54.155000,4
2019-10-07 13:45:52.368466944,2019-10-07 13:45:52.368450508,948012,T,IEX,54.155000,100
2019-10-07 13:45:52.370036992,2019-10-07 13:45:52.370020187,948018,T,IEX,54.155000,100
2019-10-07 13:45:59.287217920,2019-10-07 13:45:59.287199047,955790,T,IEX,54.155000,1
2019-10-07 13:46:13.234317056,2019-10-07 13:46:13.234295140,970133,T,IEX,54.155000,700
2019-10-07 13:46:13.471863040,2019-10-07 13:46:13.471843383,970236,T,IEX,54.145000,100
2019-10-07 13:46:13.472992000,2019-10-07 13:46:13.472975261,970237,T,IEX,54.145000,200
2019-10-07 13:46:24.641718016,2019-10-07 13:46:24.641690707,981719,T,IEX,54.150000,12
2019-10-07 13:46:24.641806080,2019-10-07 13:46:24.641783081,981725,T,IEX,54.150000,88
2019-10-07 13:46:53.393815040,2019-10-07 13:46:53.393796307,1008305,T,IEX,54.165000,1
2019-10-07 13:46:56.455559936,2019-10-07 13:46:56.455539692,1010512,T,IEX,54.165000,85
2019-10-07 13:48:01.450144000,2019-10-07 13:48:01.450120286,1070386,T,IEX,54.165000,5
2019-10-07 13:48:02.430007040,2019-10-07 13:48:02.429990112,1071344,T,IEX,54.165000,100
2019-10-07 13:48:02.431814912,2019-10-07 13:48:02.431795673,1071347,T,IEX,54.165000,100
2019-10-07 13:48:09.135610880,2019-10-07 13:48:09.135595364,1078002,T,IEX,54.170000,1
2019-10-07 13:48:54.965530112,2019-10-07 13:48:54.965511303,1117951,T,IEX,54.155000,14
2019-10-07 13:49:18.996142080,2019-10-07 13:49:18.996126388,1136761,T,IEX,54.135000,158
2019-10-07 13:50:17.109210880,2019-10-07 13:50:17.109192174,1184526,T,IEX,54.165000,4
2019-10-07 13:50:24.225108992,2019-10-07 13:50:24.225089203,1191485,T,IEX,54.165000,5
2019-10-07 13:51:06.322448896,2019-10-07 13:51:06.322429203,1227791,T,IEX,54.170000,100
2019-10-07 13:51:20.825762048,2019-10-07 13:51:20.825741749,1243856,T,IEX,54.170000,1
2019-10-07 13:53:03.131584000,2019-10-07 13:53:03.131562720,1337601,T,IEX,54.125000,10
2019-10-07 13:53:03.829067008,2019-10-07 13:53:03.829048152,1338698,T,IEX,54.125000,5
2019-10-07 13:53:19.891632896,2019-10-07 13:53:19.891610042,1353867,T,IEX,54.115000,90
2019-10-07 13:53:26.515308032,2019-10-07 13:53:26.515285487,1360640,T,IEX,54.100000,100
2019-10-07 13:53:30.18868992,2019-10-07 13:53:30.18851066,1364268,T,IEX,54.115000,600
2019-10-07 13:53:36.948539904,2019-10-07 13:53:36.948524674,1371594,T,IEX,54.105000,50
2019-10-07 13:53:41.158500096,2019-10-07 13:53:41.158475677,1374423,T,IEX,54.105000,5
2019-10-07 13:53:45.305971968,2019-10-07 13:53:45.305954823,1380258,T,IEX,54.105000,25
2019-10-07 13:53:48.922501120,2019-10-07 13:53:48.922483275,1384114,T,IEX,54.105000,5
2019-10-07 13:53:51.447723008,2019-10-07 13:53:51.447700631,1386424,T,IEX,54.105000,5
2019-10-07 13:54:04.422392064,2019-10-07 13:54:04.422373476,1397458,T,IEX,54.115000,100
2019-10-07 13:54:52.902014976,2019-10-07 13:54:52.901996064,1438572,T,IEX,54.095000,42
2019-10-07 13:55:16.634940928,2019-10-07 13:55:16.634921697,1457663,T,IEX,54.085000,5
2019-10-07 13:55:17.617723904,2019-10-07 13:55:17.617702751,1458109,T,IEX,54.085000,5
2019-10-07 13:55:25.320604928,2019-10-07 13:55:25.320588605,1466463,T,IEX,54.085000,100
2019-10-07 13:55:25.321788928,2019-10-07 13:55:25.321771538,1466477,T,IEX,54.085000,100
2019-10-07 13:55:25.323311104,2019-10-07 13:55:25.323295429,1466486,T,IEX,54.085000,200
2019-10-07 13:55:26.8396032,2019-10-07 13:55:26.8379682,1467015,T,IEX,54.075000,700
2019-10-07 13:55:26.13430016,2019-10-07 13:55:26.13413143,1467049,T,IEX,54.075000,351
2019-10-07 13:55:30.464175104,2019-10-07 13:55:30.464155840,1470161,T,IEX,54.070000,100
2019-10-07 13:55:50.359837952,2019-10-07 13:55:50.359819891,1488323,T,IEX,54.065000,7
2019-10-07 13:55:53.942661888,2019-10-07 13:55:53.942644771,1491347,T,IEX,54.065000,6
2019-10-07 13:56:28.668136960,2019-10-07 13:56:28.668119209,1515776,T,IEX,54.055000,2
2019-10-07 13:56:39.522344960,2019-10-07 13:56:39.522326341,1524153,T,IEX,54.065000,92
2019-10-07 13:57:20.519503104,2019-10-07 13:57:20.519481795,1549885,T,IEX,54.065000,10
2019-10-07 13:57:47.916504064,2019-10-07 13:57:47.916484889,1573135,T,IEX,54.060000,100
2019-10-07 13:57:50.801608960,2019-10-07 13:57:50.801593467,1576710,T,IEX,54.055000,200
2019-10-07 13:57:52.820913920,2019-10-07 13:57:52.820892269,1577932,T,IEX,54.045000,130
2019-10-07 13:57:52.823379968,2019-10-07 13:57:52.823358143,1577934,T,IEX,54.045000,100
2019-10-07 13:57:53.819891968,2019-10-07 13:57:53.819872077,1578688,T,IEX,54.045000,145
2019-10-07 13:57:53.819908096,2019-10-07 13:57:53.819892591,1578689,T,IEX,54.045000,2
2019-10-07 13:57:56.48936960,2019-10-07 13:57:56.48921679,1580295,T,IEX,54.055000,1
2019-10-07 13:58:23.420034048,2019-10-07 13:58:23.420017112,1603197,T,IEX,54.045000,100
2019-10-07 13:59:07.102254080,2019-10-07 13:59:07.102228680,1639173,T,IEX,54.045000,1
2019-10-07 14:00:07.125395968,2019-10-07 14:00:07.125375339,1690187,T,IEX,54.050000,100
2019-10-07 14:00:42.639796992,2019-10-07 14:00:42.639778957,1729576,T,IEX,54.070000,1
2019-10-07 14:00:42.684409088,2019-10-07 14:00:42.684389538,1729847,T,IEX,54.065000,100
2019-10-07 14:01:23.923908096,2019-10-07 14:01:23.923889116,1770029,T,IEX,54.050000,100
2019-10-07 14:03:25.790402048,2019-10-07 14:03:25.790382536,1865408,T,IEX,54.065000,100
2019-10-07 14:03:27.186032128,2019-10-07 14:03:27.186009345,1866341,T,IEX,54.065000,1
2019-10-07 14:03:55.486971904,2019-10-07 14:03:55.486951774,1888583,T,IEX,54.065000,1
2019-10-07 14:04:26.501235968,2019-10-07 14:04:26.501216383,1912600,T,IEX,54.075000,100
2019-10-07 14:04:45.847641088,2019-10-07 14:04:45.847621462,1930375,T,IEX,54.075000,9
2019-10-07 14:05:27.236912128,2019-10-07 14:05:27.236892466,1976423,T,IEX,54.085000,1
2019-10-07 14:05:27.236922880,2019-10-07 14:05:27.236906182,1976424,T,IEX,54.085000,7
2019-10-07 14:05:50.916942080,2019-10-07 14:05:50.916924183,2006723,T,IEX,54.085000,1
2019-10-07 14:06:05.915279104,2019-10-07 14:06:05.915262025,2027426,T,IEX,54.100000,1
2019-10-07 14:06:05.915339008,2019-10-07 14:06:05.915320611,2027428,T,IEX,54.100000,1
2019-10-07 14:06:20.214451968,2019-10-07 14:06:20.214433057,2048177,T,IEX,54.110000,1
2019-10-07 14:06:39.228626944,2019-10-07 14:06:39.228611049,2071811,T,IEX,54.105000,1
2019-10-07 14:06:56.146352128,2019-10-07 14:06:56.146331594,2089052,T,IEX,54.100000,5
2019-10-07 14:08:06.351301120,2019-10-07 14:08:06.351280576,2143939,T,IEX,54.115000,1
2019-10-07 14:10:04.186107904,2019-10-07 14:10:04.186087649,2236526,T,IEX,54.180000,100
2019-10-07 14:10:04.187319040,2019-10-07 14:10:04.187298434,2236528,T,IEX,54.180000,349
2019-10-07 14:10:04.187330048,2019-10-07 14:10:04.187314253,2236529,T,IEX,54.180000,1
2019-10-07 14:10:04.198673920,2019-10-07 14:10:04.198654013,2236537,T,IEX,54.190000,3
2019-10-07 14:10:23.430572032,2019-10-07 14:10:23.430554975,2252395,T,IEX,54.190000,1
2019-10-07 14:10:35.5844992,2019-10-07 14:10:35.5824002,2264742,T,IEX,54.180000,100
2019-10-07 14:10:56.576390912,2019-10-07 14:10:56.576372250,2280584,T,IEX,54.185000,1
2019-10-07 14:10:57.505305088,2019-10-07 14:10:57.505289720,2281638,T,IEX,54.165000,100
2019-10-07 14:10:58.509502976,2019-10-07 14:10:58.509486261,2282521,T,IEX,54.165000,100
2019-10-07 14:11:14.278448128,2019-10-07 14:11:14.278431097,2297000,T,IEX,54.185000,100
2019-10-07 14:11:28.951214080,2019-10-07 14:11:28.951195260,2309986,T,IEX,54.190000,1
2019-10-07 14:12:06.270018048,2019-10-07 14:12:06.270000136,2334190,T,IEX,54.175000,100
2019-10-07 14:12:33.625337088,2019-10-07 14:12:33.625316938,2355518,T,IEX,54.185000,1
2019-10-07 14:13:27.914283008,2019-10-07 14:13:27.914267609,2394595,T,IEX,54.195000,1
2019-10-07 14:13:32.182504960,2019-10-07 14:13:32.182488908,2397617,T,IEX,54.185000,1
2019-10-07 14:13:32.182523904,2019-10-07 14:13:32.182506128,2397618,T,IEX,54.180000,78
2019-10-07 14:13:32.182662912,2019-10-07 14:13:32.182644068,2397620,T,IEX,54.180000,21
2019-10-07 14:13:32.188032000,2019-10-07 14:13:32.188010773,2397641,T,IEX,54.190000,2
2019-10-07 14:13:42.702988032,2019-10-07 14:13:42.702970173,2403187,T,IEX,54.175000,100
2019-10-07 14:14:02.149711872,2019-10-07 14:14:02.149692658,2415394,T,IEX,54.175000,1
2019-10-07 14:14:22.78545920,2019-10-07 14:14:22.78529584,2431443,T,IEX,54.175000,100
2019-10-07 14:14:33.57996032,2019-10-07 14:14:33.57978378,2439561,T,IEX,54.170000,2
2019-10-07 14:14:35.874326016,2019-10-07 14:14:35.874310836,2441720,T,IEX,54.165000,100
2019-10-07 14:14:36.221992960,2019-10-07 14:14:36.221971935,2442408,T,IEX,54.165000,55
2019-10-07 14:14:56.484513024,2019-10-07 14:14:56.484492036,2455202,T,IEX,54.170000,30
2019-10-07 14:15:00.321459968,2019-10-07 14:15:00.321438833,2457177,T,IEX,54.165000,118
2019-10-07 14:15:06.322225920,2019-10-07 14:15:06.322206176,2463721,T,IEX,54.175000,100
2019-10-07 14:15:06.324069888,2019-10-07 14:15:06.324051190,2463725,T,IEX,54.170000,1
2019-10-07 14:15:06.330434048,2019-10-07 14:15:06.330414889,2463734,T,IEX,54.165000,100
2019-10-07 14:15:31.339315968,2019-10-07 14:15:31.339296591,2487008,T,IEX,54.170000,100
2019-10-07 14:15:31.339355904,2019-10-07 14:15:31.339337575,2487010,T,IEX,54.170000,9
2019-10-07 14:15:34.556549888,2019-10-07 14:15:34.556532210,2490097,T,IEX,54.175000,1
2019-10-07 14:15:40.365329920,2019-10-07 14:15:40.365310551,2494817,T,IEX,54.175000,100
2019-10-07 14:15:52.561494016,2019-10-07 14:15:52.561473513,2504016,T,IEX,54.165000,100
2019-10-07 14:16:01.594051072,2019-10-07 14:16:01.594031639,2508545,T,IEX,54.160000,9
2019-10-07 14:16:01.594433024,2019-10-07 14:16:01.594414880,2508559,T,IEX,54.160000,100
2019-10-07 14:16:34.322408960,2019-10-07 14:16:34.322392016,2527931,T,IEX,54.155000,9
2019-10-07 14:16:34.322507008,2019-10-07 14:16:34.322488535,2527934,T,IEX,54.155000,100
2019-10-07 14:16:34.377334016,2019-10-07 14:16:34.377312464,2527979,T,IEX,54.155000,100
2019-10-07 14:16:36.262149888,2019-10-07 14:16:36.262131916,2529466,T,IEX,54.145000,100
2019-10-07 14:16:38.248824064,2019-10-07 14:16:38.248806126,2531404,T,IEX,54.155000,33
2019-10-07 14:16:53.136463872,2019-10-07 14:16:53.136443920,2542658,T,IEX,54.145000,100
2019-10-07 14:17:04.567631872,2019-10-07 14:17:04.567615783,2548785,T,IEX,54.135000,100
2019-10-07 14:17:22.894435072,2019-10-07 14:17:22.894415188,2562220,T,IEX,54.125000,100
2019-10-07 14:17:32.482222080,2019-10-07 14:17:32.482206092,2568437,T,IEX,54.135000,100
2019-10-07 14:17:32.482258944,2019-10-07 14:17:32.482242336,2568438,T,IEX,54.135000,9
2019-10-07 14:17:50.128122880,2019-10-07 14:17:50.128102564,2581268,T,IEX,54.135000,9
2019-10-07 14:18:00.157722880,2019-10-07 14:18:00.157703702,2587620,T,IEX,54.135000,100
2019-10-07 14:18:29.244104960,2019-10-07 14:18:29.244086504,2606044,T,IEX,54.125000,9
2019-10-07 14:18:44.434014976,2019-10-07 14:18:44.433997268,2616601,T,IEX,54.115000,100
2019-10-07 14:18:44.749410048,2019-10-07 14:18:44.749394581,2616780,T,IEX,54.115000,100
2019-10-07 14:19:00.953192960,2019-10-07 14:19:00.953172240,2628632,T,IEX,54.105000,9
2019-10-07 14:19:03.187468032,2019-10-07 14:19:03.187449644,2629862,T,IEX,54.105000,12
2019-10-07 14:19:30.25102080,2019-10-07 14:19:30.25084101,2645218,T,IEX,54.085000,28
2019-10-07 14:19:33.111650048,2019-10-07 14:19:33.111631470,2647706,T,IEX,54.075000,100
2019-10-07 14:19:54.445985024,2019-10-07 14:19:54.445965972,2661113,T,IEX,54.075000,100
2019-10-07 14:20:40.481330944,2019-10-07 14:20:40.481315165,2692461,T,IEX,54.075000,100
2019-10-07 14:20:59.109936896,2019-10-07 14:20:59.109916545,2701785,T,IEX,54.075000,100
2019-10-07 14:21:18.812825088,2019-10-07 14:21:18.812804399,2717353,T,IEX,54.075000,100
2019-10-07 14:21:40.355058944,2019-10-07 14:21:40.355041186,2739224,T,IEX,54.075000,100
2019-10-07 14:21:40.355888128,2019-10-07 14:21:40.355866297,2739226,T,IEX,54.075000,100
2019-10-07 14:21:40.356695040,2019-10-07 14:21:40.356677446,2739229,T,IEX,54.075000,100
2019-10-07 14:21:41.781618944,2019-10-07 14:21:41.781601169,2740708,T,IEX,54.075000,100
2019-10-07 14:21:41.782451968,2019-10-07 14:21:41.782433352,2740710,T,IEX,54.075000,100
2019-10-07 14:21:43.567386112,2019-10-07 14:21:43.567363885,2742177,T,IEX,54.075000,100
2019-10-07 14:21:43.849683968,2019-10-07 14:21:43.849666881,2742418,T,IEX,54.075000,100
2019-10-07 14:21:43.849947904,2019-10-07 14:21:43.849929105,2742419,T,IEX,54.075000,100
2019-10-07 14:21:44.1149952,2019-10-07 14:21:44.1130725,2742542,T,IEX,54.075000,100
2019-10-07 14:21:46.14023936,2019-10-07 14:21:46.14008539,2744233,T,IEX,54.075000,100
2019-10-07 14:21:46.15390976,2019-10-07 14:21:46.15371926,2744238,T,IEX,54.075000,100
2019-10-07 14:21:46.288153088,2019-10-07 14:21:46.288134294,2744335,T,IEX,54.075000,100
2019-10-07 14:21:46.292513024,2019-10-07 14:21:46.292493287,2744339,T,IEX,54.075000,100
2019-10-07 14:21:54.800748032,2019-10-07 14:21:54.800727306,2749043,T,IEX,54.075000,100
2019-10-07 14:21:55.803536896,2019-10-07 14:21:55.803518653,2749737,T,IEX,54.075000,100
2019-10-07 14:21:56.919564032,2019-10-07 14:21:56.919547174,2750304,T,IEX,54.075000,100
2019-10-07 14:21:58.75329024,2019-10-07 14:21:58.75313617,2750726,T,IEX,54.075000,100
2019-10-07 14:22:05.875872000,2019-10-07 14:22:05.875855396,2757666,T,IEX,54.075000,100
2019-10-07 14:22:21.261288960,2019-10-07 14:22:21.261269253,2769351,T,IEX,54.075000,100
2019-10-07 14:22:41.92027904,2019-10-07 14:22:41.92012133,2779766,T,IEX,54.075000,1
2019-10-07 14:22:58.885540096,2019-10-07 14:22:58.885517197,2788845,T,IEX,54.075000,100
2019-10-07 14:23:13.225105920,2019-10-07 14:23:13.225085391,2798499,T,IEX,54.095000,100
2019-10-07 14:23:18.307534080,2019-10-07 14:23:18.307518026,2802454,T,IEX,54.095000,100
2019-10-07 14:23:28.636128000,2019-10-07 14:23:28.636108623,2808035,T,IEX,54.095000,100
2019-10-07 14:23:28.636957952,2019-10-07 14:23:28.636937435,2808036,T,IEX,54.095000,100
2019-10-07 14:23:28.638014976,2019-10-07 14:23:28.637992713,2808037,T,IEX,54.095000,100
2019-10-07 14:23:28.638051072,2019-10-07 14:23:28.638032434,2808038,T,IEX,54.095000,65
2019-10-07 14:23:28.638068992,2019-10-07 14:23:28.638051045,2808039,T,IEX,54.095000,4
2019-10-07 14:23:36.854508032,2019-10-07 14:23:36.854490268,2812903,T,IEX,54.095000,100
2019-10-07 14:23:44.167488000,2019-10-07 14:23:44.167469815,2816189,T,IEX,54.095000,100
2019-10-07 14:24:02.145679872,2019-10-07 14:24:02.145662959,2827708,T,IEX,54.095000,100
2019-10-07 14:24:04.518167040,2019-10-07 14:24:04.518151682,2831989,T,IEX,54.105000,100
2019-10-07 14:24:38.166704128,2019-10-07 14:24:38.166683857,2856086,T,IEX,54.105000,100
2019-10-07 14:24:50.380854016,2019-10-07 14:24:50.380834532,2864090,T,IEX,54.095000,1
2019-10-07 14:24:50.685786880,2019-10-07 14:24:50.685767602,2864888,T,IEX,54.080000,100
2019-10-07 14:24:50.685805056,2019-10-07 14:24:50.685786695,2864889,T,IEX,54.080000,100
2019-10-07 14:25:07.129917952,2019-10-07 14:25:07.129898590,2877206,T,IEX,54.085000,1
2019-10-07 14:25:08.548311040,2019-10-07 14:25:08.548294820,2878362,T,IEX,54.085000,4
2019-10-07 14:25:54.445296128,2019-10-07 14:25:54.445275480,2908875,T,IEX,54.085000,1
2019-10-07 14:25:57.713483008,2019-10-07 14:25:57.713463197,2911675,T,IEX,54.085000,100
2019-10-07 14:25:59.21635072,2019-10-07 14:25:59.21613782,2912595,T,IEX,54.090000,100
2019-10-07 14:26:33.172028928,2019-10-07 14:26:33.172010503,2937828,T,IEX,54.095000,100
2019-10-07 14:26:35.160570880,2019-10-07 14:26:35.160552399,2939214,T,IEX,54.095000,100
2019-10-07 14:26:47.300532992,2019-10-07 14:26:47.300513056,2946078,T,IEX,54.085000,100
2019-10-07 14:27:25.217107968,2019-10-07 14:27:25.217087759,2978780,T,IEX,54.095000,1
2019-10-07 14:28:09.583207936,2019-10-07 14:28:09.583189510,3005826,T,IEX,54.085000,100
2019-10-07 14:28:32.777064960,2019-10-07 14:28:32.777045063,3020699,T,IEX,54.085000,100
2019-10-07 14:28:33.842936064,2019-10-07 14:28:33.842917176,3021400,T,IEX,54.085000,100
2019-10-07 14:28:46.310686976,2019-10-07 14:28:46.310665457,3028571,T,IEX,54.085000,100
2019-10-07 14:29:04.501147904,2019-10-07 14:29:04.501129586,3040038,T,IEX,54.085000,100
2019-10-07 14:29:13.66106880,2019-10-07 14:29:13.66085387,3045653,T,IEX,54.085000,1
2019-10-07 14:29:55.492569088,2019-10-07 14:29:55.492550420,3068108,T,IEX,54.100000,41
2019-10-07 14:29:57.408603904,2019-10-07 14:29:57.408586474,3069555,T,IEX,54.105000,200
2019-10-07 14:30:00.520701952,2019-10-07 14:30:00.520679877,3073222,T,IEX,54.105000,100
2019-10-07 14:30:02.685213952,2019-10-07 14:30:02.685192908,3076244,T,IEX,54.105000,100
2019-10-07 14:30:05.15075072,2019-10-07 14:30:05.15057044,3078568,T,IEX,54.105000,100
2019-10-07 14:30:09.968301056,2019-10-07 14:30:09.968285357,3083173,T,IEX,54.095000,100
2019-10-07 14:30:14.613870080,2019-10-07 14:30:14.613852600,3088984,T,IEX,54.095000,100
2019-10-07 14:30:43.783279104,2019-10-07 14:30:43.783258902,3109155,T,IEX,54.085000,100
2019-10-07 14:30:44.431680000,2019-10-07 14:30:44.431662964,3109678,T,IEX,54.085000,1
2019-10-07 14:31:08.928809984,2019-10-07 14:31:08.928789279,3126018,T,IEX,54.085000,32
2019-10-07 14:31:14.37181952,2019-10-07 14:31:14.37163382,3128661,T,IEX,54.085000,1
2019-10-07 14:32:07.312916992,2019-10-07 14:32:07.312898798,3168952,T,IEX,54.075000,1
2019-10-07 14:32:07.452422912,2019-10-07 14:32:07.452403067,3170181,T,IEX,54.065000,100
2019-10-07 14:32:07.460140032,2019-10-07 14:32:07.460118688,3170191,T,IEX,54.065000,200
2019-10-07 14:33:05.207892992,2019-10-07 14:33:05.207872488,3208199,T,IEX,54.065000,100
2019-10-07 14:33:08.662094080,2019-10-07 14:33:08.662071856,3209804,T,IEX,54.065000,100
2019-10-07 14:33:18.540205056,2019-10-07 14:33:18.540183977,3214992,T,IEX,54.080000,100
2019-10-07 14:33:23.659430912,2019-10-07 14:33:23.659409710,3220239,T,IEX,54.075000,1
2019-10-07 14:33:30.735291904,2019-10-07 14:33:30.735273678,3225754,T,IEX,54.085000,100
2019-10-07 14:33:35.563201024,2019-10-07 14:33:35.563180330,3230215,T,IEX,54.085000,100
2019-10-07 14:33:46.162611968,2019-10-07 14:33:46.162591160,3236330,T,IEX,54.090000,100
2019-10-07 14:33:46.177776128,2019-10-07 14:33:46.177754997,3236340,T,IEX,54.100000,2
2019-10-07 14:33:50.17913088,2019-10-07 14:33:50.17892441,3238308,T,IEX,54.095000,100
2019-10-07 14:33:54.772930048,2019-10-07 14:33:54.772909655,3241270,T,IEX,54.105000,100
2019-10-07 14:33:59.232033024,2019-10-07 14:33:59.232017561,3243731,T,IEX,54.105000,100
2019-10-07 14:34:28.664350976,2019-10-07 14:34:28.664330335,3264057,T,IEX,54.100000,20
2019-10-07 14:34:45.514393088,2019-10-07 14:34:45.514372566,3274758,T,IEX,54.105000,100
2019-10-07 14:34:53.762149888,2019-10-07 14:34:53.762132989,3281273,T,IEX,54.115000,1
2019-10-07 14:35:03.8862976,2019-10-07 14:35:03.8843297,3287568,T,IEX,54.105000,100
2019-10-07 14:35:03.16722944,2019-10-07 14:35:03.16694969,3287571,T,IEX,54.105000,100
2019-10-07 14:35:14.566454016,2019-10-07 14:35:14.566435990,3299425,T,IEX,54.105000,100
2019-10-07 14:35:21.649553920,2019-10-07 14:35:21.649536848,3303787,T,IEX,54.120000,111
2019-10-07 14:35:44.115928064,2019-10-07 14:35:44.115911485,3317064,T,IEX,54.100000,52
2019-10-07 14:35:44.115953920,2019-10-07 14:35:44.115936801,3317066,T,IEX,54.100000,48
2019-10-07 14:35:44.121768960,2019-10-07 14:35:44.121751303,3317254,T,IEX,54.095000,100
2019-10-07 14:35:57.361752064,2019-10-07 14:35:57.361727748,3327485,T,IEX,54.085000,100
2019-10-07 14:36:09.404892928,2019-10-07 14:36:09.404874276,3338085,T,IEX,54.105000,16
2019-10-07 14:36:09.568589056,2019-10-07 14:36:09.568574854,3338277,T,IEX,54.105000,100
2019-10-07 14:36:27.719676928,2019-10-07 14:36:27.719656727,3350877,T,IEX,54.095000,600
2019-10-07 14:36:27.724339968,2019-10-07 14:36:27.724323943,3350880,T,IEX,54.095000,100
2019-10-07 14:36:52.846995968,2019-10-07 14:36:52.846977219,3370627,T,IEX,54.105000,1
2019-10-07 14:36:58.281227008,2019-10-07 14:36:58.281205593,3375937,T,IEX,54.095000,100
2019-10-07 14:37:06.137065984,2019-10-07 14:37:06.137045877,3382923,T,IEX,54.100000,100
2019-10-07 14:37:34.336571904,2019-10-07 14:37:34.336556689,3412944,T,IEX,54.105000,100
2019-10-07 14:37:53.584896000,2019-10-07 14:37:53.584875412,3425209,T,IEX,54.105000,1
2019-10-07 14:38:08.70974976,2019-10-07 14:38:08.70956939,3435139,T,IEX,54.095000,794
2019-10-07 14:38:10.923540992,2019-10-07 14:38:10.923524704,3436428,T,IEX,54.095000,100
2019-10-07 14:38:11.221114880,2019-10-07 14:38:11.221095122,3436557,T,IEX,54.095000,100
2019-10-07 14:39:08.459130880,2019-10-07 14:39:08.459113246,3473657,T,IEX,54.075000,100
2019-10-07 14:39:26.526432000,2019-10-07 14:39:26.526410503,3485643,T,IEX,54.085000,100
2019-10-07 14:39:27.363544064,2019-10-07 14:39:27.363527223,3485907,T,IEX,54.085000,1
2019-10-07 14:39:37.272752128,2019-10-07 14:39:37.272731885,3494297,T,IEX,54.085000,100
2019-10-07 14:39:40.16343040,2019-10-07 14:39:40.16318246,3495508,T,IEX,54.085000,1
2019-10-07 14:39:40.636801024,2019-10-07 14:39:40.636780640,3496148,T,IEX,54.085000,651
2019-10-07 14:39:46.577177088,2019-10-07 14:39:46.577161682,3499563,T,IEX,54.075000,100
2019-10-07 14:39:52.794115072,2019-10-07 14:39:52.794095962,3502508,T,IEX,54.065000,100
2019-10-07 14:40:10.205236992,2019-10-07 14:40:10.205218384,3515653,T,IEX,54.070000,2
2019-10-07 14:40:27.749873920,2019-10-07 14:40:27.749854537,3528596,T,IEX,54.070000,98
2019-10-07 14:40:32.722434048,2019-10-07 14:40:32.722418318,3533559,T,IEX,54.085000,100
2019-10-07 14:41:11.69102080,2019-10-07 14:41:11.69081288,3561392,T,IEX,54.095000,100
2019-10-07 14:41:22.899332096,2019-10-07 14:41:22.899314276,3571110,T,IEX,54.105000,1
2019-10-07 14:41:36.128715008,2019-10-07 14:41:36.128696381,3579091,T,IEX,54.105000,100
2019-10-07 14:41:49.585688064,2019-10-07 14:41:49.585668022,3586822,T,IEX,54.105000,100
2019-10-07 14:41:53.728008960,2019-10-07 14:41:53.727990588,3590501,T,IEX,54.110000,1
2019-10-07 14:42:22.649594112,2019-10-07 14:42:22.649575504,3612173,T,IEX,54.115000,1
2019-10-07 14:42:41.451386880,2019-10-07 14:42:41.451369461,3629180,T,IEX,54.105000,100
2019-10-07 14:42:41.825811968,2019-10-07 14:42:41.825791794,3629498,T,IEX,54.105000,100
2019-10-07 14:42:43.391727104,2019-10-07 14:42:43.391708341,3630254,T,IEX,54.105000,100
2019-10-07 14:42:43.392559104,2019-10-07 14:42:43.392542258,3630255,T,IEX,54.105000,100
2019-10-07 14:42:43.393391104,2019-10-07 14:42:43.393373042,3630256,T,IEX,54.105000,100
2019-10-07 14:42:45.16921088,2019-10-07 14:42:45.16902094,3631344,T,IEX,54.105000,100
2019-10-07 14:43:25.213294080,2019-10-07 14:43:25.213277243,3654792,T,IEX,54.065000,106
2019-10-07 14:43:38.47290112,2019-10-07 14:43:38.47269255,3663202,T,IEX,54.075000,104
2019-10-07 14:43:58.39459072,2019-10-07 14:43:58.39439872,3678097,T,IEX,54.075000,1
2019-10-07 14:44:00.935720960,2019-10-07 14:44:00.935702070,3681805,T,IEX,54.075000,100
2019-10-07 14:44:00.938658048,2019-10-07 14:44:00.938639820,3681894,T,IEX,54.075000,100
2019-10-07 14:44:00.948571904,2019-10-07 14:44:00.948546137,3682237,T,IEX,54.075000,13
2019-10-07 14:44:00.959794944,2019-10-07 14:44:00.959776471,3682488,T,IEX,54.075000,100
2019-10-07 14:44:07.344619008,2019-10-07 14:44:07.344599493,3690173,T,IEX,54.075000,100
2019-10-07 14:44:07.369566976,2019-10-07 14:44:07.369551225,3690761,T,IEX,54.075000,100
2019-10-07 14:44:12.141338112,2019-10-07 14:44:12.141317000,3695761,T,IEX,54.090000,100
2019-10-07 14:44:12.594414080,2019-10-07 14:44:12.594396358,3695955,T,IEX,54.085000,100
2019-10-07 14:44:32.926361088,2019-10-07 14:44:32.926340733,3713587,T,IEX,54.090000,37
2019-10-07 14:44:54.156357120,2019-10-07 14:44:54.156338650,3729583,T,IEX,54.075000,100
2019-10-07 14:45:14.210510080,2019-10-07 14:45:14.210494493,3743271,T,IEX,54.075000,13
2019-10-07 14:45:26.115121920,2019-10-07 14:45:26.115100348,3750024,T,IEX,54.075000,1
2019-10-07 14:45:29.562202880,2019-10-07 14:45:29.562182995,3753555,T,IEX,54.060000,100
2019-10-07 14:45:29.562254080,2019-10-07 14:45:29.562221623,3753560,T,IEX,54.060000,100
2019-10-07 14:45:29.595674880,2019-10-07 14:45:29.595655408,3754644,T,IEX,54.060000,1
2019-10-07 14:45:31.541449984,2019-10-07 14:45:31.541432868,3759772,T,IEX,54.055000,100
2019-10-07 14:45:40.24907008,2019-10-07 14:45:40.24889747,3769351,T,IEX,54.055000,100
2019-10-07 14:45:40.24926976,2019-10-07 14:45:40.24910202,3769352,T,IEX,54.055000,100
2019-10-07 14:46:03.206573056,2019-10-07 14:46:03.206556977,3788649,T,IEX,54.050000,100
2019-10-07 14:46:11.37056000,2019-10-07 14:46:11.37035468,3795697,T,IEX,54.045000,100
2019-10-07 14:46:24.536609024,2019-10-07 14:46:24.536592695,3804724,T,IEX,54.035000,20
2019-10-07 14:46:27.180498944,2019-10-07 14:46:27.180483674,3806646,T,IEX,54.035000,100
2019-10-07 14:46:29.535492096,2019-10-07 14:46:29.535476508,3808235,T,IEX,54.045000,100
2019-10-07 14:46:34.212065024,2019-10-07 14:46:34.212049234,3810575,T,IEX,54.045000,100
2019-10-07 14:46:34.212463104,2019-10-07 14:46:34.212447921,3810577,T,IEX,54.045000,100
2019-10-07 14:46:34.293705984,2019-10-07 14:46:34.293685397,3810597,T,IEX,54.045000,100
2019-10-07 14:46:35.373082112,2019-10-07 14:46:35.373062812,3810946,T,IEX,54.045000,100
2019-10-07 14:46:35.373391104,2019-10-07 14:46:35.373374081,3810947,T,IEX,54.045000,100
2019-10-07 14:46:35.375025920,2019-10-07 14:46:35.375005245,3810948,T,IEX,54.045000,100
2019-10-07 14:46:52.696144896,2019-10-07 14:46:52.696125939,3820403,T,IEX,54.055000,1
2019-10-07 14:47:02.495525120,2019-10-07 14:47:02.495503804,3828363,T,IEX,54.060000,9
2019-10-07 14:47:02.917702912,2019-10-07 14:47:02.917685682,3828864,T,IEX,54.045000,100
2019-10-07 14:47:08.844216064,2019-10-07 14:47:08.844198489,3834031,T,IEX,54.035000,100
2019-10-07 14:47:26.450659072,2019-10-07 14:47:26.450637937,3846416,T,IEX,54.055000,100
2019-10-07 14:47:26.450932992,2019-10-07 14:47:26.450915263,3846419,T,IEX,54.055000,100
2019-10-07 14:47:49.685903872,2019-10-07 14:47:49.685886286,3863282,T,IEX,54.045000,100
2019-10-07 14:48:00.878470912,2019-10-07 14:48:00.878451524,3869559,T,IEX,54.055000,100
2019-10-07 14:48:08.539130880,2019-10-07 14:48:08.539112214,3874785,T,IEX,54.055000,100
2019-10-07 14:48:22.705428992,2019-10-07 14:48:22.705410799,3881858,T,IEX,54.065000,1
2019-10-07 14:48:50.838196992,2019-10-07 14:48:50.838176940,3896110,T,IEX,54.065000,100
2019-10-07 14:48:50.843548928,2019-10-07 14:48:50.843527572,3896184,T,IEX,54.065000,4
2019-10-07 14:48:50.843557120,2019-10-07 14:48:50.843539443,3896185,T,IEX,54.065000,191
2019-10-07 14:48:51.839020032,2019-10-07 14:48:51.839001334,3896536,T,IEX,54.065000,100
2019-10-07 14:48:51.839207936,2019-10-07 14:48:51.839192222,3896537,T,IEX,54.065000,5
2019-10-07 14:48:51.839224064,2019-10-07 14:48:51.839208418,3896538,T,IEX,54.065000,103
2019-10-07 14:48:51.844634112,2019-10-07 14:48:51.844614007,3896541,T,IEX,54.065000,100
2019-10-07 14:48:53.597680896,2019-10-07 14:48:53.597658281,3898130,T,IEX,54.065000,6
2019-10-07 14:49:10.217854976,2019-10-07 14:49:10.217834701,3908720,T,IEX,54.075000,100
2019-10-07 14:49:13.676484096,2019-10-07 14:49:13.676464833,3910203,T,IEX,54.075000,97
2019-10-07 14:49:15.17903104,2019-10-07 14:49:15.17884987,3910915,T,IEX,54.075000,19
2019-10-07 14:49:26.327479040,2019-10-07 14:49:26.327458381,3916390,T,IEX,54.075000,1
2019-10-07 14:49:28.184777984,2019-10-07 14:49:28.184759531,3917533,T,IEX,54.075000,69
2019-10-07 14:49:28.184793088,2019-10-07 14:49:28.184774175,3917534,T,IEX,54.075000,31
2019-10-07 14:49:28.188794112,2019-10-07 14:49:28.188774347,3917573,T,IEX,54.075000,100
2019-10-07 14:49:30.955150080,2019-10-07 14:49:30.955130939,3919469,T,IEX,54.075000,100
2019-10-07 14:49:30.955580928,2019-10-07 14:49:30.955562619,3919485,T,IEX,54.075000,7
2019-10-07 14:49:30.955612928,2019-10-07 14:49:30.955589231,3919488,T,IEX,54.075000,93
2019-10-07 14:49:30.956299008,2019-10-07 14:49:30.956280611,3919520,T,IEX,54.075000,7
2019-10-07 14:49:31.637325056,2019-10-07 14:49:31.637308542,3920603,T,IEX,54.075000,100
2019-10-07 14:49:47.462607104,2019-10-07 14:49:47.462588812,3928548,T,IEX,54.065000,100
2019-10-07 14:49:51.715574016,2019-10-07 14:49:51.715553175,3930566,T,IEX,54.065000,1
2019-10-07 14:49:59.427680000,2019-10-07 14:49:59.427661099,3933501,T,IEX,54.055000,100
2019-10-07 14:50:41.433075968,2019-10-07 14:50:41.433057274,3966772,T,IEX,54.085000,100
2019-10-07 14:50:42.423973120,2019-10-07 14:50:42.423952634,3967542,T,IEX,54.085000,100
2019-10-07 14:50:49.977442048,2019-10-07 14:50:49.977425284,3972378,T,IEX,54.080000,100
2019-10-07 14:51:23.164493056,2019-10-07 14:51:23.164469622,3997688,T,IEX,54.065000,100
2019-10-07 14:51:57.19052032,2019-10-07 14:51:57.19033498,4011794,T,IEX,54.060000,2
2019-10-07 14:51:57.20024064,2019-10-07 14:51:57.20006007,4011798,T,IEX,54.060000,1
2019-10-07 14:52:01.585268992,2019-10-07 14:52:01.585249184,4014902,T,IEX,54.065000,100
2019-10-07 14:52:10.489883904,2019-10-07 14:52:10.489865626,4022634,T,IEX,54.065000,1
2019-10-07 14:52:30.606276096,2019-10-07 14:52:30.606255489,4035033,T,IEX,54.065000,100
2019-10-07 14:52:50.741978112,2019-10-07 14:52:50.741957462,4048210,T,IEX,54.060000,98
2019-10-07 14:53:02.702860032,2019-10-07 14:53:02.702840793,4056745,T,IEX,54.055000,1
2019-10-07 14:53:10.643778048,2019-10-07 14:53:10.643760290,4062200,T,IEX,54.045000,100
2019-10-07 14:53:40.335009024,2019-10-07 14:53:40.334990643,4078951,T,IEX,54.045000,100
2019-10-07 14:54:05.287676928,2019-10-07 14:54:05.287656455,4091134,T,IEX,54.055000,1
2019-10-07 14:54:08.75777024,2019-10-07 14:54:08.75756380,4093132,T,IEX,54.055000,100
2019-10-07 14:54:23.418789888,2019-10-07 14:54:23.418770514,4104945,T,IEX,54.065000,1
2019-10-07 14:54:41.153363968,2019-10-07 14:54:41.153346075,4117285,T,IEX,54.065000,100
2019-10-07 14:54:48.111873024,2019-10-07 14:54:48.111854980,4120871,T,IEX,54.065000,100
2019-10-07 14:55:09.53473024,2019-10-07 14:55:09.53455666,4135503,T,IEX,54.065000,100
2019-10-07 14:55:09.366679040,2019-10-07 14:55:09.366659890,4135862,T,IEX,54.065000,30
2019-10-07 14:55:09.366704896,2019-10-07 14:55:09.366684983,4135863,T,IEX,54.065000,70
2019-10-07 14:55:13.158758912,2019-10-07 14:55:13.158739465,4139245,T,IEX,54.065000,4
2019-10-07 14:55:15.495446016,2019-10-07 14:55:15.495428847,4141483,T,IEX,54.075000,30
2019-10-07 14:55:18.992013056,2019-10-07 14:55:18.991998294,4146995,T,IEX,54.070000,100
2019-10-07 14:55:34.593841920,2019-10-07 14:55:34.593823184,4162805,T,IEX,54.075000,14
2019-10-07 14:55:34.594448896,2019-10-07 14:55:34.594431522,4162835,T,IEX,54.075000,56
2019-10-07 14:55:34.595422976,2019-10-07 14:55:34.595404492,4162867,T,IEX,54.075000,100
2019-10-07 14:55:51.766439936,2019-10-07 14:55:51.766418122,4184640,T,IEX,54.085000,1
2019-10-07 14:56:12.35632896,2019-10-07 14:56:12.35615770,4201928,T,IEX,54.075000,100
2019-10-07 14:56:12.50599936,2019-10-07 14:56:12.50584857,4201943,T,IEX,54.075000,100
2019-10-07 14:56:15.593920000,2019-10-07 14:56:15.593901266,4205118,T,IEX,54.070000,100
2019-10-07 14:56:15.594031104,2019-10-07 14:56:15.594011088,4205122,T,IEX,54.070000,100
2019-10-07 14:56:15.594521088,2019-10-07 14:56:15.594501373,4205147,T,IEX,54.070000,100
2019-10-07 14:56:25.494936064,2019-10-07 14:56:25.494915648,4214634,T,IEX,54.075000,100
2019-10-07 14:56:34.62706944,2019-10-07 14:56:34.62686935,4221336,T,IEX,54.075000,100
2019-10-07 14:57:21.276552960,2019-10-07 14:57:21.276531469,4250610,T,IEX,54.055000,1
2019-10-07 14:57:24.105988096,2019-10-07 14:57:24.105962219,4252555,T,IEX,54.055000,100
