2019-10-09 13:40:58.635622912,2019-10-09 13:40:58.635605347,775183,T,IEX,263.490000,100
2019-10-09 14:03:07.442706944,2019-10-09 14:03:07.442670779,2047852,T,IEX,262.940000,100
2019-10-09 14:14:02.972421888,2019-10-09 14:14:02.972403089,2611441,T,IEX,263.020000,100
2019-10-09 14:29:19.115520000,2019-10-09 14:29:19.115503824,3238934,T,IEX,263.225000,100
