2019-10-08 13:36:03.537634048,2019-10-08 13:36:03.537616866,556735,T,IEX,48.980000,27
2019-10-08 13:50:07.361963008,2019-10-08 13:50:07.361946328,1435017,T,IEX,48.550000,100
2019-10-08 13:59:16.180192000,2019-10-08 13:59:16.180173715,2059005,T,IEX,48.420000,100
2019-10-08 14:00:07.923004928,2019-10-08 14:00:07.922985400,2105942,T,IEX,48.460000,1000
2019-10-08 14:11:41.693990912,2019-10-08 14:11:41.693972624,3018449,T,IEX,48.180000,100
2019-10-08 14:12:53.547246080,2019-10-08 14:12:53.547226302,3103325,T,IEX,48.210000,100
2019-10-08 14:13:07.77618944,2019-10-08 14:13:07.77592268,3122251,T,IEX,48.270000,144
2019-10-08 14:22:52.625465088,2019-10-08 14:22:52.625443404,3690894,T,IEX,48.385000,100
2019-10-08 14:33:05.929459968,2019-10-08 14:33:05.929436043,4281027,T,IEX,48.290000,1000
2019-10-08 14:34:11.781432064,2019-10-08 14:34:11.781414400,4349628,T,IEX,48.205000,100
2019-10-08 14:34:11.795467008,2019-10-08 14:34:11.795450054,4349732,T,IEX,48.205000,100
2019-10-08 14:34:11.863792896,2019-10-08 14:34:11.863773901,4349901,T,IEX,48.205000,100
2019-10-08 14:43:21.382615040,2019-10-08 14:43:21.382590789,4870842,T,IEX,48.390000,100
2019-10-08 14:55:18.491960064,2019-10-08 14:55:18.491943325,5496846,T,IEX,48.520000,100
2019-10-08 14:58:37.805640960,2019-10-08 14:58:37.805623263,5800448,T,IEX,48.655000,100
2019-10-08 15:00:45.513398016,2019-10-08 15:00:45.513382716,5922303,T,IEX,48.615000,100
2019-10-08 15:00:56.535462912,2019-10-08 15:00:56.535444212,5939590,T,IEX,48.690000,100
2019-10-08 15:05:45.476871936,2019-10-08 15:05:45.476855173,6174260,T,IEX,48.685000,100
2019-10-08 15:05:45.479785984,2019-10-08 15:05:45.479768491,6174269,T,IEX,48.685000,100
2019-10-08 15:05:45.775514880,2019-10-08 15:05:45.775497667,6174514,T,IEX,48.685000,100
2019-10-08 15:08:21.7136000,2019-10-08 15:08:21.7116820,6285224,T,IEX,48.540000,100
2019-10-08 15:27:32.374799104,2019-10-08 15:27:32.374778681,7206596,T,IEX,48.405000,100
2019-10-08 15:27:52.572826880,2019-10-08 15:27:52.572808350,7219165,T,IEX,48.405000,100
2019-10-08 15:27:52.930959104,2019-10-08 15:27:52.930939969,7219568,T,IEX,48.395000,100
2019-10-08 15:27:53.46722048,2019-10-08 15:27:53.46703159,7219657,T,IEX,48.395000,100
2019-10-08 15:27:53.60499968,2019-10-08 15:27:53.60481909,7219684,T,IEX,48.395000,7
2019-10-08 15:27:55.796950016,2019-10-08 15:27:55.796928339,7221061,T,IEX,48.395000,100
2019-10-08 15:27:57.716719104,2019-10-08 15:27:57.716696092,7221894,T,IEX,48.395000,100
2019-10-08 15:33:01.723748096,2019-10-08 15:33:01.723728878,7452206,T,IEX,48.180000,200
2019-10-08 15:38:04.769712128,2019-10-08 15:38:04.769687020,7737760,T,IEX,48.280000,100
2019-10-08 15:39:18.464904960,2019-10-08 15:39:18.464878853,7785958,T,IEX,48.290000,400
2019-10-08 16:31:39.88224000,2019-10-08 16:31:39.88206420,9511905,T,IEX,48.575000,100
2019-10-08 16:40:10.354202880,2019-10-08 16:40:10.354185212,9700463,T,IEX,48.515000,115
2019-10-08 16:40:10.354274048,2019-10-08 16:40:10.354253765,9700469,T,IEX,48.515000,71
2019-10-08 16:50:43.864093952,2019-10-08 16:50:43.864066696,10189787,T,IEX,48.875000,45
2019-10-08 16:55:32.275559936,2019-10-08 16:55:32.275541491,10359516,T,IEX,48.820000,100
2019-10-08 16:56:08.245285888,2019-10-08 16:56:08.245259406,10385535,T,IEX,48.830000,100
2019-10-08 17:51:45.923858944,2019-10-08 17:51:45.923839620,11928688,T,IEX,49.075000,100
2019-10-08 18:01:27.781955072,2019-10-08 18:01:27.781934954,12179855,T,IEX,48.830000,100
2019-10-08 18:01:27.783098112,2019-10-08 18:01:27.783077844,12179856,T,IEX,48.830000,100
2019-10-08 18:01:27.784357120,2019-10-08 18:01:27.784339322,12179858,T,IEX,48.830000,58
2019-10-08 18:01:27.788009984,2019-10-08 18:01:27.787991261,12179859,T,IEX,48.830000,100
2019-10-08 18:28:09.564897024,2019-10-08 18:28:09.564878437,13055155,T,IEX,48.885000,100
2019-10-08 18:30:03.164997120,2019-10-08 18:30:03.164979176,13129513,T,IEX,49.020000,100
2019-10-08 18:30:17.491845888,2019-10-08 18:30:17.491827327,13214531,T,IEX,49.070000,900
2019-10-08 18:50:18.160509952,2019-10-08 18:50:18.160490504,14424878,T,IEX,49.520000,100
2019-10-08 18:50:18.168997120,2019-10-08 18:50:18.168979323,14424994,T,IEX,49.515000,100
2019-10-08 18:50:19.223258880,2019-10-08 18:50:19.223242377,14425869,T,IEX,49.515000,100
2019-10-08 18:50:19.224882944,2019-10-08 18:50:19.224866264,14425877,T,IEX,49.515000,100
2019-10-08 18:50:19.226501888,2019-10-08 18:50:19.226482064,14425878,T,IEX,49.515000,100
2019-10-08 18:50:19.726317056,2019-10-08 18:50:19.726302014,14426098,T,IEX,49.515000,100
2019-10-08 18:50:21.535706112,2019-10-08 18:50:21.535685840,14427424,T,IEX,49.515000,100
2019-10-08 18:50:22.810430976,2019-10-08 18:50:22.810413894,14428371,T,IEX,49.515000,100
2019-10-08 18:57:34.500510976,2019-10-08 18:57:34.500492944,14735977,T,IEX,48.600000,100
2019-10-08 18:57:36.745989120,2019-10-08 18:57:36.745969583,14755405,T,IEX,48.620000,66
2019-10-08 18:58:34.697046016,2019-10-08 18:58:34.697026604,15028019,T,IEX,48.670000,1000
2019-10-08 18:59:09.75965952,2019-10-08 18:59:09.75945518,15132609,T,IEX,48.810000,1000
2019-10-08 18:59:12.102582016,2019-10-08 18:59:12.102563182,15141829,T,IEX,48.810000,1000
2019-10-08 19:04:58.852347904,2019-10-08 19:04:58.852329461,15647010,T,IEX,48.700000,100
2019-10-08 19:05:03.568225024,2019-10-08 19:05:03.568209712,15652902,T,IEX,48.720000,75
2019-10-08 19:05:03.568332032,2019-10-08 19:05:03.568312448,15652905,T,IEX,48.720000,25
2019-10-08 19:05:34.176227072,2019-10-08 19:05:34.176209000,15688635,T,IEX,48.845000,100
2019-10-08 19:08:06.677735936,2019-10-08 19:08:06.677717819,15856247,T,IEX,48.705000,100
2019-10-08 19:09:31.757728000,2019-10-08 19:09:31.757708329,15936036,T,IEX,48.710000,100
2019-10-08 19:10:29.949542912,2019-10-08 19:10:29.949525742,15983633,T,IEX,48.610000,100
2019-10-08 19:42:46.129854976,2019-10-08 19:42:46.129836046,17532981,T,IEX,48.165000,100
2019-10-08 19:52:48.402822912,2019-10-08 19:52:48.402803186,18190696,T,IEX,48.100000,29
2019-10-08 19:53:51.691439104,2019-10-08 19:53:51.691421211,18252962,T,IEX,48.100000,3
2019-10-08 19:54:09.218380032,2019-10-08 19:54:09.218365356,18271267,T,IEX,48.075000,8
2019-10-08 19:54:24.659808000,2019-10-08 19:54:24.659790498,18288163,T,IEX,48.090000,22
2019-10-08 19:54:40.363272960,2019-10-08 19:54:40.363255346,18304787,T,IEX,48.075000,9
2019-10-08 19:54:40.363290112,2019-10-08 19:54:40.363275043,18304788,T,IEX,48.075000,11
2019-10-08 19:55:00.96975872,2019-10-08 19:55:00.96957130,18333673,T,IEX,48.020000,200
2019-10-08 19:55:00.128295936,2019-10-08 19:55:00.128276609,18334323,T,IEX,48.010000,400
2019-10-08 19:55:24.709811968,2019-10-08 19:55:24.709794318,18389112,T,IEX,48.000000,32
2019-10-08 19:55:32.487691008,2019-10-08 19:55:32.487674303,18398363,T,IEX,48.005000,100
2019-10-08 19:55:32.537142016,2019-10-08 19:55:32.537125009,18398544,T,IEX,48.000000,100
2019-10-08 19:55:52.35727104,2019-10-08 19:55:52.35706722,18423753,T,IEX,47.950000,17
2019-10-08 19:56:11.385605888,2019-10-08 19:56:11.385585684,18452967,T,IEX,47.965000,9
2019-10-08 19:56:13.690488064,2019-10-08 19:56:13.690463302,18456175,T,IEX,47.960000,39
2019-10-08 19:56:13.690503936,2019-10-08 19:56:13.690485985,18456177,T,IEX,47.960000,11
2019-10-08 19:56:39.251464960,2019-10-08 19:56:39.251450072,18490298,T,IEX,47.905000,9
2019-10-08 19:56:39.262337024,2019-10-08 19:56:39.262317885,18490309,T,IEX,47.900000,21
2019-10-08 19:58:01.5662976,2019-10-08 19:58:01.5643189,18604447,T,IEX,47.890000,13
2019-10-08 19:58:35.135533056,2019-10-08 19:58:35.135513650,18669335,T,IEX,47.950000,100
2019-10-08 19:58:55.706168064,2019-10-08 19:58:55.706148556,18706718,T,IEX,47.990000,12
