PCBNEW-LibModule-V1  2024-02-20 20:12:59
# encoding utf-8
Units mm
$INDEX
OS202011MS2QN1
$EndINDEX
$MODULE OS202011MS2QN1
Po 0 0 0 15 65d507cb 00000000 ~~
Li OS202011MS2QN1
Cd OS202011MS2QN1-2
Kw Switch
Sc 0
At STD
AR 
Op 0 0 0
T0 2.000 1.25 1.27 1.27 0 0.254 N V 21 N "S**"
T1 2.000 1.25 1.27 1.27 0 0.254 N I 21 N "OS202011MS2QN1"
DS -2.3 -2.15 6.3 -2.15 0.1 24
DS 6.3 -2.15 6.3 4.65 0.1 24
DS 6.3 4.65 -2.3 4.65 0.1 24
DS -2.3 4.65 -2.3 -2.15 0.1 24
DS -4.225 -3.15 8.225 -3.15 0.1 24
DS 8.225 -3.15 8.225 5.65 0.1 24
DS 8.225 5.65 -4.225 5.65 0.1 24
DS -4.225 5.65 -4.225 -3.15 0.1 24
DS -2.3 -0.35 -2.3 -2.15 0.2 21
DS -2.3 -2.15 6.3 -2.15 0.2 21
DS 6.3 -2.15 6.3 -0.35 0.2 21
DS 6.3 2.85 6.3 4.65 0.2 21
DS 6.3 4.65 -2.3 4.65 0.2 21
DS -2.3 4.65 -2.3 2.85 0.2 21
DS 0 -2.6 0 -2.6 0.1 21
DS 0 -2.7 0 -2.7 0.1 21
DA 4.1633363423443E-17 -2.65 0.000 -2.6 -1800 0.1 21
DA 4.1633363423443E-17 -2.65 0.000 -2.7 -1800 0.1 21
$PAD
Po 0.000 -0
Sh "1" R 1.300 1.300 0 0 900
Dr 0.8 0 0
At STD N 00E0FFFF
Ne 0 ""
$EndPAD
$PAD
Po 2.000 -0
Sh "2" C 1.300 1.300 0 0 900
Dr 0.8 0 0
At STD N 00E0FFFF
Ne 0 ""
$EndPAD
$PAD
Po 4.000 -0
Sh "3" C 1.300 1.300 0 0 900
Dr 0.8 0 0
At STD N 00E0FFFF
Ne 0 ""
$EndPAD
$PAD
Po 0.000 2.5
Sh "4" C 1.300 1.300 0 0 900
Dr 0.8 0 0
At STD N 00E0FFFF
Ne 0 ""
$EndPAD
$PAD
Po 2.000 2.5
Sh "5" C 1.300 1.300 0 0 900
Dr 0.8 0 0
At STD N 00E0FFFF
Ne 0 ""
$EndPAD
$PAD
Po 4.000 2.5
Sh "6" C 1.300 1.300 0 0 900
Dr 0.8 0 0
At STD N 00E0FFFF
Ne 0 ""
$EndPAD
$PAD
Po -2.100 1.25
Sh "MH1" C 2.250 2.250 0 0 900
Dr 1.5 0 0
At STD N 00E0FFFF
Ne 0 ""
$EndPAD
$PAD
Po 6.100 1.25
Sh "MH2" C 2.250 2.250 0 0 900
Dr 1.5 0 0
At STD N 00E0FFFF
Ne 0 ""
$EndPAD
$EndMODULE OS202011MS2QN1
$EndLIBRARY
