(kicad_symbol_lib (version 20220914) (generator kicad_symbol_editor)
  (symbol "SS-90000-003" (in_bom yes) (on_board yes)
    (property "Reference" "J" (at 16.51 7.62 0)
      (effects (font (size 1.27 1.27)) (justify left top))
    )
    (property "Value" "SS-90000-003" (at 16.51 5.08 0)
      (effects (font (size 1.27 1.27)) (justify left top))
    )
    (property "Footprint" "SS90000003" (at 16.51 -94.92 0)
      (effects (font (size 1.27 1.27)) (justify left top) hide)
    )
    (property "Datasheet" "https://belfuse.com/resources/drawings/stewartconnector/dr-STW-SS-90000-003.pdf" (at 16.51 -194.92 0)
      (effects (font (size 1.27 1.27)) (justify left top) hide)
    )
    (property "Height" "12.7" (at 16.51 -394.92 0)
      (effects (font (size 1.27 1.27)) (justify left top) hide)
    )
    (property "Mouser Part Number" "530-SS-90000-003" (at 16.51 -494.92 0)
      (effects (font (size 1.27 1.27)) (justify left top) hide)
    )
    (property "Mouser Price/Stock" "https://www.mouser.co.uk/ProductDetail/Stewart-Connector-Bel/SS-90000-003?qs=QNEnbhJQKvZaQ5Cj8yFkoQ%3D%3D" (at 16.51 -594.92 0)
      (effects (font (size 1.27 1.27)) (justify left top) hide)
    )
    (property "Manufacturer_Name" "BelFuse" (at 16.51 -694.92 0)
      (effects (font (size 1.27 1.27)) (justify left top) hide)
    )
    (property "Manufacturer_Part_Number" "SS-90000-003" (at 16.51 -794.92 0)
      (effects (font (size 1.27 1.27)) (justify left top) hide)
    )
    (property "ki_description" "Modular Connectors / Ethernet Connectors RJ45 jack ,6P6C unshld horizontal" (at 0 0 0)
      (effects (font (size 1.27 1.27)) hide)
    )
    (symbol "SS-90000-003_1_1"
      (rectangle (start 5.08 2.54) (end 15.24 -7.62)
        (stroke (width 0.254) (type default))
        (fill (type background))
      )
      (pin passive line (at 20.32 0 180) (length 5.08)
        (name "1" (effects (font (size 1.27 1.27))))
        (number "1" (effects (font (size 1.27 1.27))))
      )
      (pin passive line (at 0 0 0) (length 5.08)
        (name "2" (effects (font (size 1.27 1.27))))
        (number "2" (effects (font (size 1.27 1.27))))
      )
      (pin passive line (at 20.32 -2.54 180) (length 5.08)
        (name "3" (effects (font (size 1.27 1.27))))
        (number "3" (effects (font (size 1.27 1.27))))
      )
      (pin passive line (at 0 -2.54 0) (length 5.08)
        (name "4" (effects (font (size 1.27 1.27))))
        (number "4" (effects (font (size 1.27 1.27))))
      )
      (pin passive line (at 20.32 -5.08 180) (length 5.08)
        (name "5" (effects (font (size 1.27 1.27))))
        (number "5" (effects (font (size 1.27 1.27))))
      )
      (pin passive line (at 0 -5.08 0) (length 5.08)
        (name "6" (effects (font (size 1.27 1.27))))
        (number "6" (effects (font (size 1.27 1.27))))
      )
    )
  )
  (symbol "TMP1075DSGR" (in_bom yes) (on_board yes)
    (property "Reference" "IC" (at 26.67 7.62 0)
      (effects (font (size 1.27 1.27)) (justify left top))
    )
    (property "Value" "TMP1075DSGR" (at 26.67 5.08 0)
      (effects (font (size 1.27 1.27)) (justify left top))
    )
    (property "Footprint" "SON50P200X200X80-9N" (at 26.67 -94.92 0)
      (effects (font (size 1.27 1.27)) (justify left top) hide)
    )
    (property "Datasheet" "http://www.ti.com/lit/ds/symlink/tmp1075.pdf" (at 26.67 -194.92 0)
      (effects (font (size 1.27 1.27)) (justify left top) hide)
    )
    (property "Height" "0.8" (at 26.67 -394.92 0)
      (effects (font (size 1.27 1.27)) (justify left top) hide)
    )
    (property "Mouser Part Number" "595-TMP1075DSGR" (at 26.67 -494.92 0)
      (effects (font (size 1.27 1.27)) (justify left top) hide)
    )
    (property "Mouser Price/Stock" "https://www.mouser.co.uk/ProductDetail/Texas-Instruments/TMP1075DSGR?qs=gZXFycFWdAOidBdJW42bRw%3D%3D" (at 26.67 -594.92 0)
      (effects (font (size 1.27 1.27)) (justify left top) hide)
    )
    (property "Manufacturer_Name" "Texas Instruments" (at 26.67 -694.92 0)
      (effects (font (size 1.27 1.27)) (justify left top) hide)
    )
    (property "Manufacturer_Part_Number" "TMP1075DSGR" (at 26.67 -794.92 0)
      (effects (font (size 1.27 1.27)) (justify left top) hide)
    )
    (property "ki_description" "High-accuracy upgrade to industry standard LM75 / TMP75 I2C temperature sensor" (at 0 0 0)
      (effects (font (size 1.27 1.27)) hide)
    )
    (symbol "TMP1075DSGR_1_1"
      (rectangle (start 5.08 2.54) (end 25.4 -15.24)
        (stroke (width 0.254) (type default))
        (fill (type background))
      )
      (pin passive line (at 0 0 0) (length 5.08)
        (name "SDA" (effects (font (size 1.27 1.27))))
        (number "1" (effects (font (size 1.27 1.27))))
      )
      (pin passive line (at 0 -2.54 0) (length 5.08)
        (name "SCL" (effects (font (size 1.27 1.27))))
        (number "2" (effects (font (size 1.27 1.27))))
      )
      (pin passive line (at 0 -5.08 0) (length 5.08)
        (name "ALERT" (effects (font (size 1.27 1.27))))
        (number "3" (effects (font (size 1.27 1.27))))
      )
      (pin passive line (at 0 -7.62 0) (length 5.08)
        (name "GND" (effects (font (size 1.27 1.27))))
        (number "4" (effects (font (size 1.27 1.27))))
      )
      (pin passive line (at 30.48 -7.62 180) (length 5.08)
        (name "A2" (effects (font (size 1.27 1.27))))
        (number "5" (effects (font (size 1.27 1.27))))
      )
      (pin passive line (at 30.48 -5.08 180) (length 5.08)
        (name "A1" (effects (font (size 1.27 1.27))))
        (number "6" (effects (font (size 1.27 1.27))))
      )
      (pin passive line (at 30.48 -2.54 180) (length 5.08)
        (name "A0" (effects (font (size 1.27 1.27))))
        (number "7" (effects (font (size 1.27 1.27))))
      )
      (pin passive line (at 30.48 0 180) (length 5.08)
        (name "V+" (effects (font (size 1.27 1.27))))
        (number "8" (effects (font (size 1.27 1.27))))
      )
      (pin passive line (at 15.24 -20.32 90) (length 5.08)
        (name "EP" (effects (font (size 1.27 1.27))))
        (number "9" (effects (font (size 1.27 1.27))))
      )
    )
  )
)
