PCBNEW-LibModule-V1  2024-02-19 20:12:14
# encoding utf-8
Units mm
$INDEX
SOIC127P600X175-9N
$EndINDEX
$MODULE SOIC127P600X175-9N
Po 0 0 0 15 65d3b61e 00000000 ~~
Li SOIC127P600X175-9N
Cd 8-Lead SOP (Exposed Pad)_2023
Kw Integrated Circuit
Sc 0
At SMD
AR 
Op 0 0 0
T0 0 0 1.27 1.27 0 0.254 N V 21 N "IC**"
T1 0 0 1.27 1.27 0 0.254 N I 21 N "SOIC127P600X175-9N"
DS -3.725 -2.752 3.725 -2.752 0.05 24
DS 3.725 -2.752 3.725 2.752 0.05 24
DS 3.725 2.752 -3.725 2.752 0.05 24
DS -3.725 2.752 -3.725 -2.752 0.05 24
DS -1.952 -2.451 1.952 -2.451 0.1 24
DS 1.952 -2.451 1.952 2.451 0.1 24
DS 1.952 2.451 -1.952 2.451 0.1 24
DS -1.952 2.451 -1.952 -2.451 0.1 24
DS -1.952 -1.181 -0.682 -2.451 0.1 24
DS -3.475 -2.605 -1.952 -2.605 0.2 21
$PAD
Po -2.714 -1.905
Sh "1" R 0.7 1.522 0 0 900
At SMD N 00888000
Ne 0 ""
$EndPAD
$PAD
Po -2.714 -0.635
Sh "2" R 0.7 1.522 0 0 900
At SMD N 00888000
Ne 0 ""
$EndPAD
$PAD
Po -2.714 0.635
Sh "3" R 0.7 1.522 0 0 900
At SMD N 00888000
Ne 0 ""
$EndPAD
$PAD
Po -2.714 1.905
Sh "4" R 0.7 1.522 0 0 900
At SMD N 00888000
Ne 0 ""
$EndPAD
$PAD
Po 2.714 1.905
Sh "5" R 0.7 1.522 0 0 900
At SMD N 00888000
Ne 0 ""
$EndPAD
$PAD
Po 2.714 0.635
Sh "6" R 0.7 1.522 0 0 900
At SMD N 00888000
Ne 0 ""
$EndPAD
$PAD
Po 2.714 -0.635
Sh "7" R 0.7 1.522 0 0 900
At SMD N 00888000
Ne 0 ""
$EndPAD
$PAD
Po 2.714 -1.905
Sh "8" R 0.7 1.522 0 0 900
At SMD N 00888000
Ne 0 ""
$EndPAD
$PAD
Po 0 0
Sh "9" R 2.3 2.3 0 0 0
At SMD N 00888000
Ne 0 ""
$EndPAD
$EndMODULE SOIC127P600X175-9N
$EndLIBRARY
