(kicad_sch (version 20230121) (generator eeschema)

  (uuid 48a9dbf4-87b6-45a0-9b0c-210d88a1ee46)

  (paper "A4")

  (lib_symbols
    (symbol "Mechanical:MountingHole" (pin_names (offset 1.016)) (in_bom yes) (on_board yes)
      (property "Reference" "H" (at 0 5.08 0)
        (effects (font (size 1.27 1.27)))
      )
      (property "Value" "MountingHole" (at 0 3.175 0)
        (effects (font (size 1.27 1.27)))
      )
      (property "Footprint" "" (at 0 0 0)
        (effects (font (size 1.27 1.27)) hide)
      )
      (property "Datasheet" "~" (at 0 0 0)
        (effects (font (size 1.27 1.27)) hide)
      )
      (property "ki_keywords" "mounting hole" (at 0 0 0)
        (effects (font (size 1.27 1.27)) hide)
      )
      (property "ki_description" "Mounting Hole without connection" (at 0 0 0)
        (effects (font (size 1.27 1.27)) hide)
      )
      (property "ki_fp_filters" "MountingHole*" (at 0 0 0)
        (effects (font (size 1.27 1.27)) hide)
      )
      (symbol "MountingHole_0_1"
        (circle (center 0 0) (radius 1.27)
          (stroke (width 1.27) (type default))
          (fill (type none))
        )
      )
    )
    (symbol "power:+12V" (power) (pin_names (offset 0)) (in_bom yes) (on_board yes)
      (property "Reference" "#PWR" (at 0 -3.81 0)
        (effects (font (size 1.27 1.27)) hide)
      )
      (property "Value" "+12V" (at 0 3.556 0)
        (effects (font (size 1.27 1.27)))
      )
      (property "Footprint" "" (at 0 0 0)
        (effects (font (size 1.27 1.27)) hide)
      )
      (property "Datasheet" "" (at 0 0 0)
        (effects (font (size 1.27 1.27)) hide)
      )
      (property "ki_keywords" "global power" (at 0 0 0)
        (effects (font (size 1.27 1.27)) hide)
      )
      (property "ki_description" "Power symbol creates a global label with name \"+12V\"" (at 0 0 0)
        (effects (font (size 1.27 1.27)) hide)
      )
      (symbol "+12V_0_1"
        (polyline
          (pts
            (xy -0.762 1.27)
            (xy 0 2.54)
          )
          (stroke (width 0) (type default))
          (fill (type none))
        )
        (polyline
          (pts
            (xy 0 0)
            (xy 0 2.54)
          )
          (stroke (width 0) (type default))
          (fill (type none))
        )
        (polyline
          (pts
            (xy 0 2.54)
            (xy 0.762 1.27)
          )
          (stroke (width 0) (type default))
          (fill (type none))
        )
      )
      (symbol "+12V_1_1"
        (pin power_in line (at 0 0 90) (length 0) hide
          (name "+12V" (effects (font (size 1.27 1.27))))
          (number "1" (effects (font (size 1.27 1.27))))
        )
      )
    )
    (symbol "power:+24V" (power) (pin_names (offset 0)) (in_bom yes) (on_board yes)
      (property "Reference" "#PWR" (at 0 -3.81 0)
        (effects (font (size 1.27 1.27)) hide)
      )
      (property "Value" "+24V" (at 0 3.556 0)
        (effects (font (size 1.27 1.27)))
      )
      (property "Footprint" "" (at 0 0 0)
        (effects (font (size 1.27 1.27)) hide)
      )
      (property "Datasheet" "" (at 0 0 0)
        (effects (font (size 1.27 1.27)) hide)
      )
      (property "ki_keywords" "global power" (at 0 0 0)
        (effects (font (size 1.27 1.27)) hide)
      )
      (property "ki_description" "Power symbol creates a global label with name \"+24V\"" (at 0 0 0)
        (effects (font (size 1.27 1.27)) hide)
      )
      (symbol "+24V_0_1"
        (polyline
          (pts
            (xy -0.762 1.27)
            (xy 0 2.54)
          )
          (stroke (width 0) (type default))
          (fill (type none))
        )
        (polyline
          (pts
            (xy 0 0)
            (xy 0 2.54)
          )
          (stroke (width 0) (type default))
          (fill (type none))
        )
        (polyline
          (pts
            (xy 0 2.54)
            (xy 0.762 1.27)
          )
          (stroke (width 0) (type default))
          (fill (type none))
        )
      )
      (symbol "+24V_1_1"
        (pin power_in line (at 0 0 90) (length 0) hide
          (name "+24V" (effects (font (size 1.27 1.27))))
          (number "1" (effects (font (size 1.27 1.27))))
        )
      )
    )
    (symbol "power:+3.3V" (power) (pin_names (offset 0)) (in_bom yes) (on_board yes)
      (property "Reference" "#PWR" (at 0 -3.81 0)
        (effects (font (size 1.27 1.27)) hide)
      )
      (property "Value" "+3.3V" (at 0 3.556 0)
        (effects (font (size 1.27 1.27)))
      )
      (property "Footprint" "" (at 0 0 0)
        (effects (font (size 1.27 1.27)) hide)
      )
      (property "Datasheet" "" (at 0 0 0)
        (effects (font (size 1.27 1.27)) hide)
      )
      (property "ki_keywords" "global power" (at 0 0 0)
        (effects (font (size 1.27 1.27)) hide)
      )
      (property "ki_description" "Power symbol creates a global label with name \"+3.3V\"" (at 0 0 0)
        (effects (font (size 1.27 1.27)) hide)
      )
      (symbol "+3.3V_0_1"
        (polyline
          (pts
            (xy -0.762 1.27)
            (xy 0 2.54)
          )
          (stroke (width 0) (type default))
          (fill (type none))
        )
        (polyline
          (pts
            (xy 0 0)
            (xy 0 2.54)
          )
          (stroke (width 0) (type default))
          (fill (type none))
        )
        (polyline
          (pts
            (xy 0 2.54)
            (xy 0.762 1.27)
          )
          (stroke (width 0) (type default))
          (fill (type none))
        )
      )
      (symbol "+3.3V_1_1"
        (pin power_in line (at 0 0 90) (length 0) hide
          (name "+3.3V" (effects (font (size 1.27 1.27))))
          (number "1" (effects (font (size 1.27 1.27))))
        )
      )
    )
    (symbol "power:+5V" (power) (pin_names (offset 0)) (in_bom yes) (on_board yes)
      (property "Reference" "#PWR" (at 0 -3.81 0)
        (effects (font (size 1.27 1.27)) hide)
      )
      (property "Value" "+5V" (at 0 3.556 0)
        (effects (font (size 1.27 1.27)))
      )
      (property "Footprint" "" (at 0 0 0)
        (effects (font (size 1.27 1.27)) hide)
      )
      (property "Datasheet" "" (at 0 0 0)
        (effects (font (size 1.27 1.27)) hide)
      )
      (property "ki_keywords" "global power" (at 0 0 0)
        (effects (font (size 1.27 1.27)) hide)
      )
      (property "ki_description" "Power symbol creates a global label with name \"+5V\"" (at 0 0 0)
        (effects (font (size 1.27 1.27)) hide)
      )
      (symbol "+5V_0_1"
        (polyline
          (pts
            (xy -0.762 1.27)
            (xy 0 2.54)
          )
          (stroke (width 0) (type default))
          (fill (type none))
        )
        (polyline
          (pts
            (xy 0 0)
            (xy 0 2.54)
          )
          (stroke (width 0) (type default))
          (fill (type none))
        )
        (polyline
          (pts
            (xy 0 2.54)
            (xy 0.762 1.27)
          )
          (stroke (width 0) (type default))
          (fill (type none))
        )
      )
      (symbol "+5V_1_1"
        (pin power_in line (at 0 0 90) (length 0) hide
          (name "+5V" (effects (font (size 1.27 1.27))))
          (number "1" (effects (font (size 1.27 1.27))))
        )
      )
    )
    (symbol "power:GND" (power) (pin_names (offset 0)) (in_bom yes) (on_board yes)
      (property "Reference" "#PWR" (at 0 -6.35 0)
        (effects (font (size 1.27 1.27)) hide)
      )
      (property "Value" "GND" (at 0 -3.81 0)
        (effects (font (size 1.27 1.27)))
      )
      (property "Footprint" "" (at 0 0 0)
        (effects (font (size 1.27 1.27)) hide)
      )
      (property "Datasheet" "" (at 0 0 0)
        (effects (font (size 1.27 1.27)) hide)
      )
      (property "ki_keywords" "global power" (at 0 0 0)
        (effects (font (size 1.27 1.27)) hide)
      )
      (property "ki_description" "Power symbol creates a global label with name \"GND\" , ground" (at 0 0 0)
        (effects (font (size 1.27 1.27)) hide)
      )
      (symbol "GND_0_1"
        (polyline
          (pts
            (xy 0 0)
            (xy 0 -1.27)
            (xy 1.27 -1.27)
            (xy 0 -2.54)
            (xy -1.27 -1.27)
            (xy 0 -1.27)
          )
          (stroke (width 0) (type default))
          (fill (type none))
        )
      )
      (symbol "GND_1_1"
        (pin power_in line (at 0 0 270) (length 0) hide
          (name "GND" (effects (font (size 1.27 1.27))))
          (number "1" (effects (font (size 1.27 1.27))))
        )
      )
    )
  )

  (junction (at 166.878 120.904) (diameter 0) (color 0 0 0 0)
    (uuid 045af6c3-d858-4a72-8d9a-ad35f7cb2420)
  )
  (junction (at 166.878 113.665) (diameter 0) (color 0 0 0 0)
    (uuid 1f98bd97-6043-4524-9f97-ab8cc4d3cd5f)
  )
  (junction (at 165.481 130.81) (diameter 0) (color 0 0 0 0)
    (uuid 4d76b6e7-af6a-459e-a7f7-b36396f068ac)
  )
  (junction (at 165.481 122.936) (diameter 0) (color 0 0 0 0)
    (uuid 7b1ed400-8826-4f8d-8628-eabb8691461b)
  )
  (junction (at 166.878 128.778) (diameter 0) (color 0 0 0 0)
    (uuid d155b077-a201-412e-baba-550f6baaf816)
  )
  (junction (at 165.481 115.57) (diameter 0) (color 0 0 0 0)
    (uuid ee6609be-8df8-4dad-868a-4a9c76fbd0d0)
  )

  (wire (pts (xy 168.91 138.176) (xy 165.481 138.176))
    (stroke (width 0) (type default))
    (uuid 008c02dc-d3ed-4d93-899a-419e485f4c0d)
  )
  (wire (pts (xy 185.42 62.23) (xy 185.42 69.85))
    (stroke (width 0) (type default))
    (uuid 01af316b-034a-42af-9c77-061f0c8dc781)
  )
  (wire (pts (xy 165.481 130.81) (xy 165.481 138.176))
    (stroke (width 0) (type default))
    (uuid 08470213-6978-47c8-b5cc-f14aa493f171)
  )
  (wire (pts (xy 168.91 128.778) (xy 166.878 128.778))
    (stroke (width 0) (type default))
    (uuid 156da0f6-be8e-4f87-b0da-76a356e135c1)
  )
  (wire (pts (xy 219.71 68.58) (xy 224.79 68.58))
    (stroke (width 0) (type default))
    (uuid 16c6792a-4039-41d0-88bc-a75400f3b786)
  )
  (wire (pts (xy 129.54 128.905) (xy 138.43 128.905))
    (stroke (width 0) (type default))
    (uuid 29e083ce-7096-4b7b-8768-57ac0ccb806c)
  )
  (wire (pts (xy 165.481 122.936) (xy 165.481 130.81))
    (stroke (width 0) (type default))
    (uuid 2b15e212-2d05-4133-a611-6e124f07063c)
  )
  (wire (pts (xy 129.54 90.805) (xy 138.43 90.805))
    (stroke (width 0) (type default))
    (uuid 2d1ebb20-8553-4625-a754-4f9a356a8c69)
  )
  (wire (pts (xy 190.5 62.23) (xy 190.5 67.31))
    (stroke (width 0) (type default))
    (uuid 2dfdfd12-ef9b-4860-96bb-723ffeaad365)
  )
  (wire (pts (xy 129.54 83.185) (xy 138.43 83.185))
    (stroke (width 0) (type default))
    (uuid 315dbb77-1685-4e28-bb2a-681a56fb200d)
  )
  (wire (pts (xy 163.83 113.665) (xy 166.878 113.665))
    (stroke (width 0) (type default))
    (uuid 31ac0cd3-59f6-4aec-a870-d50c66a5583c)
  )
  (wire (pts (xy 129.54 108.585) (xy 138.43 108.585))
    (stroke (width 0) (type default))
    (uuid 3efdee7a-2ad9-4e99-8b2f-c9afb3424e50)
  )
  (wire (pts (xy 129.54 103.505) (xy 138.43 103.505))
    (stroke (width 0) (type default))
    (uuid 426d14d1-5eeb-4a46-96c6-ef74da1e85a6)
  )
  (wire (pts (xy 129.54 69.215) (xy 138.43 69.215))
    (stroke (width 0) (type default))
    (uuid 44f32346-1720-4910-b567-28c3894093c3)
  )
  (wire (pts (xy 129.54 93.345) (xy 138.43 93.345))
    (stroke (width 0) (type default))
    (uuid 458d8088-5396-47af-8f1e-f6ccc66cf711)
  )
  (wire (pts (xy 129.54 123.825) (xy 138.43 123.825))
    (stroke (width 0) (type default))
    (uuid 5a21268f-d586-4c5a-983e-a11fc8f84564)
  )
  (wire (pts (xy 163.83 124.968) (xy 168.91 124.968))
    (stroke (width 0) (type default))
    (uuid 5a8e1a7e-b931-4bdc-b4e5-f595da0f337b)
  )
  (wire (pts (xy 129.54 131.445) (xy 138.43 131.445))
    (stroke (width 0) (type default))
    (uuid 5d79fe83-b853-49fa-be5f-55cd55e8da74)
  )
  (wire (pts (xy 163.83 109.728) (xy 168.91 109.728))
    (stroke (width 0) (type default))
    (uuid 62171b9c-13df-49d1-b3b2-063fe8ea6ab0)
  )
  (wire (pts (xy 165.481 130.81) (xy 168.91 130.81))
    (stroke (width 0) (type default))
    (uuid 62dbffc9-ba57-454b-b8d3-d256833eb5e7)
  )
  (wire (pts (xy 129.54 100.965) (xy 138.43 100.965))
    (stroke (width 0) (type default))
    (uuid 659337a1-9774-4baa-80ac-065d900f01ce)
  )
  (wire (pts (xy 129.54 98.425) (xy 138.43 98.425))
    (stroke (width 0) (type default))
    (uuid 6b1f6870-1493-460f-8691-3875096ee14c)
  )
  (wire (pts (xy 129.54 95.885) (xy 138.43 95.885))
    (stroke (width 0) (type default))
    (uuid 6c2ca999-d398-4bd6-b31d-d6e739269686)
  )
  (wire (pts (xy 163.83 132.842) (xy 168.91 132.842))
    (stroke (width 0) (type default))
    (uuid 6eb0ee78-06de-4902-b95c-0d04641a9010)
  )
  (wire (pts (xy 129.54 111.125) (xy 138.43 111.125))
    (stroke (width 0) (type default))
    (uuid 761c2441-92cc-4f5a-9f93-0ce61ffe463e)
  )
  (wire (pts (xy 129.54 88.265) (xy 138.43 88.265))
    (stroke (width 0) (type default))
    (uuid 7c571f97-5f34-4481-8c62-f630f3810b56)
  )
  (wire (pts (xy 165.481 115.57) (xy 168.91 115.57))
    (stroke (width 0) (type default))
    (uuid 7d914931-74fb-4ed4-a7e5-b2835365bee7)
  )
  (wire (pts (xy 166.878 120.904) (xy 166.878 113.665))
    (stroke (width 0) (type default))
    (uuid 7f4ca59c-6d0f-4a24-a536-22858b2c249e)
  )
  (wire (pts (xy 165.481 115.57) (xy 165.481 122.936))
    (stroke (width 0) (type default))
    (uuid 80b7373f-440a-426f-8b95-8a6ab30dfaf7)
  )
  (wire (pts (xy 190.5 67.31) (xy 199.39 67.31))
    (stroke (width 0) (type default))
    (uuid 83e20df1-495a-4a8c-8899-b46db2cd6d9e)
  )
  (wire (pts (xy 166.878 128.778) (xy 166.878 120.904))
    (stroke (width 0) (type default))
    (uuid 8b9ffbb9-93bb-424c-986e-7ff0fd8678d3)
  )
  (wire (pts (xy 166.878 136.144) (xy 166.878 128.778))
    (stroke (width 0) (type default))
    (uuid 968c61c4-e425-4d0e-b6b2-0b81989c9ebf)
  )
  (wire (pts (xy 129.54 118.745) (xy 138.43 118.745))
    (stroke (width 0) (type default))
    (uuid 97147884-2d13-4b99-8042-51153ac5a4d4)
  )
  (wire (pts (xy 163.83 93.345) (xy 168.91 93.345))
    (stroke (width 0) (type default))
    (uuid 976b61aa-1b4e-4013-82c1-a539f3b03815)
  )
  (wire (pts (xy 129.54 133.985) (xy 138.43 133.985))
    (stroke (width 0) (type default))
    (uuid 978dc917-3781-49a6-a6fc-64f7f668ba16)
  )
  (wire (pts (xy 163.83 140.208) (xy 168.91 140.208))
    (stroke (width 0) (type default))
    (uuid 9dc25fcb-3b73-4086-98d4-b4bb435b596c)
  )
  (wire (pts (xy 179.07 62.23) (xy 179.07 72.39))
    (stroke (width 0) (type default))
    (uuid 9e13166e-d71e-4ca0-92d3-a740c86c0aaf)
  )
  (wire (pts (xy 163.83 90.805) (xy 168.91 90.805))
    (stroke (width 0) (type default))
    (uuid 9f46f76d-e08d-4b3e-a060-0a69f88651e2)
  )
  (wire (pts (xy 129.54 136.525) (xy 138.43 136.525))
    (stroke (width 0) (type default))
    (uuid a14785fc-b789-4f4f-9c00-7ec417bd1f4f)
  )
  (wire (pts (xy 163.83 95.885) (xy 168.91 95.885))
    (stroke (width 0) (type default))
    (uuid a54f9b43-e8fa-49a1-884e-1efaf1293b14)
  )
  (wire (pts (xy 129.54 85.725) (xy 138.43 85.725))
    (stroke (width 0) (type default))
    (uuid b487e2f6-3ffc-4b54-b234-baccb9a138a3)
  )
  (wire (pts (xy 129.54 121.285) (xy 138.43 121.285))
    (stroke (width 0) (type default))
    (uuid b4da367f-3f2f-41d0-a87a-f1b2db00b4e5)
  )
  (wire (pts (xy 179.07 72.39) (xy 199.39 72.39))
    (stroke (width 0) (type default))
    (uuid ccc0096c-24d1-4380-ab60-7e774bb2db86)
  )
  (wire (pts (xy 163.83 88.265) (xy 168.91 88.265))
    (stroke (width 0) (type default))
    (uuid cebad90e-37e1-434f-828a-7414083efef5)
  )
  (wire (pts (xy 129.54 126.365) (xy 138.43 126.365))
    (stroke (width 0) (type default))
    (uuid cfaf0155-012c-4e89-b70e-c996982760b8)
  )
  (wire (pts (xy 166.878 113.665) (xy 168.91 113.665))
    (stroke (width 0) (type default))
    (uuid d3befcba-9137-4286-8a8f-0cac16cc1eab)
  )
  (wire (pts (xy 168.91 136.144) (xy 166.878 136.144))
    (stroke (width 0) (type default))
    (uuid d49d176b-ee4f-40dc-a266-3182c956e9e2)
  )
  (wire (pts (xy 199.39 64.77) (xy 196.85 64.77))
    (stroke (width 0) (type default))
    (uuid da13d00a-67c6-4d00-9bd3-ca7ea7581d83)
  )
  (wire (pts (xy 185.42 69.85) (xy 199.39 69.85))
    (stroke (width 0) (type default))
    (uuid e00bb6ce-3082-4177-9357-601248a72b8a)
  )
  (wire (pts (xy 129.54 73.025) (xy 138.43 73.025))
    (stroke (width 0) (type default))
    (uuid e0a54f1b-2cc0-452c-9a26-31c6c34e2314)
  )
  (wire (pts (xy 163.83 115.57) (xy 165.481 115.57))
    (stroke (width 0) (type default))
    (uuid e1f09ed9-c56d-477e-ae94-163814715b4e)
  )
  (wire (pts (xy 196.85 62.23) (xy 196.85 64.77))
    (stroke (width 0) (type default))
    (uuid e58b4658-eac0-4d29-85a3-d6c85ab0b4b5)
  )
  (wire (pts (xy 163.83 117.602) (xy 168.91 117.602))
    (stroke (width 0) (type default))
    (uuid e96fa97c-eb33-4d7a-90f1-d530b1b8f7d3)
  )
  (wire (pts (xy 129.54 116.205) (xy 138.43 116.205))
    (stroke (width 0) (type default))
    (uuid ea54c9aa-6b17-4d81-9215-590e8a65f84b)
  )
  (wire (pts (xy 129.54 139.065) (xy 138.43 139.065))
    (stroke (width 0) (type default))
    (uuid edc9007f-156d-4c23-9539-42764666a3e5)
  )
  (wire (pts (xy 224.79 68.58) (xy 224.79 69.85))
    (stroke (width 0) (type default))
    (uuid ee22a0e9-205f-4e80-bab6-ed60f626e566)
  )
  (wire (pts (xy 129.54 106.045) (xy 138.43 106.045))
    (stroke (width 0) (type default))
    (uuid ef52a4ad-f463-4c31-b1f2-f2ee41a76027)
  )
  (wire (pts (xy 168.91 122.936) (xy 165.481 122.936))
    (stroke (width 0) (type default))
    (uuid f01711c9-6e59-481d-9f2c-d019430265e9)
  )
  (wire (pts (xy 168.91 120.904) (xy 166.878 120.904))
    (stroke (width 0) (type default))
    (uuid f4465110-f898-4d37-849e-c27bdfe23579)
  )
  (wire (pts (xy 163.83 107.188) (xy 168.91 107.188))
    (stroke (width 0) (type default))
    (uuid ff73747e-1f24-49dc-8e4e-374e40b38f0a)
  )

  (text "*Power Nets are Global Labels" (at 194.818 80.137 0)
    (effects (font (size 1.27 1.27)) (justify left bottom))
    (uuid ddb8b1f2-042c-4bcf-8922-35346b2c1a3d)
  )

  (symbol (lib_id "Mechanical:MountingHole") (at 214.63 123.19 0) (unit 1)
    (in_bom yes) (on_board yes) (dnp no) (fields_autoplaced)
    (uuid 102e8a9f-e105-446b-9248-e73ece2e01ec)
    (property "Reference" "H4" (at 217.17 121.92 0)
      (effects (font (size 1.27 1.27)) (justify left))
    )
    (property "Value" "MountingHole" (at 217.17 124.46 0)
      (effects (font (size 1.27 1.27)) (justify left))
    )
    (property "Footprint" "MountingHole:MountingHole_3.2mm_M3" (at 214.63 123.19 0)
      (effects (font (size 1.27 1.27)) hide)
    )
    (property "Datasheet" "~" (at 214.63 123.19 0)
      (effects (font (size 1.27 1.27)) hide)
    )
    (instances
      (project "brewskiPCB"
        (path "/48a9dbf4-87b6-45a0-9b0c-210d88a1ee46"
          (reference "H4") (unit 1)
        )
      )
    )
  )

  (symbol (lib_id "Mechanical:MountingHole") (at 214.63 113.03 0) (unit 1)
    (in_bom yes) (on_board yes) (dnp no) (fields_autoplaced)
    (uuid 3539d01f-7edd-4f69-9580-64eba47c3781)
    (property "Reference" "H2" (at 217.17 111.76 0)
      (effects (font (size 1.27 1.27)) (justify left))
    )
    (property "Value" "MountingHole" (at 217.17 114.3 0)
      (effects (font (size 1.27 1.27)) (justify left))
    )
    (property "Footprint" "MountingHole:MountingHole_3.2mm_M3" (at 214.63 113.03 0)
      (effects (font (size 1.27 1.27)) hide)
    )
    (property "Datasheet" "~" (at 214.63 113.03 0)
      (effects (font (size 1.27 1.27)) hide)
    )
    (instances
      (project "brewskiPCB"
        (path "/48a9dbf4-87b6-45a0-9b0c-210d88a1ee46"
          (reference "H2") (unit 1)
        )
      )
    )
  )

  (symbol (lib_id "power:GND") (at 224.79 69.85 0) (unit 1)
    (in_bom yes) (on_board yes) (dnp no) (fields_autoplaced)
    (uuid 3666321e-9420-40c5-8a3d-20fe4110a318)
    (property "Reference" "#PWR036" (at 224.79 76.2 0)
      (effects (font (size 1.27 1.27)) hide)
    )
    (property "Value" "GND" (at 224.79 74.93 0)
      (effects (font (size 1.27 1.27)))
    )
    (property "Footprint" "" (at 224.79 69.85 0)
      (effects (font (size 1.27 1.27)) hide)
    )
    (property "Datasheet" "" (at 224.79 69.85 0)
      (effects (font (size 1.27 1.27)) hide)
    )
    (pin "1" (uuid 4479747e-1825-48e2-ace2-834326d2b220))
    (instances
      (project "brewskiPCB"
        (path "/48a9dbf4-87b6-45a0-9b0c-210d88a1ee46"
          (reference "#PWR036") (unit 1)
        )
      )
    )
  )

  (symbol (lib_id "Mechanical:MountingHole") (at 214.63 118.11 0) (unit 1)
    (in_bom yes) (on_board yes) (dnp no) (fields_autoplaced)
    (uuid 72d71142-1167-4e62-b799-c5cd659a0ce8)
    (property "Reference" "H3" (at 217.17 116.84 0)
      (effects (font (size 1.27 1.27)) (justify left))
    )
    (property "Value" "MountingHole" (at 217.17 119.38 0)
      (effects (font (size 1.27 1.27)) (justify left))
    )
    (property "Footprint" "MountingHole:MountingHole_3.2mm_M3" (at 214.63 118.11 0)
      (effects (font (size 1.27 1.27)) hide)
    )
    (property "Datasheet" "~" (at 214.63 118.11 0)
      (effects (font (size 1.27 1.27)) hide)
    )
    (instances
      (project "brewskiPCB"
        (path "/48a9dbf4-87b6-45a0-9b0c-210d88a1ee46"
          (reference "H3") (unit 1)
        )
      )
    )
  )

  (symbol (lib_id "power:+24V") (at 196.85 62.23 0) (unit 1)
    (in_bom yes) (on_board yes) (dnp no)
    (uuid 869fa6d4-a148-4de2-ab44-d130170a1a90)
    (property "Reference" "#PWR0120" (at 196.85 66.04 0)
      (effects (font (size 1.27 1.27)) hide)
    )
    (property "Value" "+24V" (at 196.85 57.277 0)
      (effects (font (size 1.27 1.27)))
    )
    (property "Footprint" "" (at 196.85 62.23 0)
      (effects (font (size 1.27 1.27)) hide)
    )
    (property "Datasheet" "" (at 196.85 62.23 0)
      (effects (font (size 1.27 1.27)) hide)
    )
    (pin "1" (uuid 7f970690-e3fd-4582-9700-70431c54b235))
    (instances
      (project "brewskiPCB"
        (path "/48a9dbf4-87b6-45a0-9b0c-210d88a1ee46"
          (reference "#PWR0120") (unit 1)
        )
      )
    )
  )

  (symbol (lib_id "power:+5V") (at 185.42 62.23 0) (unit 1)
    (in_bom yes) (on_board yes) (dnp no)
    (uuid ac12b041-4786-4a52-9863-c765e167b54e)
    (property "Reference" "#PWR03" (at 185.42 66.04 0)
      (effects (font (size 1.27 1.27)) hide)
    )
    (property "Value" "+5V" (at 185.293 57.785 0)
      (effects (font (size 1.27 1.27)))
    )
    (property "Footprint" "" (at 185.42 62.23 0)
      (effects (font (size 1.27 1.27)) hide)
    )
    (property "Datasheet" "" (at 185.42 62.23 0)
      (effects (font (size 1.27 1.27)) hide)
    )
    (pin "1" (uuid d891d130-3182-41ab-9546-b2c86048d1b4))
    (instances
      (project "brewskiPCB"
        (path "/48a9dbf4-87b6-45a0-9b0c-210d88a1ee46"
          (reference "#PWR03") (unit 1)
        )
      )
    )
  )

  (symbol (lib_id "Mechanical:MountingHole") (at 214.63 107.95 0) (unit 1)
    (in_bom yes) (on_board yes) (dnp no) (fields_autoplaced)
    (uuid c6b28a16-1137-4c2d-ab5b-ab5cd768a46f)
    (property "Reference" "H1" (at 217.17 106.68 0)
      (effects (font (size 1.27 1.27)) (justify left))
    )
    (property "Value" "MountingHole" (at 217.17 109.22 0)
      (effects (font (size 1.27 1.27)) (justify left))
    )
    (property "Footprint" "MountingHole:MountingHole_3.2mm_M3" (at 214.63 107.95 0)
      (effects (font (size 1.27 1.27)) hide)
    )
    (property "Datasheet" "~" (at 214.63 107.95 0)
      (effects (font (size 1.27 1.27)) hide)
    )
    (instances
      (project "brewskiPCB"
        (path "/48a9dbf4-87b6-45a0-9b0c-210d88a1ee46"
          (reference "H1") (unit 1)
        )
      )
    )
  )

  (symbol (lib_id "power:+12V") (at 190.5 62.23 0) (unit 1)
    (in_bom yes) (on_board yes) (dnp no)
    (uuid d392d705-24f1-4b59-ab6b-92591c733842)
    (property "Reference" "#PWR0121" (at 190.5 66.04 0)
      (effects (font (size 1.27 1.27)) hide)
    )
    (property "Value" "+12V" (at 190.5 57.658 0)
      (effects (font (size 1.27 1.27)))
    )
    (property "Footprint" "" (at 190.5 62.23 0)
      (effects (font (size 1.27 1.27)) hide)
    )
    (property "Datasheet" "" (at 190.5 62.23 0)
      (effects (font (size 1.27 1.27)) hide)
    )
    (pin "1" (uuid 2491af8a-fca1-4ede-8f2f-ff9bbda1aca6))
    (instances
      (project "brewskiPCB"
        (path "/48a9dbf4-87b6-45a0-9b0c-210d88a1ee46"
          (reference "#PWR0121") (unit 1)
        )
      )
    )
  )

  (symbol (lib_id "power:+3.3V") (at 179.07 62.23 0) (unit 1)
    (in_bom yes) (on_board yes) (dnp no) (fields_autoplaced)
    (uuid f8231bb8-492a-44b1-984d-9e524c255cc3)
    (property "Reference" "#PWR034" (at 179.07 66.04 0)
      (effects (font (size 1.27 1.27)) hide)
    )
    (property "Value" "+3.3V" (at 179.07 57.658 0)
      (effects (font (size 1.27 1.27)))
    )
    (property "Footprint" "" (at 179.07 62.23 0)
      (effects (font (size 1.27 1.27)) hide)
    )
    (property "Datasheet" "" (at 179.07 62.23 0)
      (effects (font (size 1.27 1.27)) hide)
    )
    (pin "1" (uuid fcda6f20-9168-4bcf-884f-3c57e09473da))
    (instances
      (project "brewskiPCB"
        (path "/48a9dbf4-87b6-45a0-9b0c-210d88a1ee46"
          (reference "#PWR034") (unit 1)
        )
      )
    )
  )

  (sheet (at 168.91 104.14) (size 20.32 38.1) (fields_autoplaced)
    (stroke (width 0.1524) (type solid))
    (fill (color 0 0 0 0.0000))
    (uuid 204d76e6-8a46-445d-8729-4fc23bcab73b)
    (property "Sheetname" "Temperature Sensing Subsystem" (at 168.91 103.4284 0)
      (effects (font (size 1.27 1.27)) (justify left bottom))
    )
    (property "Sheetfile" "tempSense.kicad_sch" (at 168.91 142.5706 0)
      (effects (font (size 1.27 1.27)) (justify left top))
    )
    (pin "ALERT4" output (at 168.91 140.208 180)
      (effects (font (size 1.27 1.27)) (justify left))
      (uuid f056001f-2e00-4a6a-b03b-dd22a287c2a6)
    )
    (pin "SDA4" bidirectional (at 168.91 136.144 180)
      (effects (font (size 1.27 1.27)) (justify left))
      (uuid 8b272e42-9813-4678-9d02-1452fff42252)
    )
    (pin "SCL2" input (at 168.91 122.936 180)
      (effects (font (size 1.27 1.27)) (justify left))
      (uuid 8e389787-bc99-4d1b-b432-166a24ada5b2)
    )
    (pin "SCL3" input (at 168.91 130.81 180)
      (effects (font (size 1.27 1.27)) (justify left))
      (uuid d5ed7c3e-4ebe-407d-a68b-cea2a2774a9f)
    )
    (pin "SCL4" input (at 168.91 138.176 180)
      (effects (font (size 1.27 1.27)) (justify left))
      (uuid f70fce62-a84d-466e-a28c-d536efe2bcd7)
    )
    (pin "SDA3" bidirectional (at 168.91 128.778 180)
      (effects (font (size 1.27 1.27)) (justify left))
      (uuid dcbdeb62-7a75-400a-8cf5-c47cda79c123)
    )
    (pin "ALERT3" output (at 168.91 132.842 180)
      (effects (font (size 1.27 1.27)) (justify left))
      (uuid 068fd58c-3822-45c1-bb0f-6161d9234bb7)
    )
    (pin "ALERT2" output (at 168.91 124.968 180)
      (effects (font (size 1.27 1.27)) (justify left))
      (uuid 541b2da1-678d-4f69-a685-50d0b718f2eb)
    )
    (pin "NTC2Out" output (at 168.91 109.728 180)
      (effects (font (size 1.27 1.27)) (justify left))
      (uuid 986b4d1f-5a89-48ae-bee9-042d41b30345)
    )
    (pin "NTC1Out" output (at 168.91 107.188 180)
      (effects (font (size 1.27 1.27)) (justify left))
      (uuid e0abe416-1b83-46ee-9089-aee8c05f0e66)
    )
    (pin "SDA2" bidirectional (at 168.91 120.904 180)
      (effects (font (size 1.27 1.27)) (justify left))
      (uuid a9539bf5-061d-4bc3-96d7-fedc67e7d00a)
    )
    (pin "SCL1" input (at 168.91 115.57 180)
      (effects (font (size 1.27 1.27)) (justify left))
      (uuid 14de4c3f-cbd7-4cfd-9221-d869ef6f14fb)
    )
    (pin "ALERT1" output (at 168.91 117.602 180)
      (effects (font (size 1.27 1.27)) (justify left))
      (uuid 62e8b9e1-3821-4429-927e-f9d5d6858bd3)
    )
    (pin "SDA1" bidirectional (at 168.91 113.665 180)
      (effects (font (size 1.27 1.27)) (justify left))
      (uuid 7d934229-684d-4b47-984f-ca6823991ab3)
    )
    (instances
      (project "brewskiPCB"
        (path "/48a9dbf4-87b6-45a0-9b0c-210d88a1ee46" (page "7"))
      )
    )
  )

  (sheet (at 109.22 81.28) (size 20.32 60.96) (fields_autoplaced)
    (stroke (width 0.1524) (type solid))
    (fill (color 0 0 0 0.0000))
    (uuid 36a06d26-0e14-433c-9ec3-4d7779121fdc)
    (property "Sheetname" "User Interface Subsystem" (at 109.22 80.5684 0)
      (effects (font (size 1.27 1.27)) (justify left bottom))
    )
    (property "Sheetfile" "userInterface.kicad_sch" (at 109.22 142.8246 0)
      (effects (font (size 1.27 1.27)) (justify left top))
    )
    (pin "CS" input (at 129.54 83.185 0)
      (effects (font (size 1.27 1.27)) (justify right))
      (uuid 75d5c434-8ac9-42c2-8ce5-1dd300ce6d53)
    )
    (pin "SDI(MOSI)" input (at 129.54 85.725 0)
      (effects (font (size 1.27 1.27)) (justify right))
      (uuid 9420df87-0422-497b-b26a-41ae188c5165)
    )
    (pin "SDO(MISO)" output (at 129.54 88.265 0)
      (effects (font (size 1.27 1.27)) (justify right))
      (uuid 7b03c844-b6ec-4cee-8dae-178321b57764)
    )
    (pin "LED" input (at 129.54 90.805 0)
      (effects (font (size 1.27 1.27)) (justify right))
      (uuid 20ec408b-ddd0-4a7c-a375-0482be297199)
    )
    (pin "DC{slash}RS" input (at 129.54 93.345 0)
      (effects (font (size 1.27 1.27)) (justify right))
      (uuid 821ffe5d-8167-4722-9a31-ca5a3f2a7933)
    )
    (pin "T_CS" input (at 129.54 95.885 0)
      (effects (font (size 1.27 1.27)) (justify right))
      (uuid 330a689b-a1d2-40d5-aa97-317a4a6ec9ae)
    )
    (pin "T_DO" output (at 129.54 98.425 0)
      (effects (font (size 1.27 1.27)) (justify right))
      (uuid ecb7d30a-a618-47a9-9a89-6d1653e10e45)
    )
    (pin "RESET" input (at 129.54 100.965 0)
      (effects (font (size 1.27 1.27)) (justify right))
      (uuid c3581017-f07d-4078-97fa-7404e714570c)
    )
    (pin "SCK" input (at 129.54 103.505 0)
      (effects (font (size 1.27 1.27)) (justify right))
      (uuid ce750911-9b59-4bca-ab64-47fb8212167e)
    )
    (pin "T_CLK" input (at 129.54 106.045 0)
      (effects (font (size 1.27 1.27)) (justify right))
      (uuid 6b7f5371-6c43-4739-9a98-d662f31847b0)
    )
    (pin "T_DIN" input (at 129.54 108.585 0)
      (effects (font (size 1.27 1.27)) (justify right))
      (uuid cc0de239-2a51-486f-bf36-92fdb50da8ad)
    )
    (pin "T_IRQ" output (at 129.54 111.125 0)
      (effects (font (size 1.27 1.27)) (justify right))
      (uuid cdf9c39d-bac2-4dda-b7c3-5ca4b2e9a63e)
    )
    (pin "ENC1B" output (at 129.54 118.745 0)
      (effects (font (size 1.27 1.27)) (justify right))
      (uuid 4ba6fe3b-482d-401f-a8bc-ff2b1caee584)
    )
    (pin "ENC1A" output (at 129.54 116.205 0)
      (effects (font (size 1.27 1.27)) (justify right))
      (uuid 3670562b-2da9-4180-a49a-6494b4d84ba9)
    )
    (pin "ENC2B" output (at 129.54 123.825 0)
      (effects (font (size 1.27 1.27)) (justify right))
      (uuid 1cd9ffcd-5527-4493-b27a-12a0754b80e7)
    )
    (pin "ENC2A" output (at 129.54 121.285 0)
      (effects (font (size 1.27 1.27)) (justify right))
      (uuid 20afb8a6-9260-4533-b9b9-713b15a68d13)
    )
    (pin "SW_0" output (at 129.54 126.365 0)
      (effects (font (size 1.27 1.27)) (justify right))
      (uuid 98e5dacc-ce6e-454f-bc8c-38ad7c78082d)
    )
    (pin "SW_2" output (at 129.54 131.445 0)
      (effects (font (size 1.27 1.27)) (justify right))
      (uuid d6c288de-61f4-4a2b-becd-e0bf2b44c82e)
    )
    (pin "SW_3" output (at 129.54 133.985 0)
      (effects (font (size 1.27 1.27)) (justify right))
      (uuid cc210f2e-530c-48a6-9d8f-a93094d93c4d)
    )
    (pin "SW_1" output (at 129.54 128.905 0)
      (effects (font (size 1.27 1.27)) (justify right))
      (uuid da381e50-b24a-4f14-b20e-b869735d4d9c)
    )
    (pin "SW_4" output (at 129.54 136.525 0)
      (effects (font (size 1.27 1.27)) (justify right))
      (uuid f44c80c8-eb58-4796-99aa-8caf49a2cbee)
    )
    (pin "SW_5" output (at 129.54 139.065 0)
      (effects (font (size 1.27 1.27)) (justify right))
      (uuid ca567f33-ccb2-4efb-b9aa-5e348ee51f1f)
    )
    (instances
      (project "brewskiPCB"
        (path "/48a9dbf4-87b6-45a0-9b0c-210d88a1ee46" (page "6"))
      )
    )
  )

  (sheet (at 138.43 58.42) (size 25.4 83.82) (fields_autoplaced)
    (stroke (width 0.1524) (type solid))
    (fill (color 0 0 0 0.0000))
    (uuid 3e41203b-e413-4b5c-9ae3-8c379ddaa30d)
    (property "Sheetname" "Central Control Subsystem" (at 138.43 57.7084 0)
      (effects (font (size 1.27 1.27)) (justify left bottom))
    )
    (property "Sheetfile" "centralControl.kicad_sch" (at 138.43 143.0786 0)
      (effects (font (size 1.27 1.27)) (justify left top))
    )
    (property "Field2" "" (at 138.43 58.42 0)
      (effects (font (size 1.27 1.27)) hide)
    )
    (pin "SPI2_NSS" output (at 138.43 95.885 180)
      (effects (font (size 1.27 1.27)) (justify left))
      (uuid e5cebf8b-37b7-4ce2-b37a-4d5b6fe5e6dd)
    )
    (pin "SPI2_SCK" output (at 138.43 106.045 180)
      (effects (font (size 1.27 1.27)) (justify left))
      (uuid 7cc1b0af-960b-471d-af4b-ee7a10df34e4)
    )
    (pin "I2C1_SDA" bidirectional (at 163.83 113.665 0)
      (effects (font (size 1.27 1.27)) (justify right))
      (uuid bc1579ae-d0d7-479b-a039-12c2cb89f268)
    )
    (pin "I2C1_SCL" output (at 163.83 115.57 0)
      (effects (font (size 1.27 1.27)) (justify right))
      (uuid 01ede8f7-ee00-467e-a5a9-6f93598ecb0e)
    )
    (pin "LED" output (at 138.43 90.805 180)
      (effects (font (size 1.27 1.27)) (justify left))
      (uuid e377d0bf-78be-43e9-b74b-d14596bd8110)
    )
    (pin "T_IRQ" input (at 138.43 111.125 180)
      (effects (font (size 1.27 1.27)) (justify left))
      (uuid 20c37da1-6244-48d0-a1c9-0ebc5dc0e2cd)
    )
    (pin "RESET" output (at 138.43 100.965 180)
      (effects (font (size 1.27 1.27)) (justify left))
      (uuid a7731ea6-35af-49f7-949b-02e3bdfe7201)
    )
    (pin "DC{slash}RS" output (at 138.43 93.345 180)
      (effects (font (size 1.27 1.27)) (justify left))
      (uuid 45b1b08c-5a91-45b1-9e07-67723886a084)
    )
    (pin "ADC1_IN0" input (at 163.83 107.188 0)
      (effects (font (size 1.27 1.27)) (justify right))
      (uuid c45e5e35-0465-42ce-8874-d4a5ac495f78)
    )
    (pin "TIM1_CH1" output (at 163.83 90.805 0)
      (effects (font (size 1.27 1.27)) (justify right))
      (uuid f2b19896-4f82-4287-a439-e96ee153dd2c)
    )
    (pin "ADC1_IN1" input (at 163.83 109.728 0)
      (effects (font (size 1.27 1.27)) (justify right))
      (uuid eaec0ee8-f624-47d3-8664-af22ad43baa2)
    )
    (pin "SPI1_MOSI" output (at 138.43 85.725 180)
      (effects (font (size 1.27 1.27)) (justify left))
      (uuid 13d9f23d-09a5-4d98-acef-b39f531859a6)
    )
    (pin "SPI1_MISO" input (at 138.43 88.265 180)
      (effects (font (size 1.27 1.27)) (justify left))
      (uuid bbe21584-011e-4da5-9ee2-f79c0d5221fa)
    )
    (pin "SPI1_SCK" output (at 138.43 103.505 180)
      (effects (font (size 1.27 1.27)) (justify left))
      (uuid 91f94223-76a3-4bc4-aa6c-1cf76a4d7c9b)
    )
    (pin "SPI1_NSS" output (at 138.43 83.185 180)
      (effects (font (size 1.27 1.27)) (justify left))
      (uuid eeb06ccf-9e6a-49fa-91d0-0bb8c9e45b31)
    )
    (pin "SPI2_MISO" input (at 138.43 98.425 180)
      (effects (font (size 1.27 1.27)) (justify left))
      (uuid 3805dc6c-efb5-4d8e-997c-db8e5396a874)
    )
    (pin "SPI2_MOSI" output (at 138.43 108.585 180)
      (effects (font (size 1.27 1.27)) (justify left))
      (uuid 50a3d8f1-7130-49e3-949e-37a6418438fb)
    )
    (pin "ALERT2" input (at 163.83 124.968 0)
      (effects (font (size 1.27 1.27)) (justify right))
      (uuid 56410af0-3297-4f4b-b73e-b744d981aea4)
    )
    (pin "ALERT3" input (at 163.83 132.842 0)
      (effects (font (size 1.27 1.27)) (justify right))
      (uuid 3f0721db-4b87-47c1-b29d-18b2a4511d88)
    )
    (pin "ALERT1" input (at 163.83 117.602 0)
      (effects (font (size 1.27 1.27)) (justify right))
      (uuid 54a3b13c-b79f-4131-9ee5-34e04ae264f8)
    )
    (pin "ALERT4" input (at 163.83 140.208 0)
      (effects (font (size 1.27 1.27)) (justify right))
      (uuid e454fa68-d581-4903-8722-ab7ff22bf520)
    )
    (pin "SW4" input (at 138.43 136.525 180)
      (effects (font (size 1.27 1.27)) (justify left))
      (uuid 65e62e25-9a48-49b9-bd80-61374fdc8907)
    )
    (pin "SW1" input (at 138.43 128.905 180)
      (effects (font (size 1.27 1.27)) (justify left))
      (uuid 72a5091d-0aaa-4dae-ac55-e92826bf777e)
    )
    (pin "SW2" input (at 138.43 131.445 180)
      (effects (font (size 1.27 1.27)) (justify left))
      (uuid 34b4f558-ec0e-4030-8766-bfdd67526eb6)
    )
    (pin "SW5" input (at 138.43 139.065 180)
      (effects (font (size 1.27 1.27)) (justify left))
      (uuid 8200da8b-d6a1-40c8-ac07-bf8731928ff2)
    )
    (pin "SW3" input (at 138.43 133.985 180)
      (effects (font (size 1.27 1.27)) (justify left))
      (uuid 2fc277fd-8139-4efa-909f-2c51535294d1)
    )
    (pin "Heater1" output (at 138.43 69.215 180)
      (effects (font (size 1.27 1.27)) (justify left))
      (uuid 011566f6-ac3e-4f2b-9008-c2ef0611257d)
    )
    (pin "Heater2" output (at 138.43 73.025 180)
      (effects (font (size 1.27 1.27)) (justify left))
      (uuid e9a4f8c9-0cbf-4c42-8ef4-eb6f855a5be6)
    )
    (pin "ENC2A" input (at 138.43 121.285 180)
      (effects (font (size 1.27 1.27)) (justify left))
      (uuid 37143ce5-dd50-4049-9b40-5bdad3aabb0c)
    )
    (pin "ENC1A" input (at 138.43 116.205 180)
      (effects (font (size 1.27 1.27)) (justify left))
      (uuid fe12f6fc-fd04-47f9-9ef0-3baeedf3218a)
    )
    (pin "SW0" input (at 138.43 126.365 180)
      (effects (font (size 1.27 1.27)) (justify left))
      (uuid 3b982ba3-6bb4-49b8-9372-91f7a2cfb56b)
    )
    (pin "ENC1B" input (at 138.43 118.745 180)
      (effects (font (size 1.27 1.27)) (justify left))
      (uuid 69fc09fa-f2bb-47ca-859c-6568b7131fa6)
    )
    (pin "ENC2B" input (at 138.43 123.825 180)
      (effects (font (size 1.27 1.27)) (justify left))
      (uuid 3e34f504-fa3e-44ee-a729-6d710ce2c78b)
    )
    (pin "EN1" output (at 163.83 88.265 0)
      (effects (font (size 1.27 1.27)) (justify right))
      (uuid a15a79cc-793e-487b-a6d8-20b45e43a23a)
    )
    (pin "EN2" output (at 163.83 95.885 0)
      (effects (font (size 1.27 1.27)) (justify right))
      (uuid b0f29a87-7bf5-4fbf-b760-5836024036b2)
    )
    (pin "TIM1_CH4" output (at 163.83 93.345 0)
      (effects (font (size 1.27 1.27)) (justify right))
      (uuid edcfd32d-a980-44fb-a1fe-9c418dcc9828)
    )
    (instances
      (project "brewskiPCB"
        (path "/48a9dbf4-87b6-45a0-9b0c-210d88a1ee46" (page "2"))
      )
    )
  )

  (sheet (at 168.91 85.09) (size 20.32 13.97) (fields_autoplaced)
    (stroke (width 0.1524) (type solid))
    (fill (color 0 0 0 0.0000))
    (uuid 47d05fdd-0cc1-4356-b49a-c0dfd6885501)
    (property "Sheetname" "Cooling Subsystem" (at 168.91 84.3784 0)
      (effects (font (size 1.27 1.27)) (justify left bottom))
    )
    (property "Sheetfile" "cooling.kicad_sch" (at 168.91 99.6446 0)
      (effects (font (size 1.27 1.27)) (justify left top))
    )
    (pin "EN1" input (at 168.91 88.265 180)
      (effects (font (size 1.27 1.27)) (justify left))
      (uuid 155f72b8-2008-4557-a23f-82e9839d19e6)
    )
    (pin "PWM1" input (at 168.91 90.805 180)
      (effects (font (size 1.27 1.27)) (justify left))
      (uuid e4452148-6aa7-4341-946f-a5f96aa92867)
    )
    (pin "PWM2" input (at 168.91 93.345 180)
      (effects (font (size 1.27 1.27)) (justify left))
      (uuid c955c4ce-6253-4045-b7bf-8413a4128868)
    )
    (pin "EN2" input (at 168.91 95.885 180)
      (effects (font (size 1.27 1.27)) (justify left))
      (uuid 6874ebe0-3962-4882-9c42-9c3d90453dd8)
    )
    (instances
      (project "brewskiPCB"
        (path "/48a9dbf4-87b6-45a0-9b0c-210d88a1ee46" (page "4"))
      )
    )
  )

  (sheet (at 199.39 62.23) (size 20.32 12.7) (fields_autoplaced)
    (stroke (width 0.1524) (type solid))
    (fill (color 0 0 0 0.0000))
    (uuid 493e0ec5-7d10-4a9f-9fcb-0b78b8cdab98)
    (property "Sheetname" "Power Subsystem" (at 199.39 61.5184 0)
      (effects (font (size 1.27 1.27)) (justify left bottom))
    )
    (property "Sheetfile" "power.kicad_sch" (at 199.39 75.0066 0)
      (effects (font (size 1.27 1.27)) (justify left top))
    )
    (pin "5v" output (at 199.39 69.85 180)
      (effects (font (size 1.27 1.27)) (justify left))
      (uuid 60d1c1e9-d7bb-4a56-b0de-2b7af8d41700)
    )
    (pin "GND" output (at 219.71 68.58 0)
      (effects (font (size 1.27 1.27)) (justify right))
      (uuid cdfe72ca-5afc-4ec8-9194-e266af293e21)
    )
    (pin "24V" output (at 199.39 64.77 180)
      (effects (font (size 1.27 1.27)) (justify left))
      (uuid 6c158b02-c35f-47ec-bc64-f04e3011396c)
    )
    (pin "12V" output (at 199.39 67.31 180)
      (effects (font (size 1.27 1.27)) (justify left))
      (uuid 3124585e-8a4e-41cd-b5b7-51d9929f9903)
    )
    (pin "3.3V" output (at 199.39 72.39 180)
      (effects (font (size 1.27 1.27)) (justify left))
      (uuid 1dfb4c69-d529-4549-837e-07bb7c8388e8)
    )
    (instances
      (project "brewskiPCB"
        (path "/48a9dbf4-87b6-45a0-9b0c-210d88a1ee46" (page "5"))
      )
    )
  )

  (sheet (at 109.22 66.04) (size 20.32 10.16) (fields_autoplaced)
    (stroke (width 0.1524) (type solid))
    (fill (color 0 0 0 0.0000))
    (uuid b84d9887-e20c-413a-9eb9-6a8fa099c281)
    (property "Sheetname" "Heating Subsystem" (at 109.22 65.3284 0)
      (effects (font (size 1.27 1.27)) (justify left bottom))
    )
    (property "Sheetfile" "heating.kicad_sch" (at 109.22 76.1496 0)
      (effects (font (size 1.27 1.27)) (justify left top))
    )
    (pin "Heater1" input (at 129.54 73.025 0)
      (effects (font (size 1.27 1.27)) (justify right))
      (uuid 8535b8a8-5112-4764-8f1e-0b71ac14957f)
    )
    (pin "Heater2" input (at 129.54 69.215 0)
      (effects (font (size 1.27 1.27)) (justify right))
      (uuid 6de9e722-1569-4d8b-b46d-418ed2b8e4c2)
    )
    (instances
      (project "brewskiPCB"
        (path "/48a9dbf4-87b6-45a0-9b0c-210d88a1ee46" (page "3"))
      )
    )
  )

  (sheet_instances
    (path "/" (page "1"))
  )
)
