PCBNEW-LibModule-V1  2024-02-19 22:27:14
# encoding utf-8
Units mm
$INDEX
SS90000003
$EndINDEX
$MODULE SS90000003
Po 0 0 0 15 65d3d5c2 00000000 ~~
Li SS90000003
Cd SS-90000-003-2
Kw Connector
Sc 0
At STD
AR 
Op 0 0 0
T0 3.170 7.71 1.27 1.27 0 0.254 N V 21 N "J**"
T1 3.170 7.71 1.27 1.27 0 0.254 N I 21 N "SS90000003"
DS -3.435 -1.34 9.775 -1.34 0.1 24
DS 9.775 -1.34 9.775 16.76 0.1 24
DS 9.775 16.76 -3.435 16.76 0.1 24
DS -3.435 16.76 -3.435 -1.34 0.1 24
DS -4.535 -2.34 10.875 -2.34 0.1 24
DS 10.875 -2.34 10.875 17.76 0.1 24
DS 10.875 17.76 -4.535 17.76 0.1 24
DS -4.535 17.76 -4.535 -2.34 0.1 24
DS -3.435 7.39 -3.43 -1.34 0.2 21
DS -3.43 -1.34 9.775 -1.34 0.2 21
DS 9.775 -1.34 9.775 7.39 0.2 21
DS -3.43 10.39 -3.43 16.76 0.2 21
DS -3.43 16.76 9.775 16.76 0.2 21
DS 9.775 16.76 9.775 10.39 0.2 21
DS 0 -1.8 0 -1.8 0.1 21
DS 0 -1.9 0 -1.9 0.1 21
DA -6.9388939039072E-17 -1.85 0.000 -1.8 -1800 0.1 21
DA -6.9388939039072E-17 -1.85 0.000 -1.9 -1800 0.1 21
$PAD
Po 0.000 -0
Sh "1" R 1.400 1.400 0 0 900
Dr 0.9 0 0
At STD N 00E0FFFF
Ne 0 ""
$EndPAD
$PAD
Po 1.270 2.54
Sh "2" C 1.400 1.400 0 0 900
Dr 0.9 0 0
At STD N 00E0FFFF
Ne 0 ""
$EndPAD
$PAD
Po 2.540 -0
Sh "3" C 1.400 1.400 0 0 900
Dr 0.9 0 0
At STD N 00E0FFFF
Ne 0 ""
$EndPAD
$PAD
Po 3.810 2.54
Sh "4" C 1.400 1.400 0 0 900
Dr 0.9 0 0
At STD N 00E0FFFF
Ne 0 ""
$EndPAD
$PAD
Po 5.080 -0
Sh "5" C 1.400 1.400 0 0 900
Dr 0.9 0 0
At STD N 00E0FFFF
Ne 0 ""
$EndPAD
$PAD
Po 6.350 2.54
Sh "6" C 1.400 1.400 0 0 900
Dr 0.9 0 0
At STD N 00E0FFFF
Ne 0 ""
$EndPAD
$PAD
Po -1.910 8.89
Sh "MH1" C 1.625 1.625 0 0 900
Dr 3.25 0 0
At STD N 00E0FFFF
Ne 0 ""
$EndPAD
$PAD
Po 8.250 8.89
Sh "MH2" C 1.625 1.625 0 0 900
Dr 3.25 0 0
At STD N 00E0FFFF
Ne 0 ""
$EndPAD
$EndMODULE SS90000003
$EndLIBRARY
