PCBNEW-LibModule-V1  2024-02-19 22:21:11
# encoding utf-8
Units mm
$INDEX
SON50P200X200X80-9N
$EndINDEX
$MODULE SON50P200X200X80-9N
Po 0 0 0 15 65d3d457 00000000 ~~
Li SON50P200X200X80-9N
Cd WSON-8-
Kw Integrated Circuit
Sc 0
At SMD
AR 
Op 0 0 0
T0 0 0 1.27 1.27 0 0.254 N V 21 N "IC**"
T1 0 0 1.27 1.27 0 0.254 N I 21 N "SON50P200X200X80-9N"
DS -1.625 -1.3 1.625 -1.3 0.05 24
DS 1.625 -1.3 1.625 1.3 0.05 24
DS 1.625 1.3 -1.625 1.3 0.05 24
DS -1.625 1.3 -1.625 -1.3 0.05 24
DS -1 -1 1 -1 0.1 24
DS 1 -1 1 1 0.1 24
DS 1 1 -1 1 0.1 24
DS -1 1 -1 -1 0.1 24
DS -1 -0.5 -0.5 -1 0.1 24
DC -1.4 -1.4 -1.275 -1.4 0.254 21
$PAD
Po -1.05 -0.75
Sh "1" R 0.3 0.7 0 0 900
At SMD N 00888000
Ne 0 ""
$EndPAD
$PAD
Po -1.05 -0.25
Sh "2" R 0.3 0.7 0 0 900
At SMD N 00888000
Ne 0 ""
$EndPAD
$PAD
Po -1.05 0.25
Sh "3" R 0.3 0.7 0 0 900
At SMD N 00888000
Ne 0 ""
$EndPAD
$PAD
Po -1.05 0.75
Sh "4" R 0.3 0.7 0 0 900
At SMD N 00888000
Ne 0 ""
$EndPAD
$PAD
Po 1.05 0.75
Sh "5" R 0.3 0.7 0 0 900
At SMD N 00888000
Ne 0 ""
$EndPAD
$PAD
Po 1.05 0.25
Sh "6" R 0.3 0.7 0 0 900
At SMD N 00888000
Ne 0 ""
$EndPAD
$PAD
Po 1.05 -0.25
Sh "7" R 0.3 0.7 0 0 900
At SMD N 00888000
Ne 0 ""
$EndPAD
$PAD
Po 1.05 -0.75
Sh "8" R 0.3 0.7 0 0 900
At SMD N 00888000
Ne 0 ""
$EndPAD
$PAD
Po 0 0
Sh "9" R 1 1.7 0 0 0
At SMD N 00888000
Ne 0 ""
$EndPAD
$EndMODULE SON50P200X200X80-9N
$EndLIBRARY
